{"text_format":"1","workbook":"xlsx","n_sheets":6,"sheets":["start","input","graphic","minitab beispiel","calculation","info"],"not_rendered":{"charts":14,"images":3,"macros":1,"external_links":0,"defined_names":18,"comments":0,"pivot_tables":0},"unopened":[],"bounds":{"document_bytes":16777216,"sheet_cells":100000,"rows_first":2000,"rows_last":500,"rows_between":2000,"halvings":0,"cell_chars":16384,"cell_head_chars":4096},"cells_cut":0,"cells_raw":0,"read":"whole","date_system":"1900"}

{"sheet":"start","index":0,"n_rows":36,"n_cols":2,"rows_kept":36,"cut":false,"hidden":true,"merged":[]}
[]
[null,"Das Makro ist momentan nicht aktiviert"]
[null,"Bitte Aktivieren Sie das Makro"]
[null,"Ohne Makro funktioniert diese Datei nicht"]
[]
[null,"roland.schnurr@sixsigmablackbelt.de"]
[]
[null,"https://www.sixsigmablackbelt.de"]
[]
[null,"Abhängig von den Einstellungen in Microsoft Office kann es sein, dass Microsoft Dateien aus dem Internet "]
[null,"mit der Endung .xlsb grundsätzlich beim Öffnen mit folgendem Warnhinweis versieht."]
[]
[]
[]
[]
[]
[]
[]
[]
[]
[]
[]
[null,"Alle Dateien auf dieser Website sind grundsätzlich mit virustotal auf Freiheit von Viren überprüft."]
[null,"Virustotal prüft mit den 63 gängigsten Virenprogrammen auf Virenfreiheit."]
[]
[null,"Möchten Sie mit unseren Dateien arbeiten und Microsoft gibt Ihnen obigen Hinweis, gehen Sie wie folgt vor:"]
[]
[null,{"$f":"\"- Speichern Sie die Datei\"","v":"- Speichern Sie die Datei"}]
[null,{"$f":"\"- Wählen Sie den Speicherort (im Standardordner „downloads“).\"","v":"- Wählen Sie den Speicherort (im Standardordner „downloads“)."}]
[null,{"$f":"\"- Datei auswählen\"","v":"- Datei auswählen"}]
[null,{"$f":"\"- rechte Maustaste\"","v":"- rechte Maustaste"}]
[null,{"$f":"\"- Ein Fenster erscheint. Der letzte Punkt in diesem Fenster ist „Eigenschaften“\"","v":"- Ein Fenster erscheint. Der letzte Punkt in diesem Fenster ist „Eigenschaften“"}]
[null,{"$f":"\"- Wählen Sie diesen Punkt aus\"","v":"- Wählen Sie diesen Punkt aus"}]
[null,{"$f":"\"- Setzen Sie in dem erscheinenden Fenster den Haken bei „Zulassen“ (siehe unten)\"","v":"- Setzen Sie in dem erscheinenden Fenster den Haken bei „Zulassen“ (siehe unten)"}]
[null,{"$f":"\"- Klicken Sie auf „Übernehmen“ und dann auf „OK“\"","v":"- Klicken Sie auf „Übernehmen“ und dann auf „OK“"}]
[null,{"$f":"\"- Danach können Sie die Datei öffnen und mit ihr arbeiten.\"","v":"- Danach können Sie die Datei öffnen und mit ihr arbeiten."}]

{"sheet":"input","index":1,"n_rows":56,"n_cols":15,"rows_kept":56,"cut":false,"hidden":false,"merged":[[2,2,2,4],[2,9,2,11],[3,2,3,4],[3,5,3,8],[3,9,3,11],[2,5,2,8],[4,10,4,11],[5,10,5,11],[13,9,13,10],[9,3,9,4],[4,6,4,7],[5,6,5,7],[6,6,6,7],[7,6,7,7],[4,3,4,4],[5,3,5,4],[6,3,6,4],[7,3,7,4],[8,3,8,4],[12,9,12,11],[34,2,34,5],[14,5,14,7],[13,5,13,7],[12,5,12,7],[15,5,15,7],[12,2,12,4],[32,2,32,5],[17,4,17,5],[33,2,33,5],[14,9,14,10],[15,9,15,10],[15,2,15,3],[14,2,14,3],[17,7,17,8],[17,10,17,11],[44,2,44,8],[45,2,45,8],[46,2,46,8],[38,2,38,5],[35,2,35,5],[36,2,36,5],[37,2,37,5],[39,2,39,5],[43,2,43,9],[42,2,42,9]]}
[]
[]
[null,null,null,null,null,"Messprozessanaylse \nVerfahren 2 Anova (Basis Bosch Heft 10)"]
[null,null,"Messmittel",null,null,"Merkmal",null,null,null,"Normal",null,null,null,null,"Diese Version ist eingeschränkt"]
[null,null,"Bez.:",null,null,"Objekt:",null,null,null,"Bez.:",null,null,null,null,"- Es sind nur 3 Teile berechenbar"]
[null,null,"Nummer:",null,null,"Nummer:",null,null,null,"Nummer",null,null,null,null,{"$f":"\"- Die Datei ist nur als .xlsm speicherbar\"","v":"- Die Datei ist nur als .xlsm speicherbar"}]
[null,null,"Auflösung:",null,null,"Zeichnung:",null,null,null,"Nennmaß:"]
[null,null,"Hersteller:",null,null,"Einheit:",null,null,null,"Einheit:",null,null,null,null,"Die Version für 10 zu berechnende Teile (M0461) können Sie unter untenstehendem Link erwerben"]
[null,null,"Akt. Dat.: ","2015-01-04",null,"OGW",4,null,null,null,null,null,null,null,{"$f":"HYPERLINK(\"https://www.sixsigmablackbelt.de/preisvergleich/\",\"Preise und Bestellung\")","v":"Preise und Bestellung"}]
[null,null,"Bearbeiter:",null,null,"UGW",-4,"Toleranz:",{"$f":"G9-G10","v":8},null,null,null,null,null,"Fragen gerne an:"]
[null,null,"Prüferverfahren Beschreibung: Alle blauen Zellen können verändert werden",null,null,null,null,null,null,null,null,null,null,null,{"$f":"HYPERLINK(\"mailto:roland.schnurr@sixsigmablackbelt.de\",\"roland.schnurr@sixsigmablackbelt.de\")","v":"roland.schnurr@sixsigmablackbelt.de"}]
[]
[null,null,"Ergebnis aus MSA Verfahren 1",null,null,"Anzahl der Teile n",null,null,{"$f":"COUNT(D20:D29)","v":3},"Messsystem ist "]
[null,null,null,null,null,"Anzahl der Prüfer k",null,null,{"$f":"COUNT(D20)+COUNT(G20)+COUNT(J20)","v":3},"fähig bis",null,0.1]
[null,null,"Protokoll Nr.",null,null,"Anz. Prüfungen je Prüfer / Objekt r",null,null,{"$f":"COUNT(D20:F20)","v":3},"akzeptabel bis",null,0.3]
[null,null,"Das Prüfmittel ",null,"ist fähig","Bedingung k*n*r > 30",null,null,{"$f":"IF((AnzahlTeile*AnzahlPruefer*AnzahlMessungen)>=30,\"erfüllt\",\"nicht erfüllt\")","v":"nicht erfüllt"},"nicht akzeptabel ab",null,{"$f":"L15","v":0.3}]
[]
[null,null,null,"Prüfer j=1","Gerber",null,"Prüfer j=2","Bohnert",null," Prüfer j=3","Zimmer"]
[null,null,"Teil Nr.","m=1","m=2","m=3","m=1","m=2","m=3","m=1","m=2","m=3"]
[null,null,"i=1",0.28999999999999998,0.41,0.64,0.08,0.25,7.0000000000000007E-2,0.04,-0.11,-0.15]
[null,null,"i=2",-0.56000000000000005,-0.68,-0.57999999999999996,-0.47,-1.22,-0.68,-1.38,-1.1299999999999999,-0.96]
[null,null,"i=3",1.34,1.17,1.27,1.19,0.94,1.34,0.88,1.0900000000000001,0.67]
[null,null,"i=4"]
[null,null,"i=5"]
[null,null,"i=6"]
[null,null,"i=7"]
[null,null,"i=8"]
[null,null,"i=9"]
[null,null,"i=10"]
[]
[]
[null,null,null,null,null,null,null,"Standard- abweichung","Streubreite",null,"Anteil an \nGesamt-\nstreubreite","Anteil  der Toleranz"]
[null,null,"Einflussgrößen",null,null,null,null,"SD","SV",null,"%SV","%T"]
[null,null,"Teile (Part Variation) Teilestreuung",null,null,null,"PV",{"$f":"calculation!G33","v":0.97343606763761226},{"$f":"calculation!H33","v":5.8406164058256733},"%PV",{"$f":"calculation!J33","v":0.95621802037762205},{"$f":"calculation!K33","v":0.73007705072820916}]
[null,null,"Prüfer (Appraiser Variation) Vergleichspräzision",null,null,null,"AV",{"$f":"calculation!G34","v":0.23507288073969576},{"$f":"calculation!H34","v":1.4104372844381745},"%AV",{"$f":"calculation!J34","v":0.23091493333597896},{"$f":"calculation!K34","v":0.17630466055477181}]
[null,null,"Wechselwirkung (Interaction)",null,null,null,"INT",{"$f":"calculation!G35","v":0},{"$f":"calculation!H35","v":0},"%IA",{"$f":"calculation!J35","v":0},{"$f":"calculation!K35","v":0}]
[null,null,"Messeinrichtung (Equipment Variation)\nWiederholpräzision",null,null,null,"EV",{"$f":"calculation!G36","v":0.18303005217723123},{"$f":"calculation!H36","v":1.0981803130633874},"%EV",{"$f":"calculation!J36","v":0.17979263351856772},{"$f":"calculation!K36","v":0.13727253913292342}]
[null,null,"Prüfsystemstreuung",null,null,null,"GRR",{"$f":"calculation!G37","v":0.29792492218553857},{"$f":"calculation!H37","v":1.7875495331132314},"%GRR",{"$f":"calculation!J37","v":0.29265525367760203},{"$f":"calculation!K37","v":0.22344369163915392}]
[null,null,"Gesamtstreuung (Total Variation)",null,null,null,"TV",{"$f":"calculation!G38","v":1.0180064032397032},{"$f":"calculation!H38","v":6.1080384194382189},"%TV",{"$f":"calculation!J38","v":1},{"$f":"calculation!K38","v":0.76350480242977736}]
[null,null,"Anzahl unterscheidbarer Klassen (min 5)",null,null,null,"ndc",{"$f":"calculation!G39","v":4}]
[]
[]
[null,null,{"$f":"IF(L38<L14,\"Das Messsystem ist fähig\",IF(L38>L15,\"Das Messsystem ist nicht fähig\",\"Das Messsystem ist bedingt fähig\"))","v":"Das Messsystem ist bedingt fähig"}]
[null,null,{"$f":"IF(H40<5,\"(ndc) Der Messprozess ist nicht in der Lage genügend viele Teile unterscheidbar zu messen\",\"(ndc) Der Messprozess ist  in der Lage genügend viele Teile unterscheidbar zu messen\")","v":"(ndc) Der Messprozess ist nicht in der Lage genügend viele Teile unterscheidbar zu messen"}]
[null,null,{"$f":"IF(L35=0,\"Der Einfluss durch den Prüfer ist nicht signifikant\",\"Der Einfluss durch den Prüfer ist  signifikant\")","v":"Der Einfluss durch den Prüfer ist  signifikant"}]
[null,null,{"$f":"IF(L34=0,\"Der Einfluss durch die einzelnen Teile ist nicht signifikant\",\"Der Einfluss durch die einzelnen Teile ist signifikant\")","v":"Der Einfluss durch die einzelnen Teile ist signifikant"}]
[null,null,{"$f":"IF(L36=0,\"Der Einfluss durch die Wechselwirkung Prüfer und Teil ist nicht signifikant\",\"Der Einfluss durch die Wechselwirkung Prüfer und Teil ist  signifikant\")","v":"Der Einfluss durch die Wechselwirkung Prüfer und Teil ist nicht signifikant"}]
[]
[]
[]
[]
[null,null,null,null,null,null,null,null,null,null,null,{"$f":"0","v":0}]
[null,null,null,null,null,null,null,null,null,null,null,{"$f":"L52+L14","v":0.1}]
[null,null,null,null,null,null,null,null,null,null,null,{"$f":"L15-L14","v":0.19999999999999998}]
[null,null,null,null,null,null,null,null,null,null,null,100]
[null,null,"Datum:"," ________",null,"Unterschrift:"," __________________",null,null,"Abteilung:"," __________________"]

{"sheet":"graphic","index":2,"n_rows":29,"n_cols":8,"rows_kept":29,"cut":false,"hidden":false,"merged":[[15,1,15,9],[16,4,16,6],[16,1,16,3],[27,1,27,9],[28,1,28,3],[28,4,28,6],[16,7,16,8],[28,7,28,8]]}
[]
[]
[]
[]
[]
[]
[]
[]
[]
[]
[]
[]
[null,"Sekundärachse in obigem Diagramm muss manuell angepaßt werden"]
[null,"Einteilung Sekundärachse muß gleich Einteilung Primärachse sein"]
[]
[null,"X Quer Karte"]
[null,{"$f":"input!E18","v":"Gerber"},null,null,{"$f":"input!H18","v":"Bohnert"},null,null,{"$f":"input!K18","v":"Zimmer"}]
[]
[]
[]
[]
[]
[]
[]
[]
[]
[]
[null,"R Karte"]
[null,{"$f":"B17","v":"Gerber"},null,null,{"$f":"E17","v":"Bohnert"},null,null,{"$f":"H17","v":"Zimmer"}]

{"sheet":"minitab beispiel","index":3,"n_rows":0,"n_cols":0,"rows_kept":0,"cut":false,"hidden":false,"merged":[]}

{"sheet":"calculation","index":4,"n_rows":431,"n_cols":100,"rows_kept":431,"cut":false,"hidden":true,"merged":[[47,21,47,22],[1,1,1,3],[1,4,1,7],[1,8,1,10],[2,1,2,3],[2,4,2,7],[2,8,2,10],[3,9,3,10],[4,2,4,3],[4,5,4,6],[4,9,4,10],[5,2,5,3],[5,5,5,6],[3,2,3,3],[3,5,3,6],[6,2,6,3],[6,5,6,6],[7,2,7,3],[8,2,8,3],[11,1,11,3],[11,4,11,6],[11,8,11,10],[12,4,12,6],[12,8,12,9],[13,1,13,2],[13,4,13,6],[13,8,13,9],[15,22,15,30],[16,3,16,4],[16,6,16,7],[16,9,16,10],[16,22,16,24],[14,1,14,2],[14,4,14,6],[14,8,14,9],[34,1,34,4],[35,1,35,4],[44,1,44,7],[45,1,45,7],[16,25,16,27],[16,28,16,30],[36,1,36,4],[37,1,37,4],[31,1,31,4],[32,1,32,4],[33,1,33,4],[42,1,42,8],[43,1,43,7],[38,1,38,4],[41,1,41,8],[73,31,73,40],[74,32,74,34],[74,35,74,37],[74,38,74,40],[16,31,16,39],[35,31,35,34],[47,35,47,37],[47,38,47,40],[46,32,46,40],[60,32,60,34],[59,31,59,40],[60,35,60,37],[60,38,60,40],[47,32,47,34]]}
["Max Pichler AG"]
[null,null,null,null,"Messprozessanaylse \nVerfahren 2 Anova (Basis Bosch Heft 10)"]
[null,"Messmittel",null,null,"Merkmal",null,null,null,"Normal"]
[null,"Bez.:",null,null,"Objekt:",null,null,null,"Be.:"]
[null,"Nummer:",null,null,"Nummer:",null,null,null,"Nummer"]
[null,"Auflösung:",null,null,"Zeichnungsnr.",null,null,null,"Nennmaß:"]
[null,"Auflösung:",null,null,"Einheit:",null,null,null,"Einheit:"]
[null,"Akt. Dat.: ","2015-01-04",null,"OGW",{"$f":"input!G9","v":4}]
[null,"Bearbeiter:",null,null,"UGW",{"$f":"input!G10","v":-4},"Toleranz:",{"$f":"input!I10","v":8}]
[null,"Prüferverfahren Beschreibung:"]
[]
[null,"Ergebnis aus MSA Verfahren 1",null,null,"Anzahl der Teile n",null,null,{"$f":"COUNT(C19:C28)","v":3},"Messsystem ist "]
[null,null,null,null,"Anzahl der Prüfer k",null,null,{"$f":"COUNT(C19)+COUNT(F19)+COUNT(I19)","v":3},"fähig bis",null,{"$f":"input!L14","v":0.1}]
[null,"Protokoll Nr.",null,null,"Anz. Prüfungen je Prüfer / Objekt r",null,null,{"$f":"COUNT(C19:E19)","v":3},"akzeptabel bis",null,{"$f":"input!L15","v":0.3}]
[null,"Das Prüfmittel ",null,{"$f":"input!E16","v":"ist fähig"},"Bedingung k*n*r > 30",null,null,{"$f":"IF((AnzahlTeile*AnzahlPruefer*AnzahlMessungen)>=30,\"erfüllt\",\"nicht erfüllt\")","v":"nicht erfüllt"},"nicht akzeptabel ab",null,{"$f":"input!L16","v":0.3}]
[null,null,null,null,null,null,null,null,null,null,null,null,null,null,null,null,null,null,null,null,null,null,"Messeinrichtung"]
[null,null,"Prüfer j=1",{"$f":"input!E18","v":"Gerber"},null,"Prüfer j=2",{"$f":"input!H18","v":"Bohnert"},null," Prüfer j=3",{"$f":"IF(input!K18=\"\",\"\",input!K18)","v":"Zimmer"},null,null,null,null,"Mittelwert der Spalte C-K",{"$f":"D17","v":"Gerber"},{"$f":"G17","v":"Bohnert"},{"$f":"J17","v":"Zimmer"},"Einfluß Teil",null,null,null,"Prüfer 1",null,null,"Prüfer 2",null,null,"Prüfer 3",null,null,"Teil"]
[null,"Teil Nr.","m=1","m=2","m=3","m=1","m=2","m=3","m=1","m=2","m=3",null,null,null,"Yi","Yi1m","Yi2m","Yi1m",{"$f":"\"(Yi-Yijm)^2\"","v":"(Yi-Yijm)^2"},"Wechselwirkung Teil i Prüfer 1","Wechselwirkung Teil i Prüfer 2","Wechselwirkung Teil i Prüfer 3","m=1","m=2","m=3","m=1","m=2","m=3","m=1","m=2","m=3","m=1","m=2","m=3","m=1","m=2","m=3","m=1","m=2","m=3"]
[null,"i=1",{"$f":"IF(input!D20=\"\",\"\",input!D20)","v":0.28999999999999998},{"$f":"IF(input!E20=\"\",\"\",input!E20)","v":0.41},{"$f":"IF(input!F20=\"\",\"\",input!F20)","v":0.64},{"$f":"IF(input!G20=\"\",\"\",input!G20)","v":0.08},{"$f":"IF(input!H20=\"\",\"\",input!H20)","v":0.25},{"$f":"IF(input!I20=\"\",\"\",input!I20)","v":7.0000000000000007E-2},{"$f":"IF(input!J20=\"\",\"\",input!J20)","v":0.04},{"$f":"IF(input!K20=\"\",\"\",input!K20)","v":-0.11},{"$f":"IF(input!L20=\"\",\"\",input!L20)","v":-0.15},null,null,null,{"$f":"AVERAGE(C19:K19)","v":0.16888888888888889},{"$f":"AVERAGE(C19:E19)","v":0.4466666666666666},{"$f":"AVERAGE(F19:H19)","v":0.13333333333333333},{"$f":"IF(I19=\"\",\"\",AVERAGE(I19:K19))","v":-7.3333333333333334E-2},{"$f":"(O19-$P$35)^2","v":8.9999999999999998E-4},{"$f":"(P19-$P$32-O19+$P$35)^2","v":2.4999999999999961E-3},{"$f":"(Q19-$P$33-O19+$P$35)^2","v":4.0111111111111068E-3},{"$f":"IF(I19=\"\",\"\",(R19-$P$34-O19+$P$35)^2)","v":1.7777777777777562E-4},{"$f":"(C19-P19)^2","v":2.4544444444444431E-2},{"$f":"(D19-P19)^2","v":1.3444444444444413E-3},{"$f":"IF(E19=\"\",\"\",(E19-P19)^2)","v":3.7377777777777808E-2},{"$f":"(F19-Q19)^2","v":2.8444444444444441E-3},{"$f":"(G19-Q19)^2","v":1.3611111111111112E-2},{"$f":"IF(H19=\"\",\"\",(H19-Q19)^2)","v":4.0111111111111103E-3},{"$f":"IF(I19=\"\",\"\",(I19-R19)^2)","v":1.2844444444444447E-2},{"$f":"IF(J19=\"\",\"\",(J19-R19)^2)","v":1.3444444444444445E-3},{"$f":"IF(K19=\"\",\"\",(K19-R19)^2)","v":5.8777777777777769E-3},{"$f":"(C19-$P$35)^2","v":2.2834567901234559E-2},7.3501234567901225E-2,{"$f":"IF(E19=\"\",\"\",(E19-$P$35)^2)","v":0.25111234567901231},{"$f":"(F19-$P$35)^2","v":3.4679012345679018E-3},1.2345679012345678E-2,{"$f":"IF(H19=\"\",\"\",(H19-$P$35)^2)","v":4.7456790123456792E-3},9.7790123456790116E-3,6.1945679012345677E-2,8.3456790123456775E-2]
[null,"i=2",{"$f":"IF(input!D21=\"\",\"\",input!D21)","v":-0.56000000000000005},{"$f":"IF(input!E21=\"\",\"\",input!E21)","v":-0.68},{"$f":"IF(input!F21=\"\",\"\",input!F21)","v":-0.57999999999999996},{"$f":"IF(input!G21=\"\",\"\",input!G21)","v":-0.47},{"$f":"IF(input!H21=\"\",\"\",input!H21)","v":-1.22},{"$f":"IF(input!I21=\"\",\"\",input!I21)","v":-0.68},{"$f":"IF(input!J21=\"\",\"\",input!J21)","v":-1.38},{"$f":"IF(input!K21=\"\",\"\",input!K21)","v":-1.1299999999999999},{"$f":"IF(input!L21=\"\",\"\",input!L21)","v":-0.96},null,null,null,{"$f":"IF(C20=\"\",\"\",AVERAGE(C20:K20))","v":-0.85111111111111104},{"$f":"IF(C20=\"\",\"\",AVERAGE(C20:E20))","v":-0.6066666666666668},{"$f":"IF(F20=\"\",\"\",AVERAGE(F20:H20))","v":-0.79},{"$f":"IF(I20=\"\",\"\",AVERAGE(I20:K20))","v":-1.1566666666666665},{"$f":"IF(O20=\"\",\"\",(O20-$P$35)^2)","v":0.98009999999999997},{"$f":"IF(P20=\"\",\"\",(P20-$P$32-O20+$P$35)^2)","v":2.7777777777777393E-4},{"$f":"IF(Q20=\"\",\"\",(Q20-$P$33-O20+$P$35)^2)","v":1.111111111111107E-3},{"$f":"IF(I20=\"\",\"\",(R20-$P$34-O20+$P$35)^2)","v":2.4999999999999879E-3},{"$f":"IF(P20=\"\",\"\",(C20-P20)^2)","v":2.177777777777785E-3},{"$f":"IF(P20=\"\",\"\",(D20-P20)^2)","v":5.3777777777777652E-3},{"$f":"IF(E20=\"\",\"\",(E20-P20)^2)","v":7.1111111111112025E-4},{"$f":"IF(Q20=\"\",\"\",(F20-Q20)^2)","v":0.10240000000000005},{"$f":"IF(Q20=\"\",\"\",(G20-Q20)^2)","v":0.18489999999999995},{"$f":"IF(H20=\"\",\"\",(H20-Q20)^2)","v":1.2099999999999998E-2},4.9877777777777799E-2,{"$f":"IF(J20=\"\",\"\",(J20-R20)^2)","v":7.1111111111110843E-4},{"$f":"IF(K20=\"\",\"\",(K20-R20)^2)","v":3.8677777777777728E-2},{"$f":"IF(C20=\"\",\"\",(C20-$P$35)^2)","v":0.4884456790123457},{"$f":"IF(D20=\"\",\"\",(D20-$P$35)^2)","v":0.67057901234567918},0.51680123456790128,{"$f":"IF(F20=\"\",\"\",(F20-$P$35)^2)","v":0.37074567901234556},{"$f":"IF(G20=\"\",\"\",(G20-$P$35)^2)","v":1.8465790123456789},0.67057901234567918,2.3070234567901231,1.6100790123456785,1.2075567901234565]
[null,"i=3",{"$f":"IF(input!D22=\"\",\"\",input!D22)","v":1.34},{"$f":"IF(input!E22=\"\",\"\",input!E22)","v":1.17},{"$f":"IF(input!F22=\"\",\"\",input!F22)","v":1.27},{"$f":"IF(input!G22=\"\",\"\",input!G22)","v":1.19},{"$f":"IF(input!H22=\"\",\"\",input!H22)","v":0.94},{"$f":"IF(input!I22=\"\",\"\",input!I22)","v":1.34},{"$f":"IF(input!J22=\"\",\"\",input!J22)","v":0.88},{"$f":"IF(input!K22=\"\",\"\",input!K22)","v":1.0900000000000001},{"$f":"IF(input!L22=\"\",\"\",input!L22)","v":0.67},null,null,null,1.098888888888889,1.26,1.1566666666666665,0.88,0.92160000000000031,4.4444444444444644E-3,8.999999999999849E-4,1.3444444444444292E-3,6.4000000000000116E-3,8.1000000000000152E-3,1.0000000000000018E-4,1.111111111111118E-3,4.69444444444444E-2,3.3611111111111196E-2,0,4.4100000000000035E-2,4.4099999999999986E-2,1.4426679012345682,1.06319012345679,1.2794123456790125,1.1048345679012346,0.64177901234567902,1.4426679012345682,0.54924567901234556,0.90461234567901261,0.282079012345679]
[null,"i=4",null,null,null,null,null,null,null,null,null,null,null,null,"","","","","","","","","","","","","","","","","","","","","","","","","",""]
[null,"i=5",null,null,null,null,null,null,null,null,null,null,null,null,"","","","","","","","","","","","","","","","","","","","","","","","","",""]
[null,"i=6",null,null,null,null,null,null,null,null,null,null,null,null,"","","","","","","","","","","","","","","","","","","","","","","","","",""]
[null,"i=7",null,null,null,null,null,null,null,null,null,null,null,null,"","","","","","","","","","","","","","","","","","","","","","","","","",""]
[null,"i=8",null,null,null,null,null,null,null,null,null,null,null,null,"","","","","","","","","","","","","","","","","","","","","","","","","",""]
[null,"i=9",null,null,null,null,null,null,null,null,null,null,null,null,"","","","","","","","","","","","","","","","","","","","","","","","","",""]
[null,"i=10",null,null,null,null,null,null,null,null,null,null,null,null,"","","","",{"$f":"IF(O28=\"\",\"\",(O28-$P$35)^2)","v":""},"",{"$f":"IF(Q28=\"\",\"\",(Q28-$P$33-O28+$P$35)^2)","v":""},"","","","",{"$f":"IF(Q28=\"\",\"\",(F28-Q28)^2)","v":""},{"$f":"IF(Q28=\"\",\"\",(G28-Q28)^2)","v":""},"","","","",{"$f":"IF(C28=\"\",\"\",(C28-$P$35)^2)","v":""},{"$f":"IF(D28=\"\",\"\",(D28-$P$35)^2)","v":""},"",{"$f":"IF(F28=\"\",\"\",(F28-$P$35)^2)","v":""},{"$f":"IF(G28=\"\",\"\",(G28-$P$35)^2)","v":""},"","","",""]
[null,null,null,null,null,null,null,null,null,null,null,null,null,null,null,null,null,null,null,0.70560002326965332,0.53350001573562622,0.57959997653961182,0.28960001468658447,0.30199998617172241,0.77480000257492065,1.4100000262260437E-2,0.76080000400543213,0.81449997425079346,0.70910000801086426,4.5400001108646393E-2,0.41409999132156372,0.86269998550415039,0.7904999852180481,0.37360000610351563,0.96200001239776611,0.87150001525878906,5.6299999356269836E-2,0.9495999813079834,0.36410000920295715,0.52490001916885376,0.76719999313354492,5.3599998354911804E-2,0.59249997138977051,0.46880000829696655,0.29820001125335693,0.62269997596740723,0.64789998531341553,0.2637999951839447,0.27939999103546143,0.82990002632141113,0.8246999979019165,0.58920001983642578,0.98610001802444458,0.91100001335144043,0.22689999639987946,0.69520002603530884,0.98009997606277466,0.24400000274181366,0.53390002250671387,0.10639999806880951,0.99949997663497925,0.67619997262954712,1.5799999237060547E-2,0.57520002126693726,0.10010000318288803,0.1031000018119812,0.79890000820159912,0.28450000286102295,4.5699998736381531E-2,0.29580000042915344,0.38209998607635498,0.30099999904632568,0.94859999418258667,0.97990000247955322,0.40139999985694885,0.27829998731613159,0.16050000488758087,0.16290000081062317,0.64660000801086426,0.41010001301765442,0.41280001401901245,0.71280002593994141,0.3262999951839447,0.63319998979568481,0.20759999752044678,0.18610000610351563,0.58340001106262207,8.0799996852874756E-2,0.45800000429153442,0.9057999849319458,0.2614000141620636,0.78530001640319824,0.37900000810623169,0.28970000147819519,0.91939997673034668,0.63179999589920044,0.62769997119903564,0.42849999666213989,9.7999997437000275E-2,0.56110000610351563]
[null,null,null,null,null,null,null,null,null,null,null,null,null,null,null,null,null,null,null,0.69450002908706665,0.91380000114440918,0.83490002155303955,2.2700000554323196E-2,0.54339998960494995,0.91619998216629028,0.43029999732971191,0.67799997329711914,0.50249999761581421,0.51380002498626709,0.46299999952316284,0.35350000858306885,0.40490001440048218,0.26980000734329224,5.559999868273735E-2,0.24390000104904175,0.97909998893737793,6.1000000685453415E-2,0.39030000567436218,0.36500000953674316,0.48989999294281006,0.15569999814033508,0.47450000047683716,0.2572999894618988,0.62879997491836548,0.54210001230239868,0.15639999508857727,0.93860000371932983,0.65450000762939453,0.50609999895095825,0.39050000905990601,0.10740000009536743,0.7839999794960022,0.45969998836517334,0.75370001792907715,0.59609997272491455,0.83279997110366821,1.8799999728798866E-2,0.21040000021457672,7.4000000953674316E-2,0.1054999977350235,0.33169999718666077,0.12829999625682831,3.0000001424923539E-4,0.53680002689361572,0.65710002183914185,0.54409998655319214,0.82749998569488525,8.190000057220459E-2,0.19200000166893005,0.67900002002716064,0.45429998636245728,0.35710000991821289,0.15000000596046448,0.70440000295639038,0.92879998683929443,0.53030002117156982,8.9699998497962952E-2,0.75779998302459717,0.40189999341964722,0.46189999580383301,0.49219998717308044,0.20769999921321869,0.32980000972747803,9.5499999821186066E-2,0.58980000019073486,0.16990000009536743,0.9276999831199646,9.7999997437000275E-2,0.44389998912811279,0.27300000190734863,0.8726000189781189,0.75069999694824219,0.27300000190734863,0.67369997501373291,0.25670000910758972,8.9900001883506775E-2,3.0999999493360519E-2,0.32280001044273376,0.79019999504089355,0.29730001091957092]
[null,null,null,null,null,null,"Standard- abweichung","Streubreite",null,"Anteil an \nGesamt-\nstreubreite","Anteill  der Toleranz",null,null,null,null,null,null,null,null,0.23530000448226929,0.48050001263618469,0.25470000505447388,0.34070000052452087,4.5000001788139343E-2,0.48249998688697815,0.20610000193119049,0.86460000276565552,0.58869999647140503,0.75499999523162842,0.92790001630783081,0.3310999870300293,0.5429999828338623,8.0700002610683441E-2,0.63440001010894775,0.41010001301765442,0.96050000190734863,0.11469999700784683,0.92350000143051147,0.62029999494552612,0.34779998660087585,0.1492999941110611,0.47999998927116394,0.21950000524520874,0.99379998445510864,0.13050000369548798,2.8899999335408211E-2,0.34540000557899475,0.54769998788833618,0.92299997806549072,0.53829997777938843,0.40650001168251038,0.84729999303817749,0.82630002498626709,0.67250001430511475,0.72189998626708984,0.9968000054359436,0.33989998698234558,0.49529999494552612,0.41299998760223389,0.69529998302459717,0.17910000681877136,0.42300000786781311,0.54320001602172852,0.81470000743865967,0.54100000858306885,0.42759999632835388,0.50910001993179321,0.22779999673366547,0.61919999122619629,0.48989999294281006,0.680899977684021,0.88669997453689575,0.37059998512268066,0.30250000953674316,0.29289999604225159,0.15039999783039093,0.52990001440048218,0.22329999506473541,0.58459997177124023,0.36349999904632568,0.87599998712539673,0.4781000018119812,0.1906999945640564,0.68409997224807739,0.74750000238418579,0.61400002241134644,0.78219997882843018,0.16179999709129333,0.80779999494552612,0.20270000398159027,0.95679998397827148,6.589999794960022E-2,6.1599999666213989E-2,0.79320001602172852,0.37970000505447388,0.46360000967979431,0.11959999799728394,0.11550000309944153,0.17380000650882721,4.8200000077486038E-2]
[null,"Einflussgrößen",null,null,null,null,"SD","SV",null,"%SV","%T",null,null,null,null,{"$f":"AVERAGE(C19:E28)","v":0.36666666666666664},{"$f":"(P32-$P$35)^2","v":5.1882716049382702E-2},null,null,0.71490001678466797,0.53310000896453857,0.56110000610351563,0.21680000424385071,0.46810001134872437,0.74639999866485596,0.7523999810218811,0.39899998903274536,0.90310001373291016,0.74610000848770142,8.8600002229213715E-2,0.63459998369216919,0.71310001611709595,1.5699999406933784E-2,0.43119999766349792,0.40200001001358032,0.27529999613761902,0.98540002107620239,0.80260002613067627,0.69620001316070557,0.41760000586509705,0.73449999094009399,0.27720001339912415,0.35659998655319214,0.43349999189376831,0.94499999284744263,0.12160000205039978,0.64600002765655518,0.34790000319480896,0.10450000315904617,0.18549999594688416,7.7699996531009674E-2,0.43279999494552612,0.95929998159408569,0.54210001230239868,0.49439999461174011,0.97299998998641968,0.21780000627040863,0.37900000810623169,0.39590001106262207,0.28159999847412109,0.50340002775192261,0.1387999951839447,0.51730000972747803,0.96539998054504395,0.55760002136230469,0.90930002927780151,0.65729999542236328,0.44119998812675476,0.69300001859664917,6.4499996602535248E-2,0.75609999895095825,0.7006000280380249,0.49709999561309814,0.15549999475479126,0.22380000352859497,0.32620000839233398,0.78450000286102295,5.0299998372793198E-2,0.51810002326965332,0.75709998607635498,0.80070000886917114,0.32530000805854797,0.97280001640319824,0.80430001020431519,0.67489999532699585,0.90520000457763672,0.87580001354217529,0.41670000553131104,0.12309999763965607,0.95420002937316895,0.79729998111724854,0.69630002975463867,0.40169999003410339,1.6300000250339508E-2,0.16779999434947968,0.16429999470710754,0.5098000168800354,0.40610000491142273,0.10620000213384628,0.27619999647140503]
[null,"Teile (Part Variation) Teilestreuung",null,null,null,"PV",{"$f":"IF($Z$41=0,AD48,AD39)","v":0.97343606763761226},{"$f":"IF(G33=\"\",\"\",6*G33)","v":5.8406164058256733},"%PV",{"$f":"IF(H33=\"\",\"\",H33/$H$38)","v":0.95621802037762205},{"$f":"IF(G33=\"\",\"\",6*G33/$H$9)","v":0.73007705072820916},null,null,null,null,{"$f":"AVERAGE(F19:H28)","v":0.16666666666666663},{"$f":"(P33-$P$35)^2","v":7.7160493827160251E-4},null,null,0.64310002326965332,0.84909999370574951,0.49799999594688416,0.18780000507831573,0.89670002460479736,0.37290000915527344,0.32359999418258667,0.77090001106262207,0.21809999644756317,0.44699999690055847,0.23610000312328339,0.87840002775192261,0.61049997806549072,0.37450000643730164,0.38960000872612,0.86059999465942383,0.58600002527236938,0.93159997463226318,0.51719999313354492,0.33039999008178711,0.8684999942779541,0.25909999012947083,0.25960001349449158,0.17870000004768372,0.34700000286102295,2.6000000070780516E-3,0.74239999055862427,0.8409000039100647,0.27860000729560852,0.70300000905990601,0.40490001440048218,0.81160002946853638,0.74180001020431519,0.43770000338554382,7.8000001609325409E-2,0.4106999933719635,0.33939999341964722,0.71060001850128174,0.31229999661445618,0.79879999160766602,0.1518000066280365,0.59299999475479126,0.95630002021789551,0.24320000410079956,0.93999999761581421,0.11439999938011169,0.98430001735687256,0.63300001621246338,0.59890002012252808,0.9025999903678894,0.57489997148513794,0.24519999325275421,0.86019998788833618,7.5000002980232239E-2,0.43889999389648438,0.75999999046325684,0.24570000171661377,0.37869998812675476,0.39730000495910645,0.52660000324249268,0.27039998769760132,0.5812000036239624,0.20970000326633453,7.8800000250339508E-2,0.89550000429153442,0.11150000244379044,0.65240001678466797,0.90039998292922974,0.23160000145435333,0.94999998807907104,0.84619998931884766,0.44130000472068787,0.49210000038146973,0.76959997415542603,0.83490002155303955,0.38260000944137573,0.1956000030040741,0.32620000839233398,0.41330000758171082,0.15270000696182251,0.61989998817443848]
[null,"Prüfer (Appraiser Variation) Vergleichspräzision",null,null,null,"AV",{"$f":"IF($Z$41=0,AD49,AD40)","v":0.23507288073969576},{"$f":"IF(G34=\"\",\"\",6*G34)","v":1.4104372844381745},"%AV",{"$f":"IF(H34=\"\",\"\",H34/$H$38)","v":0.23091493333597896},{"$f":"IF(J34=\"\",\"\",6*G34/$H$9)","v":0.17630466055477181},null,null,null,null,{"$f":"IF(I19=\"\",\"\",AVERAGE(I19:K28))","v":-0.1166666666666666},{"$f":"IF(P34=\"\",\"\",(P34-$P$35)^2)","v":6.5308641975308598E-2},null,null,9.9500000476837158E-2,0.20509999990463257,0.69260001182556152,0.50449997186660767,0.18310000002384186,0.99150002002716064,0.47139999270439148,4.1000000201165676E-3,0.42590001225471497,0.28880000114440918,0.75260001420974731,0.8913000226020813,0.82200002670288086,0.17689999938011169,0.1088000014424324,1.0300000198185444E-2,0.15170000493526459,0.37749999761581421,0.18819999694824219,0.97960001230239868,0.87220001220703125,0.58160001039505005,0.72949999570846558,0.14509999752044678,0.25780001282691956,2.8300000354647636E-2,0.8278999924659729,0.78339999914169312,0.79119998216629028,0.33270001411437988,0.45100000500679016,0.55519998073577881,0.80339998006820679,0.56400001049041748,0.20360000431537628,0.20759999752044678,0.36469998955726624,0.57359999418258667,0.34419998526573181,0.52829998731613159,0.42550000548362732,0.57309997081756592,5.0099998712539673E-2,0.54759997129440308,0.20649999380111694,0.9627000093460083,0.93309998512268066,0.99260002374649048,0.83960002660751343,0.40939998626708984,0.80529999732971191,0.98949998617172241,0.25850000977516174,0.1745000034570694,0.69470000267028809,1.7000000923871994E-2,0.33910000324249268,0.69260001182556152,0.1103999987244606,0.10980000346899033,0.2906000018119812,0.39890000224113464,0.55909997224807739,0.31099998950958252,0.29559999704360962,0.80800002813339233,0.30970001220703125,0.37590000033378601,0.40110000967979431,0.84149998426437378,0.40959998965263367,0.72460001707077026,0.65880000591278076,0.40639999508857727,0.95039999485015869,0.64560002088546753,0.51609998941421509,0.22339999675750732,0.58279997110366821,0.74860000610351563,0.45649999380111694]
[null,"Wechselwirkung (Interaction)",null,null,null,"INT",{"$f":"IF($Z$41=0,0,AD41)","v":0},{"$f":"IF(G35=\"\",\"\",6*G35)","v":0},"%IA",{"$f":"IF(H35=\"\",\"\",H35/$H$38)","v":0},{"$f":"IF(G35=\"\",\"\",6*G35/$H$9)","v":0},null,null,null,null,{"$f":"AVERAGE(C19:K28)","v":0.1388888888888889},null,null,null,0.90439999103546143,0.28310000896453857,0.66759997606277466,0.89020001888275146,0.28139999508857727,0.36809998750686646,1.4299999922513962E-2,0.29469999670982361,0.98409998416900635,0.76130002737045288,0.58090001344680786,0.60570001602172852,0.26809999346733093,0.50819998979568481,0.79360002279281616,0.85750001668930054,9.3199998140335083E-2,0.54189997911453247,0.41539999842643738,7.3399998247623444E-2,0.45140001177787781,0.69889998435974121,0.49930000305175781,0.40700000524520874,0.94510000944137573,0.98470002412796021,0.59149998426437378,0.53200000524520874,0.61510002613067627,8.919999748468399E-2,0.18449999392032623,0.28360000252723694,1.8899999558925629E-2,0.1526000052690506,0.42019999027252197,0.54850000143051147,0.55849999189376831,0.78109997510910034,4.3000001460313797E-2,0.40580001473426819,5.9000000357627869E-2,0.31189998984336853,0.6031000018119812,0.51770001649856567,0.5964999794960022,0.32969999313354492,0.90930002927780151,0.77009999752044678,0.57590001821517944,0.43169999122619629,0.73259997367858887,0.16300000250339508,5.9700001031160355E-2,0.24339999258518219,0.75859999656677246,0.95130002498626709,0.34540000557899475,0.6843000054359436,0.79149997234344482,3.5500001162290573E-2,0.79420000314712524,0.48350000381469727,0.20649999380111694,0.6021999716758728,0.90890002250671387,0.94529998302459717,0.6534000039100647,1.4600000344216824E-2,0.66200000047683716,0.96480000019073486,9.4999996945261955E-3,0.95359998941421509,7.3700003325939178E-2,0.29330000281333923,0.58249998092651367,0.80790001153945923,4.0399998426437378E-2,5.469999834895134E-2,0.56440001726150513,0.31490001082420349,0.4124000072479248]
[null,"Messeinrichtung (Equipment Variation)\nWiederholpräzision",null,null,null,"EV",{"$f":"IF($Z$41=0,AD51,AD42)","v":0.18303005217723123},{"$f":"6*G36","v":1.0981803130633874},"%EV",{"$f":"H36/$H$38","v":0.17979263351856772},{"$f":"6*G36/$H$9","v":0.13727253913292342},null,null,null,null,null,null,null,null,0.51010000705718994,0.73360002040863037,0.45100000500679016,0.32240000367164612,7.4199996888637543E-2,0.40880000591278076,0.57300001382827759,0.76349997520446777,0.58039999008178711,0.65189999341964722,0.80769997835159302,0.41690000891685486,"Boxplot",null,null,null,0.73089998960494995,0.19239999353885651,0.77369999885559082,6.9899998605251312E-2,0.24809999763965607,0.9505000114440918,0.81989997625350952,0.21950000524520874,0.1843000054359436,0.2370000034570694,0.92549997568130493,0.25760000944137573,0.25600001215934753,0.71450001001358032,0.66490000486373901,0.77289998531341553,0.758899986743927,0.30849999189376831,0.8245999813079834,0.71880000829696655,0.89600002765655518,0.22259999811649323,0.35609999299049377,0.55339998006820679,0.35559999942779541,0.20440000295639038,0.57899999618530273,0.62999999523162842,0.13950000703334808,6.1000000685453415E-2,0.63419997692108154,0.83859997987747192,0.64099997282028198,0.42500001192092896,0.18719999492168427,0.49549999833106995,0.97320002317428589,0.76940000057220459,0.38060000538825989,0.48469999432563782,0.5471000075340271,0.67400002479553223,3.8199998438358307E-2,0.6478000283241272,0.89950001239776611,0.34040001034736633,0.11729999631643295,0.42559999227523804,0.77160000801086426,0.35820001363754272,0.41200000047683716,0.7476000189781189,0.43659999966621399,0.71990001201629639,0.50679999589920044,0.17360000312328339,0.27810001373291016,8.7300002574920654E-2,0.97899997234344482,0.28360000252723694,0.61820000410079956,0.30669999122619629,0.85240000486373901,0.3190000057220459,0.79540002346038818]
[null,"Prüfsystemstreuung",null,null,null,"GRR",{"$f":"IF($Z$41=0,AD52,AD43)","v":0.29792492218553857},{"$f":"6*G37","v":1.7875495331132314},"%GRR",{"$f":"H37/$H$38","v":0.29265525367760203},{"$f":"IF((6*G37/$H$9)>1,1,6*G37/$H$9)","v":0.22344369163915392},null,null,null,null,null,null,null,null,0.17440000176429749,0.30009999871253967,7.2800002992153168E-2,0.49340000748634338,0.4528999924659729,0.59780001640319824,3.0300000682473183E-2,0.31830000877380371,0.13570000231266022,0.32699999213218689,0.76010000705718994,0.62730002403259277,0.96369999647140503,{"$f":"$D$17","v":"Gerber"},{"$f":"$G$17","v":"Bohnert"},{"$f":"$J$17","v":"Zimmer"},0.82770001888275146,0.55409997701644897,0.60689997673034668,0.19030000269412994,0.90200001001358032,0.31859999895095825,0.60049998760223389,0.59729999303817749,0.76709997653961182,0.7149999737739563,0.68720000982284546,0.76050001382827759,0.2581000030040741,0.54979997873306274,0.50919997692108154,0.56529998779296875,0.28169998526573181,0.41589999198913574,0.35060000419616699,0.97200000286102295,0.5187000036239624,0.58289998769760132,0.4650999903678894,3.2099999487400055E-2,0.37779998779296875,0.13770000636577606,0.65420001745223999,0.15330000221729279,0.19810000061988831,0.37540000677108765,9.5600001513957977E-2,0.61540001630783081,0.70249998569488525,0.43959999084472656,0.42089998722076416,0.3361000120639801,0.70090001821517944,0.21310000121593475,4.3999999761581421E-2,0.88609999418258667,4.3200001120567322E-2,0.45879998803138733,0.73900002241134644,0.75529998540878296,0.82260000705718994,0.20970000326633453,0.46880000829696655,0.86809998750686646,0.82840001583099365,0.41049998998641968,0.4625999927520752,0.34889999032020569,0.24930000305175781,0.80709999799728394,0.54439997673034668,0.53829997777938843,0.62669998407363892,8.8200002908706665E-2,0.71109998226165771,0.25799998641014099,5.7599999010562897E-2,0.27529999613761902,0.96069997549057007,0.32699999213218689,0.64770001173019409]
[null,"Gesamtstreuung (Total Variation)",null,null,null,"TV",{"$f":"IF($Z$41=0,AD53,AD44)","v":1.0180064032397032},{"$f":"6*G38","v":6.1080384194382189},"%TV",{"$f":"H38/$H$38","v":1},{"$f":"6*G38/$H$9","v":0.76350480242977736},null,null,null,null,null,null,null,null,0.36349999904632568,0.37000000476837158,0.32690000534057617,0.21480000019073486,0.21240000426769257,0.42320001125335693,0.61750000715255737,0.24150000512599945,0.68620002269744873,0.5899999737739563,0.60290002822875977,7.8800000250339508E-2,"Maximum",{"$f":"MAX($C$19:$E$28)","v":1.34},{"$f":"MAX($F$19:$H$28)","v":1.34},{"$f":"IF($I$19=\"\",NA(),MAX($I$19:$K$28))","v":1.0900000000000001},4.4700000435113907E-2,0.15330000221729279,0.24629999697208405,0.39879998564720154,0.58399999141693115,0.28769999742507935,0.83639997243881226,0.89810001850128174,0.52670001983642578,0.38760000467300415,2.79999990016222E-3,0.25090000033378601,0.16290000081062317,0.64520001411437988,0.98119997978210449,0.31200000643730164,0.24070000648498535,0.87860000133514404,0.12970000505447388,0.56980001926422119,0.60699999332427979,0.61019998788833618,0.69389998912811279,0.85009998083114624,9.7599998116493225E-2,0.39449998736381531,0.82289999723434448,0.26820001006126404,0.67849999666213989,0.39620000123977661,0.8343999981880188,0.43290001153945923,0.83600002527236938,0.21879999339580536,0.73119997978210449,0.89920002222061157,0.21770000457763672,0.982200026512146,0.96579998731613159,0.87139999866485596,0.52289998531341553,0.65100002288818359,0.45669999718666077,0.15659999847412109,0.64310002326965332,0.61269998550415039,0.85399997234344482,0.36730000376701355,5.3199999034404755E-2,0.50590002536773682,5.469999834895134E-2,0.375,0.4512999951839447,0.29800000786781311,0.96840000152587891,1.2900000438094139E-2,0.6500999927520752,0.61409997940063477,0.53329998254776001,2.9500000178813934E-2,0.71689999103546143,0.3140999972820282,0.9812999963760376,0.29109999537467957,0.36489999294281006]
[null,"Anzahl unterscheidbarer Klassen (min 5)",null,null,null,"ndc",{"$f":"IF(ROUNDDOWN(SQRT(2)*G33/G37,0)=0,1,ROUNDDOWN(SQRT(2)*G33/G37,0))","v":4},null,null,null,null,null,null,null,null,null,{"$f":"sixmsa2_q35(calculation!AnzahlPruefer_k,calculation!AnzahlMessungen_r,S19:S28,V43)","v":17.123400000000004},null,{"$f":"AnzahlTeile_n-1","v":2},0.32179999351501465,{"$f":"Q39/S39","v":8.5617000000000019},0.35400000214576721,{"$f":"U39/U41","v":661.13513513513669},0.23569999635219574,{"$f":"FINV(0.05,S39,S41)","v":6.9442719099991574},{"$f":"IF(W39>Y39,1,0)","v":1},0.59289997816085815,0.70230001211166382,{"$f":"(U39-U41)/(calculation!AnzahlPruefer*calculation!AnzahlMessungen_r)","v":0.94986111111111127},{"$f":"IF(AC39<0,0,SQRT(AC39))","v":0.97460818337992183},0.26820001006126404,"Q3",{"$f":"QUARTILE($C$19:$E$28,3)","v":1.17},{"$f":"QUARTILE($F$19:$H$28,3)","v":0.94},{"$f":"IF($I$19=\"\",NA(),QUARTILE($I$19:$K$28,3))","v":0.67},0.57539999485015869,0.57690000534057617,0.99080002307891846,0.93140000104904175,0.25,0.8101000189781189,0.76990002393722534,0.40770000219345093,0.62999999523162842,0.49369999766349792,0.49860000610351563,0.13320000469684601,0.96950000524520874,0.17769999802112579,0.58960002660751343,0.68159997463226318,0.1096000000834465,0.65100002288818359,0.73820000886917114,0.78009998798370361,0.43160000443458557,8.2800000905990601E-2,0.49979999661445618,0.5746999979019165,5.9700001031160355E-2,0.41249999403953552,0.11829999834299088,0.1460999995470047,0.31459999084472656,0.99080002307891846,0.60439997911453247,0.27500000596046448,0.41639998555183411,0.47009998559951782,6.3299998641014099E-2,0.45820000767707825,0.43740001320838928,0.94510000944137573,0.27309998869895935,0.17360000312328339,0.50609999895095825,0.34380000829696655,0.5130000114440918,0.39660000801086426,0.25949999690055847,6.7400000989437103E-2,0.64120000600814819,0.36480000615119934,0.54640001058578491,0.88169997930526733,0.42309999465942383,0.59450000524520874,0.38089999556541443,5.7300001382827759E-2,0.10949999839067459,0.14589999616146088,0.14499999582767487,0.76020002365112305,0.26469999551773071,0.13860000669956207,4.2300000786781311E-2,0.69260001182556152,0.84450000524520874,0.51740002632141113,0.80049997568130493]
[null,null,null,null,null,null,null,null,null,null,null,null,null,null,null,null,{"$f":"sixmsa2_q40(V43,calculation!AnzahlTeile_n,calculation!AnzahlMessungen_r,$Q$32:$Q$34)","v":1.0616666666666661},null,{"$f":"AnzahlPruefer_k-1","v":2},0.98360002040863037,{"$f":"Q40/S40","v":0.53083333333333305},0.52460002899169922,{"$f":"U40/U41","v":40.990990990991058},6.8099997937679291E-2,{"$f":"FINV(0.05,S40,S41)","v":6.9442719099991574},{"$f":"IF(W40>Y40,1,0)","v":1},0.62510001659393311,0.32940000295639038,{"$f":"IF((U40-U41)/(calculation!AnzahlTeile*calculation!AnzahlMessungen_r)<0,0,(U40-U41)/(calculation!AnzahlTeile*calculation!AnzahlMessungen_r))","v":5.7542592592592562E-2},{"$f":"IF(AC40=0,\"\",SQRT(AC40))","v":0.23988037141999044},0.27849999070167542,"Median",{"$f":"QUARTILE($C$19:$E$28,2)","v":0.41},{"$f":"QUARTILE($F$19:$H$28,2)","v":0.08},{"$f":"IF($I$19=\"\",NA(),QUARTILE($I$19:$K$28,2))","v":-0.11},0.68290001153945923,0.40209999680519104,0.38440001010894775,0.2054000049829483,0.87599998712539673,0.15129999816417694,0.40169999003410339,0.60900002717971802,0.54919999837875366,0.72949999570846558,0.1234000027179718,0.32499998807907104,7.8999996185302734E-3,0.78350001573562622,0.92170000076293945,0.2994999885559082,0.22609999775886536,0.95319998264312744,0.18919999897480011,0.4171999990940094,0.36269998550415039,0.32480001449584961,0.97970002889633179,0.57910001277923584,0.52660000324249268,0.13410000503063202,0.89869999885559082,3.1199999153614044E-2,0.79259997606277466,0.71929997205734253,0.24420000612735748,0.94230002164840698,0.46689999103546143,0.72409999370574951,0.3970000147819519,0.23199999332427979,0.60269999504089355,0.55119997262954712,0.46180000901222229,0.6492999792098999,0.76609998941421509,6.5200001001358032E-2,0.15729999542236328,0.10019999742507935,5.130000039935112E-2,0.54570001363754272,0.95719999074935913,0.22619999945163727,0.3465999960899353,0.89050000905990601,0.48069998621940613,0.23199999332427979,0.8497999906539917,6.8599998950958252E-2,0.13320000469684601,0.96429997682571411,0.83399999141693115,0.82349997758865356,0.9966999888420105,0.23919999599456787,0.66280001401901245,0.62620002031326294,0.97079998254776001,0.42080000042915344,5.6699998676776886E-2]
[null,"Bemerkung",null,null,null,null,null,null,null,null,null,null,null,null,null,null,{"$f":"sixmsa2_q41(V43,calculation!AnzahlMessungen_r,$T$19:$V$28)","v":5.1799999999999888E-2},null,{"$f":"S39*S40","v":4},0.8783000111579895,{"$f":"Q41/S41","v":1.2949999999999972E-2},0.16279999911785126,{"$f":"U41/U42","v":0.34019264448336178},0.2492000013589859,{"$f":"FINV(0.05,S41,S42)","v":2.9277441728071834},{"$f":"IF(W41>Y41,1,0)","v":0},0.60799998044967651,0.36539998650550842,{"$f":"IF((U41-U42)/AnzahlMessungen<0,0,(U41-U42)/AnzahlMessungen)","v":0},{"$f":"IF(AC41=0,\"\",SQRT(AC41))","v":""},0.91839998960494995,"Q1",{"$f":"QUARTILE($C$19:$E$28,1)","v":-0.56000000000000005},{"$f":"QUARTILE($F$19:$H$28,1)","v":-0.47},{"$f":"IF($I$19=\"\",NA(),QUARTILE($I$19:$K$28,1))","v":-0.96},0.54670000076293945,0.95969998836517334,0.76469999551773071,0.4050000011920929,0.75609999895095825,0.57380002737045288,0.44510000944137573,4.5600000768899918E-2,3.8699999451637268E-2,0.36320000886917114,0.41600000858306885,0.36550000309944153,0.63109999895095825,0.17980000376701355,0.43439999222755432,0.15639999508857727,0.97060000896453857,0.27480000257492065,5.8800000697374344E-2,0.80479997396469116,0.71009999513626099,0.25209999084472656,0.79030001163482666,0.87019997835159302,0.98379999399185181,0.27110001444816589,0.46299999952316284,0.91299998760223389,0.92309999465942383,0.50010001659393311,0.88450002670288086,0.57249999046325684,0.42219999432563782,0.81940001249313354,0.72680002450942993,0.89560002088546753,0.15360000729560852,0.77410000562667847,0.66670000553131104,0.91420000791549683,0.83350002765655518,0.7775999903678894,0.77640002965927124,0.47380000352859497,0.7379000186920166,0.56470000743865967,0.16459999978542328,0.31159999966621399,0.46790000796318054,0.89429998397827148,0.86629998683929443,0.38440001010894775,0.96549999713897705,0.5031999945640564,0.98420000076293945,0.44690001010894775,0.77920001745223999,0.30860000848770142,7.890000194311142E-2,0.87980002164840698,0.57929998636245728,0.86169999837875366,0.80959999561309814,0.76789999008178711,0.92400002479553223]
[null,{"$f":"IF(K37<K13,\"Das Messsystem ist fähig\",IF(K37>K14,\"Das Messsystem ist nicht fähig\",\"Das Messsystem ist bedingt fähig\"))","v":"Das Messsystem ist bedingt fähig"},null,null,null,null,null,null,null,null,null,null,null,null,null,null,{"$f":"sixmsa2_q42(V43,$W$19:$AE$28)","v":0.68519999999999992},null,{"$f":"AnzahlTeile_n*AnzahlPruefer_k*(AnzahlMessungen_r-1)","v":18},5.0299998372793198E-2,{"$f":"Q42/S42","v":3.8066666666666665E-2},0.82489997148513794,{"$f":"TODAY()","v":46119},0.22820000350475311,0.27489998936653137,5.2700001746416092E-2,0.90310001373291016,0.98799997568130493,{"$f":"U42","v":3.8066666666666665E-2},{"$f":"SQRT(AC42)","v":0.19510680835549196},0.26230001449584961,"Minimum",{"$f":"MIN($C$19:$E$28)","v":-0.68},{"$f":"MIN($F$19:$H$28)","v":-1.22},{"$f":"IF($I$19=\"\",NA(),MIN($I$19:$K$28))","v":-1.38},0.53990000486373901,0.34310001134872437,0.21320000290870667,0.2012999951839447,0.12950000166893005,0.60490000247955322,0.58619999885559082,0.85699999332427979,8.829999715089798E-2,0.20039999485015869,0.63410001993179321,0.46050000190734863,0.28580000996589661,0.83359998464584351,0.30700001120567322,0.97430002689361572,0.39719998836517334,0.79170000553131104,0.805899977684021,0.60780000686645508,0.3562999963760376,0.58560001850128174,0.66079998016357422,0.58329999446868896,5.8899998664855957E-2,0.84030002355575562,5.9099998325109482E-2,0.15139999985694885,0.31589999794960022,0.43569999933242798,0.42340001463890076,0.85650002956390381,5.6299999356269836E-2,0.89730000495910645,0.23989999294281006,5.2700001746416092E-2,0.78039997816085815,3.6800000816583633E-2,0.1363999992609024,0.66920000314712524,0.2630000114440918,0.84229999780654907,0.2101999968290329,0.22630000114440918,0.50620001554489136,0.61970001459121704,0.60680001974105835,0.10029999911785126,0.94300001859664917,0.38269999623298645,0.3474000096321106,3.9799999445676804E-2,0.89020001888275146,0.49360001087188721,0.40740001201629639,0.93129998445510864,0.25130000710487366,0.55409997701644897,4.4500000774860382E-2,0.81419998407363892,0.4699999988079071,0.54570001363754272,0.3767000138759613,0.14710000157356262,0.73309999704360962]
[null,{"$f":"IF(G39<5,\"(ndc) Der Messprozess ist nicht in der Lage genügend viele Teile unterscheidbar zu messen\",\"(ndc) Der Messprozess ist  in der Lage genügend viele Teile unterscheidbar zu messen\")","v":"(ndc) Der Messprozess ist nicht in der Lage genügend viele Teile unterscheidbar zu messen"},null,null,null,null,null,null,null,null,null,null,null,null,null,null,{"$f":"sixmsa2_q42(V43,$AE$19:$AN$28)","v":19.010722222222224},null,{"$f":"AnzahlMessungen*AnzahlPruefer*AnzahlTeile-1","v":26},0.22040000557899475,{"$f":"Q43/S43","v":0.731181623931624},1,44116,0.21029999852180481,0.32319998741149902,0.42379999160766602,0.74129998683929443,0.1185000017285347,{"$f":"AC42+AC41+AC40","v":9.5609259259259227E-2},0.30920746960456702,0.4357999861240387,"Maximum - Q3",{"$f":"AG38-AG39","v":0.17000000000000015},{"$f":"AH38-AH39","v":0.40000000000000013},{"$f":"AI38-AI39","v":0.42000000000000004},0.8245999813079834,0.57330000400543213,0.76899999380111694,0.29399999976158142,7.0600003004074097E-2,0.62379997968673706,0.50249999761581421,0.68839997053146362,0.35240000486373901,0.63309997320175171,0.1606999933719635,0.9067000150680542,0.36970001459121704,0.81499999761581421,0.16410000622272491,0.49919998645782471,3.3799998462200165E-2,0.74769997596740723,0.84079998731613159,0.29460000991821289,0.42120000720024109,0.51429998874664307,4.0000001899898052E-3,0.6656000018119812,0.97659999132156372,9.3400001525878906E-2,0.78049999475479126,4.4199999421834946E-2,0.9659000039100647,0.99980002641677856,0.68870002031326294,0.68790000677108765,0.17949999868869781,0.17479999363422394,0.96670001745223999,0.69499999284744263,0.88520002365112305,0.12729999423027039,0.15049999952316284,0.27000001072883606,3.1599998474121094E-2,0.32409998774528503,0.90189999341964722,0.23960000276565552,0.70090001821517944,0.83090001344680786,8.6999997496604919E-2,0.81840002536773682,0.81260001659393311,0.20219999551773071,0.10400000214576721,0.62400001287460327,7.5800001621246338E-2,0.62279999256134033,0.46160000562667847,0.9430999755859375,0.19300000369548798,0.29780000448226929,0.60680001974105835,0.24690000712871552,0.31299999356269836,9.3500003218650818E-2,3.4000000450760126E-3,0.95690000057220459,0.73379999399185181]
[null,{"$f":"IF(W40<Y40,\"Der Einfluss durch den Prüfer ist nicht signifikant\",\"Der Einfluss durch den Prüfer ist  signifikant\")","v":"Der Einfluss durch den Prüfer ist  signifikant"},null,null,null,null,null,null,null,null,null,null,null,null,null,null,null,null,null,0.42779999971389771,0.45960000157356262,0.46050000190734863,0.8562999963760376,0.41119998693466187,0.70690000057220459,0.37619999051094055,0.38670000433921814,0.23710000514984131,{"$f":"IF(AC39>0,AC43+AC39,AC43)","v":1.0454703703703705},1.0224824547983062,0.22740000486373901,"Q1-Minimum",{"$f":"AG41-AG42","v":0.12},{"$f":"AH41-AH42","v":0.75},{"$f":"AI41-AI42","v":0.41999999999999993},6.9899998605251312E-2,0.79030001163482666,0.82270002365112305,0.33239999413490295,0.41999998688697815,0.99400001764297485,0.69900000095367432,0.49059998989105225,0.83340001106262207,0.34000000357627869,0.15250000357627869,0.9057999849319458,0.51080000400543213,0.78850001096725464,0.61479997634887695,0.34549999237060547,0.96249997615814209,0.37119999527931213,0.303600013256073,0.21860000491142273,0.77399998903274536,0.89389997720718384,0.11370000243186951,0.90390002727508545,0.6216999888420105,0.89020001888275146,0.75690001249313354,0.32800000905990601,0.53829997777938843,0.82419997453689575,0.15330000221729279,0.79329997301101685,0.42870000004768372,0.5439000129699707,7.1500003337860107E-2,5.6600000709295273E-2,0.83539998531341553,0.98420000076293945,1.9300000742077827E-2,0.6567000150680542,0.95429998636245728,0.1200999990105629,0.38460001349449158,0.49279999732971191,0.9000999927520752,0.16949999332427979,0.8255000114440918,0.65280002355575562,0.22229999303817749,4.6799998730421066E-2,0.91149997711181641,0.49079999327659607,0.67049998044967651,6.589999794960022E-2,1.3700000010430813E-2,0.95590001344680786,0.20999999344348907,0.89300000667572021,0.4456000030040741,0.17000000178813934,0.28760001063346863,0.75019997358322144,0.85390001535415649,0.25600001215934753,0.34729999303817749]
[null,{"$f":"IF(W39<Y39,\"Der Einfluss durch die einzelnen Teile ist nicht signifikant\",\"Der Einfluss durch die einzelnen Teile ist signifikant\")","v":"Der Einfluss durch die einzelnen Teile ist signifikant"},null,null,null,null,null,null,null,null,null,null,null,null,null,null,null,null,null,0.86809998750686646,0.8586999773979187,0.41580000519752502,0.59570002555847168,0.18960000574588776,0.94429999589920044,0.25859999656677246,1.7699999734759331E-2,0.32220000028610229,0.60030001401901245,0.37900000810623169,0.64219999313354492,0.74199998378753662,0.71130001544952393,0.18490000069141388,5.7599999010562897E-2,0.24609999358654022,0.19830000400543213,0.97610002756118774,0.17749999463558197,0.65609997510910034,0.9089999794960022,0.27180001139640808,0.2565000057220459,0.77109998464584351,0.75859999656677246,0.38920000195503235,0.15530000627040863,0.57090002298355103,0.12020000070333481,0.27160000801086426,0.85699999332427979,0.66909998655319214,0.46540001034736633,0.56620001792907715,0.23229999840259552,1.6200000420212746E-2,0.25540000200271606,0.95249998569488525,5.5100001394748688E-2,0.85280001163482666,8.0899998545646667E-2,0.72039997577667236,0.26829999685287476,0.91250002384185791,5.3300000727176666E-2,0.59810000658035278,0.49950000643730164,0.87540000677108765,0.44530001282691956,0.83069998025894165,0.82639998197555542,7.0799998939037323E-2,0.58099997043609619,0.50779998302459717,0.79250001907348633,0.43070000410079956,0.97710001468658447,0.14190000295639038,0.67269998788833618,0.69270002841949463,0.73339998722076416,0.49649998545646667,0.98900002241134644,0.85320001840591431,0.17299999296665192,0.66420000791549683,0.27630001306533813,0.87050002813339233,0.73360002040863037,0.39469999074935913,9.7499996423721313E-2,0.61799997091293335,0.10760000348091125,0.67339998483657837,0.30970001220703125,8.7200000882148743E-2,0.63289999961853027,0.54869997501373291,0.57940000295639038,0.84079998731613159]
[null,{"$f":"IF(W41<Y41,\"Der Einfluss durch die Wechselwirkung Prüfer und Teil ist nicht signifikant\",\"Der Einfluss durch die Wechselwirkung Prüfer und Teil ist  signifikant\")","v":"Der Einfluss durch die Wechselwirkung Prüfer und Teil ist nicht signifikant"},null,null,null,null,null,null,null,null,null,null,null,null,null,null,null,null,null,0.93370002508163452,0.210999995470047,0.14839999377727509,0.71619999408721924,0.81080001592636108,0.32030001282691956,0.84920001029968262,0.77799999713897705,0.38240000605583191,0.58429998159408569,0.37090000510215759,0.52170002460479736,0.47470000386238098,0.58689999580383301,0.77460002899169922,0.32649999856948853,0.26269999146461487,0.86589998006820679,0.25900000333786011,0.15860000252723694,0.16030000150203705,0.24150000512599945,0.17640000581741333,0.52399998903274536,0.96170002222061157,0.39419999718666077,0.29760000109672546,0.67220002412796021,0.23139999806880951,0.69290000200271606,0.32850000262260437,4.8700001090764999E-2,0.94489997625350952,0.27320000529289246,0.67470002174377441,0.99849998950958252,0.37979999184608459,0.36539998650550842,0.45800000429153442,0.71929997205734253,0.25569999217987061,0.8726000189781189,0.78130000829696655,0.4643000066280365,0.12549999356269836,0.1988999992609024,0.24500000476837158,0.99550002813339233,1.5699999406933784E-2,0.32760000228881836,0.7117999792098999,0.28679999709129333,0.31679999828338623,0.14910000562667847,0.32280001044273376,0.47720000147819519,0.9244999885559082,3.9099998772144318E-2,0.76340001821517944,7.3899999260902405E-2,0.62980002164840698,0.68699997663497925,0.77799999713897705,0.40520000457763672,0.75999999046325684,0.17360000312328339,0.93660002946853638,0.32409998774528503,6.9099999964237213E-2,0.2994999885559082,0.64999997615814209,0.16089999675750732,0.8783000111579895,0.16310000419616699,0.43520000576972961,0.92669999599456787,0.46700000762939453,0.98900002241134644,0.43140000104904175,0.76620000600814819,0.71319997310638428]
[null,null,null,null,null,null,null,null,null,null,null,null,null,null,null,null,null,null,null,0.20559999346733093,0.16570000350475311,0.66130000352859497,0.98420000076293945,0.77369999885559082,0.56819999217987061,0.38370001316070557,0.27720001339912415,0.76429998874664307,0.23810000717639923,0.69840002059936523,0.6096000075340271,0.18709999322891235,"Wert nach Teil Darstellung",null,null,null,null,null,null,null,null,0.45649999380111694,8.999999612569809E-3,0.53130000829696655,0.61210000514984131,0.86360001564025879,0.31499999761581421,0.28040000796318054,0.61330002546310425,0.36520001292228699,0.54500001668930054,0.63660001754760742,0.65609997510910034,0.15209999680519104,0.68839997053146362,0.94389998912811279,0.77149999141693115,0.94370001554489136,0.14990000426769257,0.30099999904632568,0.72610002756118774,0.25310000777244568,0.95219999551773071,0.95190000534057617,0.84960001707077026,0.90329998731613159,0.18940000236034393,0.92720001935958862,0.1136000007390976,0.79220002889633179,0.72990000247955322,0.93379998207092285,0.45930001139640808,0.90869998931884766,0.16979999840259552,0.49619999527931213,0.37580001354217529,0.59799998998641968,3.5700000822544098E-2,0.34689998626708984,0.7281000018119812,7.7500000596046448E-2,0.23810000717639923,6.7100003361701965E-2,0.8353000283241272,0.20219999551773071,0.77439999580383301,0.97710001468658447,0.79900002479553223,0.48050001263618469,0.6819000244140625,0.27720001339912415,8.0700002610683441E-2,0.33970001339912415,0.24130000174045563,0.43799999356269836,0.33070001006126404,0.64170002937316895,0.42950001358985901,0.84170001745223999]
[null,null,null,null,null,null,null,null,null,null,null,null,null,null,null,null,null,null,null,0.46579998731613159,0.44850000739097595,0.6226000189781189,null,0.9976000189781189,3.7999998778104782E-2,0.54960000514984131,5.4000001400709152E-2,0.61040002107620239,{"$f":"(U49-U52)/(calculation!AnzahlPruefer*calculation!AnzahlMessungen_r)","v":0.94757777777777796},{"$f":"IF(AC48<0,0,SQRT(AC48))","v":0.97343606763761226},0.1695999950170517,0.49489998817443848,{"$f":"$D$17","v":"Gerber"},null,null,{"$f":"$G$17","v":"Bohnert"},null,null,{"$f":"$J$17","v":"Zimmer"},null,null,0.84729999303817749,0.32539999485015869,0.86500000953674316,0.5121999979019165,0.20999999344348907,0.88599997758865356,0.4869999885559082,0.98439997434616089,2.9100000858306885E-2,0.97210001945495605,0.84920001029968262,0.28670001029968262,0.2054000049829483,0.44319999217987061,0.6851000189781189,0.28119999170303345,0.96530002355575562,0.1835000067949295,0.65490001440048218,4.9800001084804535E-2,0.87550002336502075,5.4600000381469727E-2,0.4862000048160553,0.47220000624656677,0.10949999839067459,9.8800003528594971E-2,0.36460000276565552,5.4000001400709152E-2,0.96289998292922974,0.99220001697540283,0.57429999113082886,5.1000001840293407E-3,0.61860001087188721,0.74779999256134033,0.38890001177787781,0.56749999523162842,0.16339999437332153,0.66860002279281616,0.21170000731945038,0.59340000152587891,0.85240000486373901,0.55080002546310425,0.96670001745223999,0.37369999289512634,0.62589997053146362,0.13689999282360077,0.73869997262954712,0.7159000039100647,0.87389999628067017,0.81889998912811279,0.6646999716758728,0.27219998836517334,0.45249998569488525,0.59119999408721924,7.3799997568130493E-2,0.11749999970197678,0.94919997453689575,0.25380000472068787,0.8781999945640564]
[null,null,null,null,null,null,null,null,null,null,null,null,null,null,null,null,{"$f":"Q39","v":17.123400000000004},null,{"$f":"AnzahlTeile_n-1","v":2},0.57770001888275146,{"$f":"U39","v":8.5617000000000019},0.19840000569820404,{"$f":"U49/U52","v":255.57313432835835},0.86570000648498535,{"$f":"FINV(0.05,S49,S52)","v":3.4433567793667246},{"$f":"IF(W49>Y49,1,0)","v":1},0.21349999308586121,0.30820000171661377,{"$f":"IF((U50-U52)/(calculation!AnzahlTeile*calculation!AnzahlMessungen_r)<0,0,(U50-U52)/(calculation!AnzahlTeile*calculation!AnzahlMessungen_r))","v":5.525925925925923E-2},{"$f":"IF(AC49=0,\"\",SQRT(AC49))","v":0.23507288073969576},4.7400001436471939E-2,1,{"$f":"IF(C19=\"\",NA(),C19)","v":0.28999999999999998},{"$f":"IF(D19=\"\",NA(),D19)","v":0.41},{"$f":"IF(E19=\"\",NA(),E19)","v":0.64},{"$f":"IF(F19=\"\",NA(),F19)","v":0.08},{"$f":"IF(G19=\"\",NA(),G19)","v":0.25},{"$f":"IF(H19=\"\",NA(),H19)","v":7.0000000000000007E-2},{"$f":"IF(I19=\"\",NA(),I19)","v":0.04},{"$f":"IF(J19=\"\",NA(),J19)","v":-0.11},{"$f":"IF(K19=\"\",NA(),K19)","v":-0.15},0.44769999384880066,0.33000001311302185,0.62099999189376831,0.3718000054359436,0.93569999933242798,0.73259997367858887,6.4000003039836884E-2,0.34110000729560852,0.38359999656677246,0.57169997692108154,0.24809999763965607,0.9343000054359436,0.41679999232292175,0.28389999270439148,0.92629998922348022,0.70560002326965332,0.93500000238418579,0.48249998688697815,0.32100000977516174,0.8003000020980835,6.5399996936321259E-2,9.8200000822544098E-2,0.70240002870559692,0.21969999372959137,0.36599999666213989,0.76990002393722534,0.21690000593662262,0.33750000596046448,0.27849999070167542,0.48480001091957092,0.9649999737739563,0.66490000486373901,0.83149999380111694,0.46970000863075256,0.32910001277923584,0.86669999361038208,0.59369999170303345,0.33090001344680786,0.55229997634887695,2.630000002682209E-2,0.87690001726150513,0.44549998641014099,0.56620001792907715,0.16189999878406525,0.1890999972820282,0.60170000791549683,6.8599998950958252E-2,0.99169999361038208,0.93809998035430908,0.88929998874664307,0.85240000486373901,0.94999998807907104,0.38370001316070557,0.84069997072219849,0.38330000638961792,0.45239999890327454,0.84179997444152832,0.82109999656677246,0.62779998779296875]
[null,null,null,null,null,null,null,null,null,null,null,null,null,null,null,null,{"$f":"Q40","v":1.0616666666666661},null,{"$f":"AnzahlPruefer_k-1","v":2},0.41139999032020569,{"$f":"U40","v":0.53083333333333305},0.13689999282360077,{"$f":"U50/U52","v":15.845771144278604},0.66949999332427979,{"$f":"FINV(0.05,S50,S52)","v":3.4433567793667246},{"$f":"IF(W50>Y50,1,0)","v":1},0.13179999589920044,2.4000001139938831E-3,0.30540001392364502,0.58899998664855957,0.34799998998641968,2,-0.56000000000000005,-0.68,-0.57999999999999996,-0.47,-1.22,-0.68,-1.38,-1.1299999999999999,-0.96,0.67919999361038208,0.54879999160766602,0.28780001401901245,0.21480000019073486,0.43930000066757202,0.43669998645782471,0.36939999461174011,0.98400002717971802,0.33989998698234558,0.36010000109672546,0.97339999675750732,0.29899999499320984,0.26339998841285706,0.23430000245571136,0.66649997234344482,0.5228000283241272,0.93309998512268066,0.45219999551773071,0.58240002393722534,0.31639999151229858,0.17849999666213989,8.7399996817111969E-2,0.81290000677108765,0.4666999876499176,0.4512999951839447,0.34709998965263367,4.8700001090764999E-2,0.96480000019073486,0.59109997749328613,0.27559998631477356,0.46939998865127563,0.33390000462532043,0.84049999713897705,0.70730000734329224,0.88459998369216919,0.20759999752044678,0.11129999905824661,0.46950000524520874,0.12449999898672104,0.15800000727176666,0.49959999322891235,0.83609998226165771,0.68040001392364502,0.77380001544952393,5.1899999380111694E-2,0.23010000586509705,0.59530001878738403,0.98830002546310425,0.78060001134872437,0.17730000615119934,0.60460001230239868,0.65799999237060547,0.92919999361038208,0.50900000333786011,0.52670001983642578,0.38989999890327454,0.4885999858379364,0.81529998779296875,0.90369999408721924]
[null,null,null,null,null,null,null,null,null,null,{"$f":"0","v":0},null,null,null,null,null,null,null,null,0.62040001153945923,0.96230000257492065,0.14839999377727509,0.89190000295639038,0.9430999755859375,0.38199999928474426,0.97539997100830078,0.40250000357627869,0.68699997663497925,{"$f":"U52","v":3.3499999999999988E-2},0.18303005217723123,0.57359999418258667,3,1.34,1.17,1.27,1.19,0.94,1.34,0.88,1.0900000000000001,0.67,0.3815000057220459,0.49219998717308044,0.74430000782012939,0.67229998111724854,0.52319997549057007,3.8000000640749931E-3,0.64920002222061157,0.88859999179840088,0.33149999380111694,0.45699998736381531,0.90530002117156982,0.52380001544952393,0.46500000357627869,0.18860000371932983,0.56419998407363892,0.23589999973773956,0.51279997825622559,0.74370002746582031,5.3500000387430191E-2,0.55449998378753662,0.44789999723434448,0.51590001583099365,0.25470000505447388,0.64719998836517334,0.33009999990463257,0.6380000114440918,0.83190000057220459,0.33489999175071716,0.25940001010894775,0.12290000170469284,0.8091999888420105,0.35740000009536743,0.5788000226020813,0.25369998812675476,0.39930000901222229,0.88910001516342163,0.32769998908042908,0.22499999403953552,8.150000125169754E-2,0.30450001358985901,0.94489997625350952,3.2699998468160629E-2,0.92989999055862427,0.19410000741481781,0.22179999947547913,0.61559998989105225,0.19140000641345978,0.62970000505447388,0.50520002841949463,0.24500000476837158,0.11379999667406082,0.68010002374649048,0.15099999308586121,0.16629999876022339,2.4100000038743019E-2,0.17710000276565552,0.22679999470710754,0.48879998922348022,0.65640002489089966]
[null,null,null,null,null,null,null,null,null,null,{"$f":"K51+K13","v":0.1},null,null,null,null,null,{"$f":"Q42+Q41","v":0.73699999999999977},null,{"$f":"S41+S42","v":22},0.73040002584457397,{"$f":"Q52/S52","v":3.3499999999999988E-2},0.46549999713897705,0.32690000534057617,0.73040002584457397,0.99400001764297485,0.46779999136924744,0.19030000269412994,0.77910000085830688,{"$f":"AC51+AC49","v":8.8759259259259218E-2},0.29792492218553857,0.18140000104904175,4,{"$error":"#N/A"},{"$error":"#N/A"},{"$error":"#N/A"},{"$error":"#N/A"},{"$error":"#N/A"},{"$error":"#N/A"},{"$error":"#N/A"},{"$error":"#N/A"},{"$error":"#N/A"},0.15590000152587891,0.62510001659393311,0.22689999639987946,0.8310999870300293,0.47659999132156372,0.1039000004529953,0.71850001811981201,0.82270002365112305,0.35379999876022339,0.16689999401569366,0.69580000638961792,0.64190000295639038,0.89230000972747803,0.81209999322891235,0.22709999978542328,0.89679998159408569,0.83090001344680786,0.13629999756813049,8.4700003266334534E-2,8.3099998533725739E-2,0.24490000307559967,0.22560000419616699,7.2999998927116394E-2,0.5997999906539917,0.49990001320838928,0.29570001363754272,0.60699999332427979,1.4700000174343586E-2,0.45469999313354492,8.3099998533725739E-2,0.53990000486373901,0.58039999008178711,0.91409999132156372,0.48530000448226929,0.24179999530315399,0.99949997663497925,0.33270001411437988,0.45159998536109924,0.92720001935958862,0.4406999945640564,0.76730000972747803,0.12359999865293503,0.23360000550746918,0.80379998683929443,8.0499999225139618E-2,0.22609999775886536,4.960000142455101E-2,0.23589999973773956,0.39390000700950623,0.70719999074935913,0.59280002117156982,0.89670002460479736,0.7906000018119812,0.62959998846054077,0.7379000186920166,0.97430002689361572,0.26899999380111694,0.31069999933242798,0.59520000219345093]
[null,null,null,null,null,null,null,null,null,null,{"$f":"K14-K13","v":0.19999999999999998},null,null,null,null,null,{"$f":"SUM(Q49:Q52)","v":18.922066666666669},null,{"$f":"S43","v":26},0.9506000280380249,0.94569998979568481,0.71350002288818359,0.33820000290870667,0.11729999631643295,0.50840002298355103,8.7099999189376831E-2,0.28220000863075256,0.34099999070167542,{"$f":"IF(AC48>0,AC52+AC48,AC52)","v":1.0363370370370373},1.0180064032397032,0.91949999332427979,5,{"$error":"#N/A"},{"$error":"#N/A"},{"$error":"#N/A"},{"$error":"#N/A"},{"$error":"#N/A"},{"$error":"#N/A"},{"$error":"#N/A"},{"$error":"#N/A"},{"$error":"#N/A"},0.857200026512146,0.21230000257492065,7.9499997198581696E-2,0.3684999942779541,0.76719999313354492,0.96119999885559082,0.64660000801086426,0.47600001096725464,0.26820001006126404,0.23759999871253967,0.72850000858306885,0.74610000848770142,0.16019999980926514,0.70469999313354492,0.14900000393390656,0.27009999752044678,0.48210000991821289,0.30730000138282776,0.88510000705718994,0.67900002002716064,0.65319997072219849,0.85110002756118774,0.33309999108314514,0.34709998965263367,0.86269998550415039,0.82999998331069946,0.82340002059936523,0.84520000219345093,0.71149998903274536,0.50459998846054077,0.38690000772476196,0.64319998025894165,0.10199999809265137,0.23010000586509705,0.77020001411437988,6.3699997961521149E-2,0.37880000472068787,3.4600000828504562E-2,0.70149999856948853,0.48500001430511475,0.71979999542236328,0.44740000367164612,0.40590000152587891,0.79400002956390381,0.77640002965927124,0.57649999856948853,0.37119999527931213,8.9699998497962952E-2,0.56440001726150513,0.4375,0.3635999858379364,0.63599997758865356,0.60420000553131104,0.53119999170303345,0.69330000877380371,6.5200001001358032E-2,0.31200000643730164,0.67170000076293945,0.72990000247955322]
[null,null,null,null,null,null,null,null,null,null,{"$f":"1-K14","v":0.7},null,null,null,null,null,null,null,null,0.83069998025894165,0.63999998569488525,6.5099999308586121E-2,0.66829997301101685,0.91019999980926514,0.96700000762939453,0.63679999113082886,0.54430001974105835,0.75919997692108154,0.23960000276565552,0.61030000448226929,0.49990001320838928,6,{"$error":"#N/A"},{"$error":"#N/A"},{"$error":"#N/A"},{"$error":"#N/A"},{"$error":"#N/A"},{"$error":"#N/A"},{"$error":"#N/A"},{"$error":"#N/A"},{"$error":"#N/A"},0.51370000839233398,0.3619999885559082,0.33509999513626099,0.29940000176429749,0.44359999895095825,0.83730000257492065,0.36469998955726624,9.4700001180171967E-2,0.65560001134872437,0.65759998559951782,0.78479999303817749,0.44100001454353333,4.6500001102685928E-2,0.44519999623298645,0.79159998893737793,0.56260001659393311,0.50620001554489136,0.84249997138977051,0.5195000171661377,0.86820000410079956,0.37110000848770142,0.15360000729560852,0.11990000307559967,0.71660000085830688,0.1265999972820282,0.23370000720024109,8.8600002229213715E-2,0.43279999494552612,0.3612000048160553,0.63099998235702515,0.84439998865127563,0.57289999723434448,0.96850001811981201,0.97619998455047607,0.55709999799728394,0.44020000100135803,0.60130000114440918,0.62400001287460327,0.22529999911785126,0.85060000419616699,0.37409999966621399,0.54309999942779541,5.2999998442828655E-3,0.148499995470047,0.81650000810623169,0.45719999074935913,0.78850001096725464,0.47220000624656677,7.6399996876716614E-2,0.23559999465942383,2.9699999839067459E-2,0.26930001378059387,0.37259998917579651,0.53359997272491455,0.82539999485015869,6.3000001013278961E-2,0.69880002737045288,0.68330001831054688,0.2418999969959259]
[null,null,null,null,null,null,null,null,null,null,null,null,null,null,null,null,null,null,null,0.46709999442100525,0.77590000629425049,0.83410000801086426,0.89329999685287476,0.45179998874664307,0.25560000538825989,0.34349998831748962,0.7695000171661377,0.85949999094009399,0.17329999804496765,0.41769999265670776,0.31470000743865967,7,{"$error":"#N/A"},{"$error":"#N/A"},{"$error":"#N/A"},{"$error":"#N/A"},{"$error":"#N/A"},{"$error":"#N/A"},{"$error":"#N/A"},{"$error":"#N/A"},{"$error":"#N/A"},0.17030000686645508,0.65149998664855957,2.0000000949949026E-3,0.75540000200271606,0.51740002632141113,0.85250002145767212,0.92170000076293945,0.67830002307891846,0.95329999923706055,0.18189999461174011,0.27250000834465027,0.85839998722076416,0.96469998359680176,0.74159997701644897,6.1400000005960464E-2,0.33779999613761902,0.23880000412464142,3.2900001853704453E-2,9.7000002861022949E-2,0.75290000438690186,0.67839998006820679,0.90960001945495605,0.13019999861717224,0.91299998760223389,0.66790002584457397,0.78109997510910034,0.24529999494552612,0.62860000133514404,0.58869999647140503,6.589999794960022E-2,0.49979999661445618,0.78920000791549683,0.58490002155303955,0.89389997720718384,0.8156999945640564,0.69129997491836548,0.57889997959136963,6.0499999672174454E-2,0.11980000138282776,0.61710000038146973,0.53710001707077026,0.22910000383853912,0.73449999094009399,0.66210001707077026,0.98549997806549072,0.38429999351501465,1.810000091791153E-2,0.81330001354217529,0.7750999927520752,0.53519999980926514,0.25600001215934753,0.27770000696182251,9.790000319480896E-2,0.66850000619888306,0.80070000886917114,5.9999998658895493E-2,0.7523999810218811,0.95149999856948853,0.4627000093460083]
[null,null,null,null,null,null,null,null,null,null,null,null,null,null,null,null,null,null,null,0.79079997539520264,0.65890002250671387,0.18520000576972961,0.15150000154972076,0.80479997396469116,0.62580001354217529,0.50770002603530884,0.7653999924659729,0.46919998526573181,0.36430001258850098,0.34689998626708984,0.33289998769760132,8,{"$error":"#N/A"},{"$error":"#N/A"},{"$error":"#N/A"},{"$error":"#N/A"},{"$error":"#N/A"},{"$error":"#N/A"},{"$error":"#N/A"},{"$error":"#N/A"},{"$error":"#N/A"},0.76130002737045288,0.75510001182556152,0.62419998645782471,0.40270000696182251,9.6799999475479126E-2,0.36300000548362732,0.20690000057220459,0.6851000189781189,0.40819999575614929,0.20329999923706055,0.6119999885559082,0.94160002470016479,0.47279998660087585,0.75700002908706665,0.95899999141693115,0.1265999972820282,0.49039998650550842,0.23649999499320984,0.1729000061750412,0.77710002660751343,0.91210001707077026,0.10149999707937241,0.43759998679161072,0.65399998426437378,0.51800000667572021,0.82410001754760742,0.89899998903274536,0.63230001926422119,0.74540001153945923,0.90479999780654907,0.61799997091293335,0.84200000762939453,0.2669999897480011,0.13830000162124634,0.77340000867843628,5.8499999344348907E-2,0.81889998912811279,0.12839999794960022,0.11569999903440475,0.34349998831748962,0.27880001068115234,5.4600000381469727E-2,0.66949999332427979,0.9351000189781189,0.99419999122619629,0.68680000305175781,0.68720000982284546,0.38929998874664307,0.36050000786781311,0.65160000324249268,0.85149997472763062,0.96960002183914185,0.64899998903274536,0.94760000705718994,0.72939997911453247,0.28859999775886536,8.5000000894069672E-2,0.71109998226165771,0.47429999709129333]
[null,null,null,null,null,null,null,null,null,null,null,null,null,null,null,null,null,null,null,0.19769999384880066,0.17620000243186951,0.23170000314712524,0.77990001440048218,0.928600013256073,0.2904999852180481,0.21799999475479126,8.3099998533725739E-2,0.48309999704360962,0.48449999094009399,0.31299999356269836,1.6899999231100082E-2,9,{"$error":"#N/A"},{"$error":"#N/A"},{"$error":"#N/A"},{"$error":"#N/A"},{"$error":"#N/A"},{"$error":"#N/A"},{"$error":"#N/A"},{"$error":"#N/A"},{"$error":"#N/A"},0.27450001239776611,0.5812000036239624,0.86019998788833618,0.11400000005960464,1.7699999734759331E-2,0.4982999861240387,0.91860002279281616,0.75940001010894775,0.87000000476837158,0.82660001516342163,0.52880001068115234,0.3937000036239624,0.82160001993179321,0.65750002861022949,0.22849999368190765,0.96660000085830688,0.33649998903274536,0.66189998388290405,0.8180999755859375,0.63950002193450928,0.24289999902248383,0.41769999265670776,0.37619999051094055,0.73890000581741333,0.87379997968673706,0.98820000886917114,0.52549999952316284,0.95929998159408569,0.4578000009059906,0.75010001659393311,0.94809997081756592,0.81679999828338623,0.75959998369216919,0.47179999947547913,0.15139999985694885,0.35170000791549683,0.97070002555847168,0.64139997959136963,0.48359999060630798,8.1799998879432678E-2,0.85000002384185791,4.479999840259552E-2,0.39939999580383301,0.20569999516010284,0.11420000344514847,0.59409999847412109,0.97549998760223389,5.5700000375509262E-2,7.9000003635883331E-2,0.40520000457763672,0.67640000581741333,0.80119997262954712,0.54900002479553223,0.12630000710487366,0.36959999799728394,0.40130001306533813,0.95880001783370972,0.51609998941421509,0.59200000762939453]
[null,null,null,null,null,null,null,null,null,null,null,null,null,null,null,null,null,null,null,0.80849999189376831,0.76370000839233398,0.27169999480247498,6.4800001680850983E-2,0.42170000076293945,7.9899996519088745E-2,0.10670000314712524,0.4595000147819519,0.78880000114440918,0.57529997825622559,7.9599998891353607E-2,0.41319999098777771,10,{"$error":"#N/A"},{"$error":"#N/A"},{"$error":"#N/A"},{"$error":"#N/A"},{"$error":"#N/A"},{"$error":"#N/A"},{"$error":"#N/A"},{"$error":"#N/A"},{"$error":"#N/A"},0.56069999933242798,0.61049997806549072,0.17149999737739563,0.794700026512146,0.69370001554489136,0.62879997491836548,0.11490000039339066,0.21989999711513519,0.90289998054504395,0.79729998111724854,0.47089999914169312,0.81709998846054077,0.36539998650550842,0.89730000495910645,0.95819997787475586,0.24320000410079956,0.67330002784729004,0.4650999903678894,3.060000017285347E-2,0.94889998435974121,3.6899998784065247E-2,0.18219999969005585,0.70569998025894165,0.69450002908706665,0.73769998550415039,0.51660001277923584,0.64230000972747803,0.31560000777244568,0.83170002698898315,0.6128000020980835,0.46919998526573181,0.73849999904632568,0.10239999741315842,0.43279999494552612,0.36289998888969421,0.24590000510215759,0.26390001177787781,0.14650000631809235,0.87610000371932983,0.99269998073577881,0.41429999470710754,0.77270001173019409,1.5399999916553497E-2,0.77149999141693115,0.73849999904632568,6.9200001657009125E-2,0.56959998607635498,2.8100000694394112E-2,0.46119999885559082,0.67369997501373291,0.68800002336502075,0.12720000743865967,5.0599999725818634E-2,0.49450001120567322,0.70829999446868896,0.868399977684021,0.67110002040863037,0.35100001096725464,0.23469999432563782]
[null,null,null,null,null,null,null,null,null,null,null,null,null,null,null,null,null,null,null,0.25110000371932983,0.88650000095367432,0.86430001258850098,0.46639999747276306,0.49079999327659607,0.61299997568130493,0.59799998998641968,0.77530002593994141,0.28420001268386841,0.32269999384880066,0.44870001077651978,0.5340999960899353,0.32539999485015869,0.49639999866485596,0.28650000691413879,0.19490000605583191,7.0900000631809235E-2,0.32659998536109924,0.84579998254776001,0.61680001020431519,0.7555999755859375,0.6711999773979187,0.86599999666213989,0.64440000057220459,0.65839999914169312,0.25600001215934753,0.48179998993873596,0.93569999933242798,0.61769998073577881,0.12829999625682831,0.86430001258850098,4.0300000458955765E-2,0.79720002412796021,0.35949999094009399,0.1111999973654747,0.72759997844696045,0.70130002498626709,0.99889999628067017,0.38760000467300415,0.56480002403259277,0.44100001454353333,0.27630001306533813,0.31650000810623169,0.74510002136230469,0.2492000013589859,5.5199999362230301E-2,0.61979997158050537,0.1656000018119812,0.24650000035762787,0.53609997034072876,8.2999998703598976E-3,0.75599998235702515,0.45699998736381531,0.20960000157356262,0.32310000061988831,5.6099999696016312E-2,7.3600001633167267E-2,5.9300001710653305E-2,0.92549997568130493,4.4199999421834946E-2,0.97369998693466187,1.5300000086426735E-2,0.33790001273155212,0.21529999375343323,0.48519998788833618,0.65700000524520874,0.13480000197887421,0.9089999794960022,0.40139999985694885,0.16629999876022339,8.2699999213218689E-2,0.88779997825622559,0.24740000069141388,0.53090000152587891,0.53130000829696655,0.16529999673366547,0.79519999027252197,0.99699997901916504,5.3899999707937241E-2,8.3899997174739838E-2,0.82959997653961182]
[null,null,null,null,null,null,null,null,null,null,null,null,null,null,null,null,null,null,null,0.77310001850128174,0.33809998631477356,0.6435999870300293,0.16349999606609344,0.98250001668930054,0.32640001177787781,7.9400002956390381E-2,0.90399998426437378,0.86680001020431519,0.60659998655319214,0.69010001420974731,0.96770000457763672,"R / x quer Karte Berechnung",null,null,null,null,null,null,null,null,null,0.96450001001358032,"R ","OEG","R Karte",0.90049999952316284,"UEG","OEG","X quer Karte",0.23469999432563782,0.4927000105381012,"x quer quer",{"$f":"AVERAGE(C19:K28)","v":0.1388888888888889},0.87419998645782471,0.45089998841285706,0.99489998817443848,0.22820000350475311,0.87010002136230469,0.10589999705553055,0.3513999879360199,0.44409999251365662,0.61640000343322754,0.93569999933242798,0.90640002489089966,0.89639997482299805,0.15710000693798065,0.87059998512268066,0.6809999942779541,8.4600001573562622E-2,0.30660000443458557,0.52960002422332764,0.63080000877380371,0.70429998636245728,0.29069998860359192,0.29840001463890076,0.41159999370574951,0.35040000081062317,0.63669997453689575,0.65719997882843018,0.39500001072883606,0.47060000896453857,0.31439998745918274,0.75910001993179321,0.9341999888420105,0.5680999755859375,0.1265999972820282,0.25830000638961792,0.87929999828338623,0.65499997138977051,0.34970000386238098,0.3880000114440918,0.34319999814033508,0.95509999990463257,0.62449997663497925,0.28850001096725464,0.71700000762939453,0.85740000009536743,9.6400000154972076E-2,0.58579999208450317,0.93580001592636108]
[null,null,null,null,null,null,null,null,null,null,null,null,null,null,null,null,null,null,null,0.11909999698400497,0.80669999122619629,0.21899999678134918,0.9944000244140625,0.31859999895095825,0.33239999413490295,0.51910001039505005,0.7125999927520752,0.55879998207092285,0.67750000953674316,0.53659999370574951,0.75110000371932983,0.41999998688697815,{"$f":"$D$17","v":"Gerber"},null,null,{"$f":"$G$17","v":"Bohnert"},null,null,{"$f":"$J$17","v":"Zimmer"},null,null,0.47979998588562012,{"$f":"BA61","v":0.33333333333333331},{"$f":"AS61*BA61","v":0.85799999999999987},{"$f":"IF($I$19=\"\",BC63,BC64)","v":2.5739999999999998},0.1835000067949295,{"$f":"$BA$60-(BA61*AW61)","v":-0.20211111111111107},{"$f":"$BA$60+(BA61*AW61)","v":0.47988888888888886},{"$f":"IF($I$19=\"\",BA63,BA64)","v":1.0229999999999999},0.77380001544952393,8.6300000548362732E-2,"R ",{"$f":"AVERAGE(AG63:AG72,AJ63:AJ72,AM63:AM72)","v":0.33333333333333331},0.33619999885559082,0.71240001916885376,0.14350000023841858,0.35839998722076416,0.62639999389648438,0.77170002460479736,0.42570000886917114,0.38130000233650208,0.19959999620914459,0.37650001049041748,0.8880000114440918,0.41449999809265137,8.959999680519104E-2,0.9879000186920166,0.45930001139640808,0.73409998416900635,0.28040000796318054,0.21660000085830688,0.62000000476837158,0.96109998226165771,0.72170001268386841,0.77590000629425049,0.54309999942779541,0.63929998874664307,0.59469997882843018,0.68449997901916504,0.48449999094009399,6.3299998641014099E-2,0.82770001888275146,0.72009998559951782,0.42379999160766602,0.35710000991821289,0.86159998178482056,0.12229999899864197,0.95469999313354492,0.80159997940063477,0.66589999198913574,0.54570001363754272,0.42599999904632568,0.41339999437332153,3.7000000011175871E-3,0.2630000114440918,0.33190000057220459,0.77230000495910645,0.94779998064041138,0.618399977684021,0.95260000228881836]
[null,null,null,null,null,null,null,null,null,null,null,null,null,null,null,null,null,null,null,9.9699996411800385E-2,0.64630001783370972,0.73019999265670776,0.24529999494552612,0.58700001239776611,0.33799999952316284,0.44449999928474426,0.98449999094009399,0.97320002317428589,0.61809998750686646,0.53789997100830078,0.15270000696182251,0.3734000027179718,"Range","x quer",0.95399999618530273,"Range","x quer",0.17100000381469727,"Range","s",0.58079999685287476,0.35659998655319214,{"$f":"AQ60","v":"R "},{"$f":"AR60","v":"OEG"},"max",0.45080000162124634,"UEG","OEG","X quer Karte","max","min","n","A2","D3","D4",0.59109997749328613,0.83950001001358032,0.27439999580383301,0.86680001020431519,8.5500001907348633E-2,0.37880000472068787,0.83829998970031738,0.87929999828338623,0.18500000238418579,0.91949999332427979,0.94870001077651978,0.60019999742507935,0.11630000174045563,9.3699999153614044E-2,0.77230000495910645,0.34160000085830688,0.50569999217987061,0.33480000495910645,7.0699997246265411E-2,0.63129997253417969,0.33210000395774841,1.8999999389052391E-2,0.77819997072219849,0.47870001196861267,0.12989999353885651,0.85519999265670776,0.83020001649856567,0.89020001888275146,0.44249999523162842,0.52619999647140503,0.24120000004768372,0.63499999046325684,0.52490001916885376,0.57889997959136963,0.43290001153945923,0.26039999723434448,0.29750001430511475,0.56519997119903564,0.81230002641677856,0.35769999027252197,0.54860001802444458,0.43230000138282776,0.60000002384185791,7.8000001609325409E-2,0.38789999485015869]
[null,null,null,null,null,null,null,null,null,null,null,null,null,null,null,null,null,null,null,0.16369999945163727,0.90799999237060547,0.89740002155303955,0.94940000772476196,0.66960000991821289,6.8199999630451202E-2,0.63289999961853027,0.3449999988079071,0.92760002613067627,0.21029999852180481,0.70770001411437988,0.86669999361038208,1,{"$f":"IF(D19=\"\",\"\",MAX(C19:E19)-MIN(C19:E19))","v":0.35000000000000003},{"$f":"IF(D19=\"\",\"\",AVERAGE(C19:E19))","v":0.4466666666666666},0.3734000027179718,{"$f":"IF(G19=\"\",\"\",MAX(F19:H19)-MIN(F19:H19))","v":0.18},{"$f":"IF(G19=\"\",\"\",AVERAGE(F19:H19))","v":0.13333333333333333},9.0000003576278687E-2,{"$f":"IF(J19=\"\",\"\",MAX(I19:K19)-MIN(I19:K19))","v":0.19},{"$f":"IF(J19=\"\",\"\",AVERAGE(I19:K19))","v":-7.3333333333333334E-2},0.66750001907348633,0.4406999945640564,{"$f":"$AQ$61","v":0.33333333333333331},{"$f":"$AR$61","v":0.85799999999999987},{"$f":"MAX(AG63:AG72,AJ63:AJ72,AM63:AM72,AR63:AR72)","v":0.85799999999999987},0.54119998216629028,{"$f":"AU61","v":-0.20211111111111107},{"$f":"AV61","v":0.47988888888888886},{"$f":"BA60","v":0.1388888888888889},{"$f":"MAX(AH63:AH71,AK63:AK71,AN63:AN71)","v":1.26},{"$f":"MIN(AH63:AH72,AK63:AK72,AN63:AN72)","v":-1.1566666666666665},2,1.88,0.16709999740123749,3.2669999999999999,0.94539999961853027,0.33009999990463257,0.95440000295639038,0.93349999189376831,0.87779998779296875,8.7800003588199615E-2,0.26649999618530273,0.49160000681877136,0.97020000219345093,0.76010000705718994,0.65130001306533813,0.3822999894618988,0.41260001063346863,0.33939999341964722,0.44389998912811279,0.66299998760223389,0.84520000219345093,0.46759998798370361,3.0999999493360519E-2,0.23589999973773956,0.37400001287460327,0.38929998874664307,0.99190002679824829,0.42590001225471497,0.83639997243881226,0.15449999272823334,0.4885999858379364,0.80900001525878906,0.31709998846054077,7.2099998593330383E-2,0.90700000524520874,0.29039999842643738,0.9132000207901001,0.41290000081062317,0.74709999561309814,0.43230000138282776,0.75029999017715454,0.3628000020980835,0.76389998197555542,3.2499998807907104E-2,0.24789999425411224,0.2257000058889389,0.3578999936580658,0.95209997892379761,0.63499999046325684]
[null,null,null,null,null,null,null,null,null,null,null,null,null,null,null,null,null,null,null,0.87709999084472656,0.21559999883174896,0.19370000064373016,0.7160000205039978,0.46660000085830688,0.20029999315738678,0.23000000417232513,0.88580000400543213,0.37139999866485596,0.49279999732971191,0.5810999870300293,0.39599999785423279,2,0.12,{"$f":"IF(D20=\"\",\"\",AVERAGE(C20:E20))","v":-0.6066666666666668},0.39959999918937683,{"$f":"IF(G20=\"\",\"\",MAX(F20:H20)-MIN(F20:H20))","v":0.75},{"$f":"IF(G20=\"\",\"\",AVERAGE(F20:H20))","v":-0.79},0.98189997673034668,{"$f":"IF(J20=\"\",\"\",MAX(I20:K20)-MIN(I20:K20))","v":0.41999999999999993},{"$f":"IF(J20=\"\",\"\",AVERAGE(I20:K20))","v":-1.1566666666666665},0.64349997043609619,0.87029999494552612,0.33333333333333331,0.85799999999999987,{"$f":"AS63","v":0.85799999999999987},0.24269999563694,{"$f":"AU63","v":-0.20211111111111107},{"$f":"AV63","v":0.47988888888888886},{"$f":"AW63","v":0.1388888888888889},{"$f":"AX63","v":1.26},{"$f":"AY63","v":-1.1566666666666665},3,1.0229999999999999,0.90479999780654907,2.5739999999999998,0.76749998331069946,6.9799996912479401E-2,0.17949999868869781,0.73830002546310425,0.58579999208450317,0.90920001268386841,2.8599999845027924E-2,0.33880001306533813,0.59119999408721924,0.72219997644424438,0.35179999470710754,0.33329999446868896,0.96539998054504395,0.77670001983642578,0.90719997882843018,0.75989997386932373,0.65630000829696655,4.1099999099969864E-2,0.35240000486373901,0.95870000123977661,0.70670002698898315,0.19959999620914459,0.19750000536441803,0.7117999792098999,0.83230000734329224,0.91780000925064087,8.1000002101063728E-3,0.63459998369216919,0.24969999492168427,0.35820001363754272,0.85890001058578491,0.81599998474121094,0.75459998846054077,0.94630002975463867,3.6200001835823059E-2,0.70920002460479736,5.000000074505806E-2,0.38580000400543213,0.99150002002716064,0.27219998836517334,0.32400000095367432,0.92419999837875366,0.54449999332427979,0.35870000720024109,7.8599996864795685E-2]
[null,null,null,null,null,null,null,null,null,null,null,null,null,null,null,null,null,null,null,0.86879998445510864,0.335999995470047,0.35830000042915344,0.2070000022649765,0.35190001130104065,0.53149998188018799,8.7499998509883881E-2,0.32240000367164612,0.34670001268386841,0.77380001544952393,0.93010002374649048,0.33579999208450317,3,0.17000000000000015,1.26,0.93290001153945923,{"$f":"IF(G21=\"\",\"\",MAX(F21:H21)-MIN(F21:H21))","v":0.40000000000000013},1.1566666666666665,0.38650000095367432,0.42000000000000004,0.88,0.22800000011920929,0.28389999270439148,0.33333333333333331,0.85799999999999987,{"$f":"AS64","v":0.85799999999999987},0.81220000982284546,{"$f":"AU64","v":-0.20211111111111107},{"$f":"AV64","v":0.47988888888888886},{"$f":"AW64","v":0.1388888888888889},{"$f":"AX64","v":1.26},{"$f":"AY64","v":-1.1566666666666665},0.82690000534057617,0.92180001735687256,0.40799999237060547,7.4100002646446228E-2,0.38920000195503235,0.44110000133514404,0.48120000958442688,0.21119999885559082,0.15780000388622284,0.84560000896453857,0.38710001111030579,0.38530001044273376,0.21009999513626099,0.21539999544620514,0.94789999723434448,0.94249999523162842,6.9799996912479401E-2,0.29179999232292175,2.099999925121665E-3,0.17949999868869781,0.41010001301765442,0.36779999732971191,0.73329997062683105,0.35830000042915344,6.6999997943639755E-3,0.42890000343322754,0.2476000040769577,0.97269999980926514,0.94090002775192261,0.54339998960494995,0.40239998698234558,0.26359999179840088,5.2900001406669617E-2,0.50340002775192261,0.883899986743927,0.98430001735687256,0.64480000734329224,0.71520000696182251,0.53570002317428589,0.41679999232292175,0.43369999527931213,0.3400999903678894,0.93680000305175781,0.63660001754760742,0.75480002164840698,0.68470001220703125,0.22949999570846558,2.930000051856041E-2,1.4700000174343586E-2]
[null,null,null,null,null,null,null,null,null,null,null,null,null,null,null,null,null,null,null,0.84179997444152832,0.19779999554157257,5.5100001394748688E-2,0.39430001378059387,0.58099997043609619,0.59549999237060547,0.26559999585151672,0.80220001935958862,0.48939999938011169,0.72420001029968262,0.56840002536773682,7.7600002288818359E-2,4,"","",0.36190000176429749,"","",0.26129999756813049,"","",0.7434999942779541,0.44330000877380371,0.33333333333333331,0.85799999999999987,0.85799999999999987,0.84210002422332764,-0.20211111111111107,0.47988888888888886,0.1388888888888889,1.26,-1.1566666666666665,0.33849999308586121,0.20829999446868896,0.20929999649524689,0.31290000677108765,0.86979997158050537,3.3700000494718552E-2,0.72549998760223389,3.7000000476837158E-2,0.12929999828338623,0.20949999988079071,0.58499997854232788,0.54769998788833618,0.57969999313354492,0.16019999980926514,7.6999999582767487E-2,0.28949999809265137,0.9505000114440918,0.51020002365112305,0.89060002565383911,0.50840002298355103,0.56550002098083496,9.9899999797344208E-2,6.679999828338623E-2,0.39300000667572021,0.92170000076293945,0.25130000710487366,0.20280000567436218,0.46480000019073486,0.51690000295639038,0.28319999575614929,0.90420001745223999,0.21909999847412109,0.92820000648498535,0.27720001339912415,0.48890000581741333,1.5200000256299973E-2,0.1395999938249588,9.3299999833106995E-2,0.93940001726150513,0.2175000011920929,0.120899997651577,0.63520002365112305,0.10679999738931656,0.58590000867843628,0.65479999780654907,0.36649999022483826,0.16310000419616699,0.91610002517700195,0.41620001196861267]
[null,null,null,null,null,null,null,null,null,null,null,null,null,null,null,null,null,null,null,7.5800001621246338E-2,0.30500000715255737,0.93110001087188721,0.29929998517036438,0.89249998331069946,0.70660001039505005,0.42080000042915344,0.99639999866485596,0.55260002613067627,0.72269999980926514,0.63340002298355103,0.8255000114440918,5,"","",0.91399997472763062,"","",0.34189999103546143,"","",0.91570001840591431,0.80909997224807739,0.33333333333333331,0.85799999999999987,0.85799999999999987,0.7224000096321106,-0.20211111111111107,0.47988888888888886,0.1388888888888889,1.26,-1.1566666666666665,0.88969999551773071,0.60360002517700195,1.5999999595806003E-3,0.62669998407363892,0.98170000314712524,0.16300000250339508,6.7800000309944153E-2,0.44490000605583191,0.72649997472763062,0.580299973487854,0.11100000143051147,0.67960000038146973,0.17910000681877136,3.0000000260770321E-3,0.75139999389648438,0.2833000123500824,4.3900001794099808E-2,0.63040000200271606,0.45329999923706055,0.67460000514984131,0.62790000438690186,0.85420000553131104,0.10450000315904617,3.599999938160181E-3,4.3699998408555984E-2,0.64899998903274536,0.84340000152587891,0.66710001230239868,0.66269999742507935,0.21310000121593475,0.13750000298023224,7.5000002980232239E-2,0.81819999217987061,0.85920000076293945,0.11169999837875366,0.66530001163482666,0.75859999656677246,0.15459999442100525,0.12620000541210175,0.16990000009536743,0.85030001401901245,0.31220000982284546,0.60460001230239868,0.13050000369548798,3.1199999153614044E-2,0.83130002021789551,0.11209999769926071,0.66390001773834229,0.51349997520446777]
[null,null,null,null,null,null,null,null,null,null,null,null,null,null,null,null,null,null,null,0.38760000467300415,0.68379998207092285,0.47749999165534973,0.7369999885559082,0.97430002689361572,0.40239998698234558,0.13539999723434448,0.57200002670288086,0.29269999265670776,0.22669999301433563,0.57380002737045288,0.7728000283241272,6,{"$f":"IF(D24=\"\",\"\",MAX(C24:E24)-MIN(C24:E24))","v":""},"",0.39259999990463257,"","",6.9700002670288086E-2,"","",0.86629998683929443,0.68049997091293335,0.33333333333333331,0.85799999999999987,0.85799999999999987,0.56319999694824219,-0.20211111111111107,0.47988888888888886,0.1388888888888889,1.26,-1.1566666666666665,0.12649999558925629,0.24019999802112579,0.17630000412464142,0.47350001335144043,0.45249998569488525,0.34139999747276306,0.88459998369216919,0.56300002336502075,0.79180002212524414,0.75069999694824219,0.62580001354217529,0.68229997158050537,0.65479999780654907,0.74879997968673706,0.1200999990105629,0.98390001058578491,0.6468999981880188,0.33230000734329224,0.93999999761581421,6.2399998307228088E-2,4.6199999749660492E-2,0.47940000891685486,0.71380001306533813,0.3458000123500824,0.63179999589920044,0.66519999504089355,0.57849997282028198,0.73549997806549072,0.76190000772476196,0.62760001420974731,0.88289999961853027,0.49709999561309814,0.70200002193450928,0.38280001282691956,0.14120000600814819,0.40110000967979431,0.20290000736713409,0.49070000648498535,0.23549999296665192,0.11379999667406082,0.32879999279975891,0.57130002975463867,0.86909997463226318,0.83730000257492065,0.53560000658035278,6.9300003349781036E-2,0.26989999413490295,0.2004999965429306,0.99889999628067017]
[null,null,null,null,null,null,null,null,null,null,null,null,null,null,null,null,null,null,null,0.27039998769760132,0.14329999685287476,0.39980000257492065,0.19220000505447388,0.56679999828338623,0.87540000677108765,0.58960002660751343,0.71480000019073486,0.97280001640319824,0.98589998483657837,0.52289998531341553,0.37040001153945923,7,"","",0.89020001888275146,"","",0.83170002698898315,"","",0.44190001487731934,0.49459999799728394,0.33333333333333331,0.85799999999999987,0.85799999999999987,0.1242000013589859,-0.20211111111111107,0.47988888888888886,0.1388888888888889,1.26,-1.1566666666666665,0.55949997901916504,0.21870000660419464,0.53359997272491455,0.14910000562667847,0.3093000054359436,0.74589997529983521,0.87190002202987671,0.62360000610351563,0.66729998588562012,0.57749998569488525,0.91079998016357422,0.15659999847412109,0.36910000443458557,0.81879997253417969,0.39610001444816589,0.32300001382827759,0.25310000777244568,0.26780000329017639,0.99659997224807739,0.92890000343322754,0.46290001273155212,0.80540001392364502,0.13210000097751617,0.5275999903678894,0.90140002965927124,3.6100000143051147E-2,5.130000039935112E-2,0.18520000576972961,0.93300002813339233,0.17890000343322754,0.16040000319480896,0.49579998850822449,0.33739998936653137,0.20730000734329224,0.60079997777938843,0.84769999980926514,0.5121999979019165,0.24060000479221344,7.7399998903274536E-2,0.93879997730255127,0.92659997940063477,0.18410000205039978,0.93660002946853638,0.54210001230239868,0.82410001754760742,0.61989998817443848,0.49470001459121704,0.52139997482299805,0.17560000717639923]
[null,null,null,null,null,null,null,null,null,null,null,null,null,null,null,null,null,null,null,0.94739997386932373,0.61570000648498535,9.6900001168251038E-2,0.88279998302459717,0.7742999792098999,0.53979998826980591,0.36109998822212219,0.23119999468326569,0.55650001764297485,0.96100002527236938,4.3900001794099808E-2,0.59320002794265747,8,"","",0.48939999938011169,"","",0.35580000281333923,"","",0.52869999408721924,0.38109999895095825,0.33333333333333331,0.85799999999999987,0.85799999999999987,0.64829999208450317,-0.20211111111111107,0.47988888888888886,0.1388888888888889,1.26,-1.1566666666666665,0.56089997291564941,0.11789999902248383,0.25060001015663147,0.37909999489784241,0.60140001773834229,0.54820001125335693,0.55339998006820679,0.93839997053146362,0.76929998397827148,0.75690001249313354,4.1000001132488251E-2,0.38510000705718994,0.95090001821517944,0.89670002460479736,0.81709998846054077,0.72020000219345093,0.20579999685287476,0.60199999809265137,0.54119998216629028,0.2775999903678894,0.59429997205734253,0.50429999828338623,0.881600022315979,0.36509999632835388,0.25580000877380371,0.9976000189781189,0.21840000152587891,0.15469999611377716,0.7369999885559082,0.25429999828338623,0.59700000286102295,0.82300001382827759,0.56999999284744263,0.49079999327659607,0.93059998750686646,0.94260001182556152,0.10040000081062317,0.48309999704360962,0.45390000939369202,0.12169999629259109,0.56510001420974731,0.33230000734329224,0.42620000243186951,0.89569997787475586,0.42109999060630798,0.48030000925064087,8.3899997174739838E-2,0.86710000038146973,0.92309999465942383]
[null,null,null,null,null,null,null,null,null,null,null,null,null,null,null,null,null,null,null,0.97560000419616699,0.84439998865127563,9.66000035405159E-2,0.95169997215270996,0.98860001564025879,0.75880002975463867,0.743399977684021,9.1799996793270111E-2,0.57749998569488525,0.21500000357627869,0.95590001344680786,0.96020001173019409,9,"","",0.70370000600814819,"","",0.89120000600814819,"","",1.2600000016391277E-2,0.78450000286102295,0.33333333333333331,0.85799999999999987,0.85799999999999987,0.49779999256134033,-0.20211111111111107,0.47988888888888886,0.1388888888888889,1.26,-1.1566666666666665,0.95850002765655518,0.71240001916885376,0.23039999604225159,0.77469998598098755,0.53439998626708984,1.5200000256299973E-2,0.48030000925064087,0.7994999885559082,0.38580000400543213,0.93290001153945923,0.56150001287460327,0.30340000987052917,0.88209998607635498,0.66960000991821289,0.92379999160766602,0.74879997968673706,0.19859999418258667,1.2500000186264515E-2,0.26840001344680786,0.84520000219345093,0.76899999380111694,0.9724000096321106,0.62529999017715454,0.31490001082420349,0.98919999599456787,0.6743999719619751,0.68180000782012939,0.90829998254776001,0.17000000178813934,0.4982999861240387,0.36059999465942383,0.67009997367858887,0.74049997329711914,0.46970000863075256,0.6478000283241272,0.45410001277923584,0.70099997520446777,0.9002000093460083,0.6711999773979187,0.6898999810218811,0.32609999179840088,0.27799999713897705,2.8200000524520874E-2,0.39730000495910645,0.11810000240802765,0.40889999270439148,0.36419999599456787,0.4528999924659729,1.0099999606609344E-2]
[null,null,null,null,null,null,null,null,null,null,null,null,null,null,null,null,null,null,null,0.80659997463226318,0.2004999965429306,0.10540000349283218,0.81849998235702515,0.33360001444816589,1.2500000186264515E-2,0.74099999666213989,0.94720000028610229,9.1300003230571747E-2,0.55779999494552612,0.8992999792098999,0.33970001339912415,10,"","",0.56139999628067017,"","",0.45440000295639038,"","",0.53880000114440918,0.68300002813339233,0.33333333333333331,0.85799999999999987,0.85799999999999987,0.99589997529983521,-0.20211111111111107,0.47988888888888886,0.1388888888888889,1.26,-1.1566666666666665,8.7999999523162842E-3,0.55279999971389771,0.86000001430511475,5.7799998670816422E-2,0.2939000129699707,0.53460001945495605,0.6534000039100647,0.71210002899169922,0.47760000824928284,0.79309999942779541,0.69809997081756592,0.36620000004768372,0.40059998631477356,0.61919999122619629,0.6851000189781189,0.26010000705718994,0.40439999103546143,0.8004000186920166,0.81360000371932983,0.1080000028014183,0.40979999303817749,0.38699999451637268,0.49529999494552612,0.98799997568130493,0.24469999969005585,0.70779997110366821,0.30660000443458557,0.48320001363754272,0.2223999947309494,0.63539999723434448,0.19210000336170197,7.2099998593330383E-2,0.96960002183914185,0.10199999809265137,0.91769999265670776,0.76940000057220459,0.50480002164840698,0.86479997634887695,0.77389997243881226,1.6699999570846558E-2,0.56599998474121094,0.52230000495910645,0.5284000039100647,0.82270002365112305,0.18919999897480011,0.77890002727508545,0.62980002164840698,0.15430000424385071,0.53630000352859497]
[null,null,null,null,null,null,null,null,null,null,null,null,null,null,null,null,null,null,null,0.96139997243881226,0.66049998998641968,0.57709997892379761,0.97329998016357422,0.78430002927780151,3.9799999445676804E-2,0.14569999277591705,0.3986000120639801,0.36529999971389771,0.97680002450942993,0.54479998350143433,0.82059997320175171,0.49099999666213989,0.67409998178482056,0.47960001230239868,0.18649999797344208,0.13279999792575836,0.78039997816085815,0.31619998812675476,0.46000000834465027,0.21199999749660492,9.3800000846385956E-2,0.97280001640319824,0.94950002431869507,0.61589998006820679,0.51510000228881836,5.9799998998641968E-2,0.88620001077651978,0.46320000290870667,0.25060001015663147,0.27050000429153442,0.25240001082420349,0.61979997158050537,0.26550000905990601,2.199999988079071E-2,0.85939997434616089,0.46410000324249268,0.98680001497268677,0.34560000896453857,0.67580002546310425,0.90289998054504395,0.25659999251365662,2.759999968111515E-2,0.40549999475479126,0.63690000772476196,0.53519999980926514,0.99959999322891235,0.3158000111579895,0.67650002241134644,0.35420000553131104,0.97949999570846558,0.31589999794960022,0.10719999670982361,1.9500000402331352E-2,0.36179998517036438,0.28439998626708984,0.10520000010728836,0.56459999084472656,0.35859999060630798,0.64789998531341553,0.20350000262260437,0.95370000600814819,0.38980001211166382,0.20890000462532043,0.80680000782012939,0.53479999303817749,0.72399997711181641,0.22419999539852142,0.95759999752044678,0.74269998073577881,0.36910000443458557,0.73250001668930054,0.35179999470710754,5.2299998700618744E-2,0.21279999613761902,0.1331000030040741,0.60430002212524414,0.1817999929189682,0.41350001096725464,1.3700000010430813E-2,0.76440000534057617]
[null,null,null,null,null,null,null,null,null,null,null,null,null,null,null,null,null,null,null,0.54549998044967651,4.050000011920929E-2,0.22869999706745148,8.1699997186660767E-2,0.95709997415542603,0.9649999737739563,0.22699999809265137,2.1600000560283661E-2,0.58310002088546753,3.9999998989515007E-4,0.6305999755859375,0.53090000152587891,"R / x quer Karte Darstellung",null,null,null,null,null,null,null,null,null,0.99720001220703125,0.22499999403953552,0.743399977684021,0.27009999752044678,0.38159999251365662,0.15979999303817749,0.9244999885559082,1.9999999552965164E-2,0.5023999810218811,0.93650001287460327,0.42779999971389771,0.26039999723434448,0.78039997816085815,0.35460001230239868,0.66689997911453247,0.31299999356269836,0.56339997053146362,0.43349999189376831,0.39620000123977661,0.47679999470710754,0.26660001277923584,0.99040001630783081,0.97670000791549683,0.23170000314712524,0.76289999485015869,0.46849998831748962,0.8913000226020813,0.69120001792907715,2.4100000038743019E-2,1.510000042617321E-2,0.51069998741149902,0.30590000748634338,1.1300000362098217E-2,0.80959999561309814,0.10890000313520432,0.81629997491836548,0.81540000438690186,0.64190000295639038,0.12880000472068787,0.4560999870300293,4.7600001096725464E-2,0.74040001630783081,0.69789999723434448,0.40529999136924744,0.48059999942779541,0.8499000072479248,0.39390000700950623,0.49329999089241028,0.93849998712539673,0.56019997596740723,0.26039999723434448,0.15199999511241913,0.43819999694824219,0.88370001316070557,7.2200000286102295E-2,0.61909997463226318,0.57920002937316895,8.3999998867511749E-2,0.85140001773834229]
[null,null,null,null,null,null,null,null,null,null,null,null,null,null,null,null,null,null,null,0.39089998602867126,0.18479999899864197,0.75360000133514404,0.63289999961853027,0.92580002546310425,0.19269999861717224,0.14239999651908875,0.47949999570846558,0.59710001945495605,0.79519999027252197,0.73549997806549072,0.74830001592636108,0.89639997482299805,{"$f":"$D$17","v":"Gerber"},null,null,{"$f":"$G$17","v":"Bohnert"},null,null,{"$f":"$J$17","v":"Zimmer"},null,null,0.79400002956390381,0.90429997444152832,0.87150001525878906,0.26330000162124634,0.64520001411437988,0.51490002870559692,0.79659998416900635,0.4666999876499176,0.34860000014305115,0.71369999647140503,0.52369999885559082,0.56499999761581421,0.4650999903678894,0.3799000084400177,0.72759997844696045,0.59600001573562622,0.69370001554489136,0.97949999570846558,0.32260000705718994,0.87980002164840698,0.88650000095367432,0.51880002021789551,0.60250002145767212,0.59700000286102295,0.31439998745918274,0.74699997901916504,0.63190001249313354,0.61640000343322754,0.18310000002384186,0.60979998111724854,0.88639998435974121,0.57359999418258667,0.398499995470047,0.95230001211166382,0.14360000193119049,0.19900000095367432,0.58209997415542603,0.47189998626708984,0.62300002574920654,0.89569997787475586,0.33709999918937683,0.92189997434616089,0.37760001420974731,0.56770002841949463,0.76370000839233398,0.56440001726150513,0.93370002508163452,0.69830000400543213,0.22460000216960907,0.87330001592636108,0.18209999799728394,0.67799997329711914,0.36109998822212219,0.48759999871253967,0.51840001344680786,0.38249999284744263,0.35820001363754272,0.41429999470710754,0.23350000381469727]
[null,null,null,null,null,null,null,null,null,null,null,null,null,null,null,null,null,null,null,1.0000000474974513E-3,0.46070000529289246,0.48199999332427979,0.15469999611377716,0.11460000276565552,0.73849999904632568,4.349999874830246E-2,0.53600001335144043,2.370000071823597E-2,0.10220000147819519,0.92909997701644897,0.19869999587535858,0.32679998874664307,"Range","x quer",0.569100022315979,"Range","x quer",0.64990001916885376,"Range","s",0.92220002412796021,0.74839997291564941,0.77819997072219849,0.85079997777938843,8.4399998188018799E-2,0.21690000593662262,0.756600022315979,1.3500000350177288E-2,0.5526999831199646,0.1932000070810318,0.93449997901916504,0.40970000624656677,0.82419997453689575,0.24830000102519989,0.41110000014305115,0.30450001358985901,0.41639998555183411,0.89179998636245728,0.47009998559951782,0.4090999960899353,0.50819998979568481,0.64990001916885376,0.34540000557899475,0.58410000801086426,0.82999998331069946,0.39350000023841858,0.23690000176429749,0.79280000925064087,0.80489999055862427,0.91640001535415649,0.57569998502731323,0.30390000343322754,0.93870002031326294,0.76330000162124634,0.54009997844696045,0.14519999921321869,0.460999995470047,0.30809998512268066,0.82120001316070557,0.80620002746582031,0.21549999713897705,8.1699997186660767E-2,0.6381000280380249,0.1914999932050705,0.80110001564025879,0.35069999098777771,4.19999985024333E-3,0.82389998435974121,0.9617999792098999,0.94489997625350952,0.24230000376701355,0.29739999771118164,0.2281000018119812,0.33590000867843628,0.75040000677108765,0.9804999828338623,0.8069000244140625,0.96480000019073486,1.7200000584125519E-2,0.9692000150680542]
[null,null,null,null,null,null,null,null,null,null,null,null,null,null,null,null,null,null,null,0.72289997339248657,0.82069998979568481,0.88819998502731323,0.29019999504089355,0.20839999616146088,0.2687000036239624,8.060000091791153E-2,0.35389998555183411,0.34459999203681946,0.12790000438690186,0.94940000772476196,0.65780001878738403,1,{"$f":"IF(AG63=\"\",NA(),AG63)","v":0.35000000000000003},{"$f":"IF(AH63=\"\",NA(),AH63)","v":0.4466666666666666},0.3734000027179718,0.18,0.13333333333333333,9.0000003576278687E-2,0.19,-7.3333333333333334E-2,0.66750001907348633,0.95179998874664307,0.99980002641677856,0.50309997797012329,0.73919999599456787,0.73040002584457397,0.84600001573562622,0.6689000129699707,0.37860000133514404,0.65109997987747192,0.81669998168945313,0.80879998207092285,5.3100001066923141E-2,0.59570002555847168,0.32870000600814819,0.48469999432563782,0.63880002498626709,0.24789999425411224,0.3937000036239624,0.47459998726844788,0.36460000276565552,0.23389999568462372,0.19599999487400055,3.7900000810623169E-2,1.4999999664723873E-2,0.51249998807907104,0.92079997062683105,0.43079999089241028,0.38319998979568481,1.6499999910593033E-2,0.83279997110366821,0.67259997129440308,0.97439998388290405,0.54290002584457397,0.60360002517700195,0.56069999933242798,0.95889997482299805,0.89340001344680786,0.89029997587203979,0.93639999628067017,0.37509998679161072,0.26530000567436218,0.16329999268054962,0.20069999992847443,0.58249998092651367,0.89230000972747803,0.78469997644424438,7.9599998891353607E-2,0.96539998054504395,0.9343000054359436,0.33649998903274536,0.64029997587203979,0.88529998064041138,0.61909997463226318,0.19840000569820404,0.555899977684021,0.88459998369216919,0.63230001926422119,0.37590000033378601,0.62220001220703125]
[null,null,null,null,null,null,null,null,null,null,null,null,null,null,null,null,null,null,null,0.13930000364780426,0.75800001621246338,0.57899999618530273,0.52209997177124023,0.1624000072479248,0.76990002393722534,0.5494999885559082,0.84219998121261597,0.75709998607635498,0.57120001316070557,0.63990002870559692,0.33790001273155212,2,{"$f":"IF(AG64=\"\",NA(),AG64)","v":0.12},-0.6066666666666668,0.39959999918937683,0.75,-0.79,0.98189997673034668,0.41999999999999993,-1.1566666666666665,0.64349997043609619,0.21940000355243683,0.58590000867843628,0.64090001583099365,0.44920000433921814,0.79180002212524414,0.39899998903274536,0.86009997129440308,6.6399998962879181E-2,0.36640000343322754,0.64730000495910645,0.44949999451637268,0.54540002346038818,0.4375,0.1598999947309494,0.98430001735687256,0.97369998693466187,0.3052000105381012,0.34900000691413879,0.29030001163482666,0.68580001592636108,0.5284000039100647,0.85039997100830078,0.52259999513626099,2.8999999165534973E-2,0.62800002098083496,0.41420000791549683,0.49369999766349792,0.37880000472068787,3.9799999445676804E-2,4.5200001448392868E-2,0.25110000371932983,0.40470001101493835,0.31779998540878296,0.39410001039505005,0.90600001811981201,0.58579999208450317,0.58730000257492065,0.39730000495910645,0.71109998226165771,0.97630000114440918,0.24809999763965607,0.16809999942779541,0.38899999856948853,0.22130000591278076,0.92739999294281006,0.13740000128746033,0.70990002155303955,0.8223000168800354,0.68309998512268066,0.44389998912811279,0.32010000944137573,0.65299999713897705,0.45690000057220459,0.57480001449584961,0.82010000944137573,0.72460001707077026,0.77740001678466797,0.25690001249313354,9.2399999499320984E-2]
[null,null,null,null,null,null,null,null,null,null,null,null,null,null,null,null,null,null,null,0.20180000364780426,0.71340000629425049,0.5965999960899353,0.88010001182556152,0.6679999828338623,7.6700001955032349E-2,0.47099998593330383,0.61460000276565552,0.64149999618530273,0.87529999017715454,0.16820000112056732,0.49399998784065247,3,{"$f":"IF(AG65=\"\",NA(),AG65)","v":0.17000000000000015},1.26,0.93290001153945923,0.40000000000000013,1.1566666666666665,0.38650000095367432,0.42000000000000004,0.88,0.22800000011920929,0.34049999713897705,1.679999940097332E-2,0.27810001373291016,0.81099998950958252,0.69919997453689575,0.26129999756813049,0.83300000429153442,0.53140002489089966,0.63309997320175171,0.4244999885559082,0.69819998741149902,0.12160000205039978,0.55510002374649048,0.83090001344680786,0.2125999927520752,0.62749999761581421,0.14020000398159027,1.7000000923871994E-2,7.9400002956390381E-2,1.9000000320374966E-3,0.34240001440048218,0.6841999888420105,0.50669997930526733,0.68320000171661377,0.6590999960899353,0.90219998359680176,0.59799998998641968,0.42309999465942383,0.64759999513626099,0.56190001964569092,0.99309998750686646,0.36500000953674316,0.69029998779296875,7.8699998557567596E-2,0.75840002298355103,0.37200000882148743,1.0300000198185444E-2,0.34540000557899475,0.52780002355575562,0.60509997606277466,0.93739998340606689,0.93559998273849487,0.89310002326965332,0.35109999775886536,0.42309999465942383,0.55669999122619629,4.4900000095367432E-2,0.10119999945163727,0.80709999799728394,0.75279998779296875,0.66280001401901245,0.87849998474121094,0.83190000057220459,0.85829997062683105,5.6600000709295273E-2,0.81660002470016479,0.90930002927780151,0.20059999823570251,0.55629998445510864]
[null,null,null,null,null,null,null,null,null,null,null,null,null,null,null,null,null,null,null,0.98769998550415039,0.63550001382827759,0.55349999666213989,0.15320000052452087,0.48039999604225159,0.55699998140335083,0.8400999903678894,0.39030000567436218,0.72820001840591431,0.18600000441074371,8.6099997162818909E-2,0.5031999945640564,4,{"$f":"IF(AG66=\"\",NA(),AG66)","v":{"$error":"#N/A"}},{"$error":"#N/A"},0.36190000176429749,{"$error":"#N/A"},{"$error":"#N/A"},0.26129999756813049,{"$error":"#N/A"},{"$error":"#N/A"},0.7434999942779541,8.7300002574920654E-2,0.26620000600814819,0.62279999256134033,0.81000000238418579,0.66490000486373901,0.28850001096725464,0.5406000018119812,0.3531000018119812,0.39739999175071716,0.25639998912811279,0.39120000600814819,0.78850001096725464,0.3783000111579895,0.70149999856948853,0.14200000464916229,0.52770000696182251,0.43659999966621399,0.9496999979019165,0.3781999945640564,0.12710000574588776,0.96469998359680176,0.63630002737045288,0.75620001554489136,0.92970001697540283,0.99650001525878906,0.47170001268386841,0.70709997415542603,0.95509999990463257,0.53579998016357422,0.25740000605583191,0.38949999213218689,4.0300000458955765E-2,0.13410000503063202,0.15099999308586121,0.89230000972747803,0.23010000586509705,0.71909999847412109,0.18250000476837158,0.68870002031326294,0.41830000281333923,0.67229998111724854,1.940000057220459E-2,0.33849999308586121,0.23770000040531158,0.15770000219345093,0.98250001668930054,0.44159999489784241,0.20110000669956207,0.69940000772476196,0.31159999966621399,0.84109997749328613,9.1700002551078796E-2,1.0200000368058681E-2,0.68120002746582031,7.6399996876716614E-2,0.60399997234344482,6.9399997591972351E-2,0.96579998731613159,8.619999885559082E-2]
[null,null,null,null,null,null,null,null,null,null,null,null,null,null,null,null,null,null,null,0.23399999737739563,0.45100000500679016,0.25580000877380371,0.16179999709129333,0.4203999936580658,0.90200001001358032,0.12300000339746475,0.15029999613761902,0.93459999561309814,0.17010000348091125,0.13629999756813049,0.90750002861022949,5,{"$f":"IF(AG67=\"\",NA(),AG67)","v":{"$error":"#N/A"}},{"$error":"#N/A"},0.91399997472763062,{"$error":"#N/A"},{"$error":"#N/A"},0.34189999103546143,{"$error":"#N/A"},{"$error":"#N/A"},0.91570001840591431,0.5218999981880188,8.2299999892711639E-2,0.6273999810218811,8.9999998454004526E-4,0.79170000553131104,0.87290000915527344,0.7060999870300293,0.66329997777938843,0.35820001363754272,0.76130002737045288,0.52640002965927124,0.99570000171661377,0.23139999806880951,0.78060001134872437,0.80159997940063477,0.42019999027252197,0.45719999074935913,0.8554999828338623,0.57050001621246338,0.38339999318122864,8.2999998703598976E-3,0.13019999861717224,0.21240000426769257,0.30950000882148743,0.92479997873306274,0.54699999094009399,0.71329998970031738,0.80309998989105225,0.70480000972747803,0.67400002479553223,0.18109999597072601,0.10300000011920929,0.94510000944137573,0.78350001573562622,0.61159998178482056,0.78460001945495605,0.23160000145435333,0.18009999394416809,0.90359997749328613,0.71340000629425049,0.28020000457763672,0.7785000205039978,0.12520000338554382,0.24819999933242798,0.32739999890327454,0.93220001459121704,2.8699999675154686E-2,0.6940000057220459,0.77060002088546753,0.51090002059936523,0.81699997186660767,5.1000001840293407E-3,5.9200000017881393E-2,0.22949999570846558,0.15860000252723694,0.73860001564025879,0.83469998836517334,0.22540000081062317,0.45329999923706055]
[null,null,null,null,null,null,null,null,null,null,null,null,null,null,null,null,null,null,null,0.25690001249313354,0.32190001010894775,0.8871999979019165,0.34830000996589661,0.18160000443458557,0.96909999847412109,0.93229997158050537,0.5033000111579895,9.5899999141693115E-2,0.33869999647140503,0.73559999465942383,0.60619997978210449,6,{"$f":"IF(AG68=\"\",NA(),AG68)","v":{"$error":"#N/A"}},{"$error":"#N/A"},0.39259999990463257,{"$error":"#N/A"},{"$error":"#N/A"},6.9700002670288086E-2,{"$error":"#N/A"},{"$error":"#N/A"},0.86629998683929443,0.49810001254081726,0.2484000027179718,0.90729999542236328,0.63919997215270996,4.9000000581145287E-3,0.16089999675750732,0.12099999934434891,0.39379999041557312,0.80400002002716064,0.8255000114440918,0.19200000166893005,0.23669999837875366,0.35760000348091125,0.16789999604225159,0.40529999136924744,0.12549999356269836,0.35539999604225159,0.43140000104904175,9.3599997460842133E-2,0.87419998645782471,0.9179999828338623,0.56720000505447388,0.46579998731613159,0.66900002956390381,4.9499999731779099E-2,0.87510001659393311,0.68480002880096436,0.83370000123977661,0.34099999070167542,0.89440000057220459,0.1956000030040741,0.84520000219345093,0.92369997501373291,0.5439000129699707,0.30390000343322754,0.5997999906539917,0.67199999094009399,0.51330000162124634,3.5000001080334187E-3,0.92799997329711914,0.65640002489089966,0.90310001373291016,5.4999999701976776E-2,0.36059999465942383,0.84700000286102295,0.11580000072717667,0.31369999051094055,0.14440000057220459,6.6299997270107269E-2,0.99610000848770142,0.30770000815391541,0.50730001926422119,0.19259999692440033,0.22190000116825104,6.6200003027915955E-2,0.17460000514984131,0.6129000186920166,0.94450002908706665,0.19730000197887421]
[null,null,null,null,null,null,null,null,null,null,null,null,null,null,null,null,null,null,null,0.13400000333786011,0.92619997262954712,0.67970001697540283,0.21649999916553497,0.65189999341964722,0.89639997482299805,0.44810000061988831,0.12460000067949295,0.5382000207901001,0.65570002794265747,0.1656000018119812,0.23579999804496765,7,{"$f":"IF(AG69=\"\",NA(),AG69)","v":{"$error":"#N/A"}},{"$error":"#N/A"},0.89020001888275146,{"$error":"#N/A"},{"$error":"#N/A"},0.83170002698898315,{"$error":"#N/A"},{"$error":"#N/A"},0.44190001487731934,0.66269999742507935,0.15739999711513519,0.28459998965263367,0.25609999895095825,0.72020000219345093,0.87959998846054077,0.68400001525878906,0.61100000143051147,0.24650000035762787,0.77740001678466797,0.8101000189781189,2.4000000208616257E-2,0.88380002975463867,0.4869999885559082,6.719999760389328E-2,0.34450000524520874,0.89620000123977661,0.77819997072219849,0.45849999785423279,0.62599998712539673,0.93559998273849487,0.25780001282691956,0.47609999775886536,0.45429998636245728,5.7399999350309372E-2,0.32249999046325684,0.24220000207424164,0.52560001611709595,0.98559999465942383,0.36230000853538513,0.8992999792098999,0.47420001029968262,0.62900000810623169,0.21349999308586121,0.25130000710487366,0.95160001516342163,0.8465999960899353,0.86159998178482056,0.65380001068115234,0.95349997282028198,0.46320000290870667,0.39500001072883606,0.15449999272823334,0.39879998564720154,0.5349000096321106,0.20739999413490295,0.88450002670288086,0.95709997415542603,0.86510002613067627,0.45149999856948853,0.69830000400543213,0.12729999423027039,0.76969999074935913,0.74190002679824829,6.4699999988079071E-2,0.56550002098083496,9.3000002205371857E-2,0.10819999873638153,0.20739999413490295]
[null,null,null,null,null,null,null,null,null,null,null,null,null,null,null,null,null,null,null,0.66310000419616699,0.47330000996589661,0.19810000061988831,0.49549999833106995,0.375,0.85829997062683105,0.73059999942779541,8.449999988079071E-2,0.29769998788833618,0.27120000123977661,0.19939999282360077,0.80650001764297485,8,{"$f":"IF(AG70=\"\",NA(),AG70)","v":{"$error":"#N/A"}},{"$error":"#N/A"},0.48939999938011169,{"$error":"#N/A"},{"$error":"#N/A"},0.35580000281333923,{"$error":"#N/A"},{"$error":"#N/A"},0.52869999408721924,0.99739998579025269,0.8256000280380249,0.82529997825622559,0.3107999861240387,0.58819997310638428,0.99199998378753662,0.76010000705718994,0.45500001311302185,0.5601000189781189,0.11259999871253967,0.53909999132156372,0.94520002603530884,0.85729998350143433,0.16750000417232513,0.7849000096321106,0.22679999470710754,0.2062000036239624,0.79000002145767212,0.15970000624656677,0.625,0.69349998235702515,0.53250002861022949,0.56919997930526733,0.73559999465942383,0.59439998865127563,0.38179999589920044,0.61529999971389771,6.5399996936321259E-2,0.45070001482963562,0.52499997615814209,0.29910001158714294,0.92330002784729004,0.39899998903274536,0.36500000953674316,0.97460001707077026,0.5601000189781189,0.74860000610351563,0.78619998693466187,0.55129998922348022,0.55989998579025269,0.80989998579025269,0.66990000009536743,0.9473000168800354,0.48039999604225159,0.9724000096321106,0.66019999980926514,0.79290002584457397,0.74360001087188721,3.2699998468160629E-2,0.17960000038146973,0.38339999318122864,0.77619999647140503,0.77300000190734863,0.69450002908706665,0.88200002908706665,0.40059998631477356,0.78869998455047607,0.23070000112056732,0.77359998226165771]
[null,null,null,null,null,null,null,null,null,null,null,null,null,null,null,null,null,null,null,0.47530001401901245,0.56690001487731934,0.13950000703334808,0.56709998846054077,0.78539997339248657,0.81449997425079346,0.11270000040531158,0.74919998645782471,0.18359999358654022,3.6200001835823059E-2,0.44879999756813049,0.98729997873306274,9,{"$f":"IF(AG71=\"\",NA(),AG71)","v":{"$error":"#N/A"}},{"$error":"#N/A"},0.70370000600814819,{"$error":"#N/A"},{"$error":"#N/A"},0.89120000600814819,{"$error":"#N/A"},{"$error":"#N/A"},1.2600000016391277E-2,0.98040002584457397,0.36269998550415039,0.56819999217987061,0.58230000734329224,0.58520001173019409,0.62870001792907715,0.77920001745223999,0.17239999771118164,0.39640000462532043,0.70130002498626709,0.29309999942779541,0.68540000915527344,0.94239997863769531,5.7799998670816422E-2,0.49050000309944153,0.54280000925064087,0.2720000147819519,0.61400002241134644,0.43630000948905945,0.11180000007152557,0.59530001878738403,0.80239999294281006,0.64579999446868896,0.40950000286102295,0.17419999837875366,0.9000999927520752,9.9899999797344208E-2,5.5300001055002213E-2,0.4625999927520752,0.607200026512146,0.51109999418258667,0.47429999709129333,0.49790000915527344,0.87470000982284546,0.83890002965927124,0.35040000081062317,0.54079997539520264,0.98250001668930054,5.559999868273735E-2,0.32929998636245728,0.96640002727508545,0.86809998750686646,0.16179999709129333,0.97210001945495605,0.40459999442100525,0.70410001277923584,0.45179998874664307,0.95759999752044678,0.13089999556541443,0.72670000791549683,2.9899999499320984E-2,0.53619998693466187,0.70690000057220459,0.31360000371932983,0.57520002126693726,0.23260000348091125,0.87080001831054688,0.31220000982284546,0.35780000686645508]
[null,null,null,null,null,null,null,null,null,null,null,null,null,null,null,null,null,null,null,0.79909998178482056,0.67849999666213989,0.61799997091293335,0.50429999828338623,0.41859999299049377,0.8935999870300293,2.099999925121665E-3,0.51319998502731323,0.15770000219345093,0.62860000133514404,0.19009999930858612,2.0800000056624413E-2,10,{"$f":"IF(AG72=\"\",NA(),AG72)","v":{"$error":"#N/A"}},{"$error":"#N/A"},0.56139999628067017,{"$error":"#N/A"},{"$error":"#N/A"},0.45440000295639038,{"$error":"#N/A"},{"$error":"#N/A"},0.53880000114440918,0.67019999027252197,0.23499999940395355,0.18950000405311584,0.81679999828338623,0.14959999918937683,0.44429999589920044,0.86830002069473267,0.10970000177621841,0.53289997577667236,0.75859999656677246,0.78299999237060547,4.2599998414516449E-2,0.95310002565383911,9.1099999845027924E-2,0.25659999251365662,0.45890000462532043,0.44269999861717224,0.65649998188018799,0.7070000171661377,0.91769999265670776,0.88690000772476196,0.11230000108480453,0.22460000216960907,0.95959997177124023,0.22640000283718109,0.94870001077651978,0.40130001306533813,0.62220001220703125,0.91060000658035278,0.12960000336170197,0.40770000219345093,0.20589999854564667,0.60110002756118774,0.98320001363754272,0.32159999012947083,0.28940001130104065,0.12430000305175781,0.34259998798370361,0.70649999380111694,0.99529999494552612,0.67479997873306274,0.93639999628067017,0.4390999972820282,0.50580000877380371,0.2685999870300293,2.930000051856041E-2,0.78780001401901245,0.82829999923706055,0.44600000977516174,0.31259998679161072,0.74059998989105225,0.81089997291564941,0.22499999403953552,4.5400001108646393E-2,0.58350002765655518,0.4083000123500824,0.30399999022483826,0.44440001249313354,0.72850000858306885]
[null,null,null,null,null,null,null,null,null,null,null,null,null,null,null,null,null,null,null,0.19730000197887421,0.51529997587203979,0.32519999146461487,0.79149997234344482,0.14229999482631683,0.52829998731613159,0.99250000715255737,0.92089998722076416,0.61100000143051147,0.80229997634887695,0.38080000877380371,0.37509998679161072,0.63999998569488525,0.78960001468658447,0.44549998641014099,0.3513999879360199,0.45070001482963562,0.38909998536109924,0.80260002613067627,6.3400000333786011E-2,0.21449999511241913,0.64880001544952393,0.62040001153945923,6.9399997591972351E-2,6.8599998950958252E-2,0.71950000524520874,0.75900000333786011,0.85089999437332153,0.38170000910758972,5.7599999010562897E-2,0.16210000216960907,0.63990002870559692,0.26980000734329224,0.87809997797012329,0.4966999888420105,0.49790000915527344,0.36109998822212219,0.85820001363754272,4.3999999761581421E-2,0.64340001344680786,0.81260001659393311,8.9900001883506775E-2,0.84020000696182251,3.0300000682473183E-2,0.57499998807907104,0.28360000252723694,6.7100003361701965E-2,0.17599999904632568,0.90850001573562622,0.22069999575614929,0.69249999523162842,0.23960000276565552,0.14869999885559082,0.45730000734329224,0.36090001463890076,0.34970000386238098,0.72200000286102295,0.2768000066280365,0.53439998626708984,0.18289999663829803,0.41110000014305115,0.89349997043609619,0.88300001621246338,0.79180002212524414,0.87080001831054688,0.90520000457763672,0.92519998550415039,0.68300002813339233,0.3937000036239624,0.99690002202987671,0.9189000129699707,0.14540000259876251,0.92559999227523804,0.89340001344680786,1.9000000320374966E-3,0.82819998264312744,0.33149999380111694,0.56300002336502075,0.58249998092651367,0.56919997930526733,0.91049998998641968]
[null,null,null,null,null,null,null,null,null,null,null,null,null,null,null,null,null,null,null,0.66979998350143433,0.98000001907348633,0.47269999980926514,0.1624000072479248,0.27770000696182251,0.31560000777244568,0.23759999871253967,0.80239999294281006,0.80309998989105225,0.65280002355575562,0.73589998483657837,2.7499999850988388E-2,0.21789999306201935,0.38830000162124634,0.84039998054504395,3.1599998474121094E-2,0.50279998779296875,0.89209997653961182,0.50309997797012329,0.77120000123977661,0.35060000419616699,0.3986000120639801,8.320000022649765E-2,0.9812999963760376,0.11909999698400497,0.14730000495910645,0.9253000020980835,0.4406999945640564,3.4000001847743988E-2,0.77300000190734863,0.18729999661445618,0.48789998888969421,0.64249998331069946,0.94650000333786011,0.9189000129699707,0.78659999370574951,0.51639997959136963,0.26570001244544983,0.38940000534057617,0.34110000729560852,0.2046000063419342,0.39550000429153442,0.66600000858306885,0.76239997148513794,0.43709999322891235,0.45919999480247498,0.44200000166893005,0.78350001573562622,0.57730001211166382,0.67849999666213989,0.11450000107288361,2.4900000542402267E-2,0.32580000162124634,0.26429998874664307,0.11309999972581863,1.080000028014183E-2,0.67309999465942383,0.55760002136230469,0.47760000824928284,0.43399998545646667,0.10289999842643738,0.41969999670982361,0.68650001287460327,0.6721000075340271,4.5200001448392868E-2,0.87319999933242798,0.73449999094009399,0.5526999831199646,0.57950001955032349,0.99229997396469116,0.46140000224113464,0.36930000782012939,0.38760000467300415,4.3699998408555984E-2,0.12960000336170197,0.14699999988079071,0.95730000734329224,0.87709999084472656,0.25279998779296875,0.15770000219345093,3.4800000488758087E-2]
[]
[]
[]
[]
[]
[]
[]
[]
[]
[]
[]
[]
[]
[]
[]
[]
[]
[]
[]
[]
[]
[]
[]
[]
[]
[]
[]
[]
[]
[]
[]
[]
[]
[]
[]
[]
[]
[]
[]
[]
[]
[]
[]
[]
[]
[]
[]
[]
[]
[]
[]
[]
[]
[]
[]
[]
[]
[]
[]
[]
[]
[]
[]
[]
[]
[]
[]
[]
[]
[]
[]
[]
[]
[]
[]
[]
[]
[]
[]
[]
[]
[]
[]
[]
[]
[]
[]
[]
[]
[]
[]
[]
[]
[]
[]
[]
[]
[]
[]
[]
[]
[]
[]
[]
[]
[]
[]
[]
[]
[]
[]
[]
[]
[]
[]
[]
[]
[]
[]
[]
[]
[]
[]
[]
[]
[]
[]
[]
[]
[]
[]
[]
[]
[]
[]
[]
[]
[]
[]
[]
[]
[]
[]
[]
[]
[]
[]
[]
[]
[]
[]
[]
[]
[]
[]
[]
[]
[]
[]
[]
[]
[]
[]
[]
[]
[]
[]
[]
[]
[]
[]
[]
[]
[]
[]
[]
[]
[]
[]
[]
[]
[]
[]
[]
[]
[]
[]
[]
[]
[]
[]
[]
[]
[]
[]
[]
[]
[]
[]
[]
[]
[]
[]
[]
[]
[]
[]
[]
[]
[]
[]
[]
[]
[]
[]
[]
[]
[]
[]
[]
[]
[]
[]
[]
[]
[]
[]
[]
[]
[]
[]
[]
[]
[]
[]
[]
[]
[]
[]
[]
[]
[]
[]
[]
[]
[]
[]
[]
[]
[]
[]
[]
[]
[]
[]
[]
[]
[]
[]
[]
[]
[]
[]
[]
[]
[]
[]
[]
[]
[]
[]
[]
[]
[]
[]
[]
[]
[]
[]
[]
[]
[]
[]
[]
[]
[]
[]
[]
[]
[]
[]
[]
[]
[]
[]
[]
[]
[]
[]
[]
[]
[]
[]
[]
[]
[]
[]
[]
[]
[]
[]
[]
[]
[]
[]
[]
[]
[]
[]
[]
[]
[]
[]
[]
[]
[]
[]
[]
[]
[]
[]
[]
[]
[]
[]
[]
[]
[]
[]
[]
[]
[]
[null,null,null,null,null,null,null,null,null,null,null,null,null,null,null,null,null,null,null,null,null,null,"2019-09-12"]

{"sheet":"info","index":5,"n_rows":8,"n_cols":4,"rows_kept":8,"cut":false,"hidden":false,"merged":[]}
[]
[null,"Sie benutzen eine Vorlage von sixsigmblackbelt.de"]
[]
[null,"Diese Version hat einige Einschränkungen"]
[null,{"$f":"\"- Sie müssen die Datei mit der Endung .xlsm speichern, ansonsten gehen Funktionalitäten verloren\"","v":"- Sie müssen die Datei mit der Endung .xlsm speichern, ansonsten gehen Funktionalitäten verloren"}]
[]
[null,"Haben Sie Fragen,"]
[null,"wenden Sie sich bitte per Mail an ",null,"roland.schnurr@sixsigmablackbelt.de"]