{"text_format":"1","workbook":"xlsx","n_sheets":6,"sheets":["Start","HinweisMakro","MSA Verfahren 1 2s","MSA Verfahren 1 3s","MSA Verfahren 1 Berechnung 2s","MSA Verfahren 1 Berechnung 3s"],"not_rendered":{"charts":8,"images":3,"macros":1,"external_links":2,"defined_names":93,"comments":0,"pivot_tables":0},"unopened":[],"bounds":{"document_bytes":16777216,"sheet_cells":100000,"rows_first":2000,"rows_last":500,"rows_between":2000,"halvings":0,"cell_chars":16384,"cell_head_chars":4096},"cells_cut":0,"cells_raw":0,"read":"whole","date_system":"1900"}

{"sheet":"Start","index":0,"n_rows":10,"n_cols":2,"rows_kept":10,"cut":false,"hidden":true,"merged":[]}
[]
[]
[]
[null,"Das Makro ist momentan nicht aktiviert"]
[null,"Bitte Aktivieren Sie das Makro"]
[null,"Ohne Makro funktioniert diese Datei nicht"]
[]
[null,"roland.schnurr@sixsigmablackbelt.de"]
[]
[null,"https://www.sixsigmablackbelt.de"]

{"sheet":"HinweisMakro","index":1,"n_rows":0,"n_cols":0,"rows_kept":0,"cut":false,"hidden":true,"merged":[]}

{"sheet":"MSA Verfahren 1 2s","index":2,"n_rows":53,"n_cols":14,"rows_kept":53,"cut":false,"hidden":false,"merged":[[1,1,1,3],[1,4,1,7],[1,8,1,10],[3,1,3,3],[3,4,3,6],[3,7,3,10],[4,2,4,3],[4,5,4,6],[5,2,5,3],[5,5,5,6],[6,2,6,3],[6,5,6,6],[58,2,58,7],[7,2,7,3],[7,5,7,6],[8,5,8,6],[9,2,9,10],[21,1,21,10],[29,1,29,2],[29,3,29,4],[29,5,29,6],[29,7,29,8],[47,3,47,9],[48,3,48,9],[49,3,49,9],[55,2,55,9],[57,2,57,10]]}
[]
[null,null,null,null,"Messsystemanalyse \nVerfahren 1: Cg / Cgk"]
[null,"Akt. Dat.: ",{"$f":"TODAY()","v":"2023-05-16"},"Bearb.Name:","Max Mustermann",null,"Abt./Kst.:","Musterfirma",null,"Prüfort:","Messraum",null,null,"Dieser Bereich wird nicht gedruckt"]
[null,"Prüfmittel",null,null,"Normal",null,null,"Merkmal"]
[null,"Bezeichnung:","Vorrichtung",null,"Bezeichnung:","Ring",null,"Bezeichnung:","Durchmesser",null,null,null,null,"Die Vorlage enthält einige Einschränkungen:"]
[null,"Nummer:",452344,null,"Nummer:",1437,null,"Nummer",1,null,null,null,null,{"$f":"\"- das Wasserzeichen \"\"www.sixsigmablackbeltde\"\"\"","v":"- das Wasserzeichen \"www.sixsigmablackbeltde\""}]
[null,"Auflösung:",1E-3,null,"Istwert:",20.302,null,"Nennmaß:",20.3,"OSG:",20.45,null,null,{"$f":"\"- ein Teil der Zellen ist gesperrt\"","v":"- ein Teil der Zellen ist gesperrt"}]
[null,"Prüfgrnd.:","Abnahme",null,"Einheit:","mm",null,"Einheit:","mm","USG:",20.149999999999999,null,null,{"$f":"\"- etc.\"","v":"- etc."}]
[null,null,null,null,"U Kal",2.0000000000000001E-4]
[null,"Bemerkung:",null,null,null,null,null,null,null,null,null,null,null,"Benötigen Sie die Vorlage"]
[null,null,null,null,null,null,null,null,null,null,null,null,null,{"$f":"\"- ohne Einschränkungen\"","v":"- ohne Einschränkungen"}]
[null,null,null,null,null,null,null,null,null,null,null,null,null,{"$f":"\"- in englischer Sprache\"","v":"- in englischer Sprache"}]
[null,null,null,null,null,null,null,null,null,null,null,null,null,{"$f":"\"- mit Ihrem Logo\"","v":"- mit Ihrem Logo"}]
[null,null,null,null,null,null,null,null,null,null,null,null,null,"schreiben Sie an "]
[null,null,null,null,null,null,null,null,null,null,null,null,null,"roland.schnurr@sixsigmablackbelt.de"]
[]
[null,null,null,null,null,null,null,null,null,null,null,null,null,"Eine Übersicht unserer Vorlagen und deren Kosten finden Sie unter:"]
[null,null,null,null,null,null,null,null,null,null,null,null,null,"https://www.sixsigmablackbelt.de/preisvergleich/"]
[]
[null,null,null,null,null,null,null,null,null,null,null,null,null,"Ein Auszug der Unternehmen, die uns vertrauen finden Sie unter:"]
[null,null,null,null,null,null,null,null,null,null,null,null,null,"https://www.sixsigmablackbelt.de/referenzen/"]
[null,"Einzelwerte"]
[null,{"$f":"\"1 - 5\"","v":"1 - 5"},{"$f":"\"6 - 10\"","v":"6 - 10"},{"$f":"\"11 - 15\"","v":"11 - 15"},{"$f":"\"16 - 20\"","v":"16 - 20"},{"$f":"\"21 - 25\"","v":"21 - 25"},{"$f":"\"26 - 30\"","v":"26 - 30"},{"$f":"\"31 - 35\"","v":"31 - 35"},{"$f":"\"36 - 40\"","v":"36 - 40"},{"$f":"\"41 - 45\"","v":"41 - 45"},{"$f":"\"46 - 50\"","v":"46 - 50"},null,null,"Die Validierung der Vorlagen mit Minitab und R, finden Sie unter:"]
[null,20.303000000000001,20.295999999999999,20.311,20.297999999999998,20.311,20.308,20.312999999999999,20.303000000000001,20.306000000000001,20.302,null,null,"https://www.sixsigmablackbelt.de/preisvergleich/"]
[null,20.300999999999998,20.300999999999998,20.297000000000001,20.295000000000002,20.309000000000001,20.302,20.303000000000001,20.309999999999999,20.295999999999999,20.303000000000001]
[null,20.303999999999998,20.3,20.295000000000002,20.300999999999998,20.308,20.294,20.308,20.303999999999998,20.306000000000001,20.306999999999999]
[null,20.303000000000001,20.306999999999999,20.302,20.306999999999999,20.303999999999998,20.302,20.297999999999998,20.309000000000001,20.298999999999999,20.303000000000001]
[null,20.306000000000001,20.305,20.303999999999998,20.312000000000001,20.297999999999998,20.303999999999998,20.306000000000001,20.305,20.3,20.305]
[]
[null,"Spezifikationswerte",null,"Gemessene Werte",null,"Statistische Werte",null,"Syst. Messabweichung"]
[null,"xm",{"$f":"sixmsa1_c31(F7)","v":20.302},null,null,"xg",{"$f":"sixmsa1_g31(xi2s)","v":20.303479999999997},"BIAS",{"$f":"Mittelwert2s-xm2s","v":1.4799999999972613E-3}]
[null,"xm - 0,1*T",{"$f":"sixmsa1_c32(xm2s,T2s)","v":20.271999999999998},"xmin.",{"$f":"sixmsa1_e32(xi2s)","v":20.294},"xg - 2 * sg",{"$f":"sixmsa1_g32(xg2s,sg2s)","v":20.294166941360405},"t",{"$f":"SQRT(E35)*ABS(Mittelwert2s-xm2s)/sg2s","v":2.2474206952914422}]
[null,"xm + 0,1*T",{"$f":"sixmsa1_c33(xm2s,T2s)","v":20.332000000000001},"xmax.",{"$f":"sixmsa1_e33(xi2s)","v":20.312999999999999},"xg + 2 * sg",{"$f":"sixmsa1_g33(xg2s,sg2s)","v":20.312793058639588}]
[null,"0,2 * T",{"$f":"sixmsa1_c34(T2s)","v":6.0000000000000143E-2},"R",{"$f":"sixmsa1_e34(xmax2s, xmin2s)","v":1.8999999999998352E-2},"4 * sg",{"$f":"sixmsa1_g34(sg2s)","v":1.862611727918511E-2}]
[null,"T",{"$f":"sixmsa1_c35(OSG2s,USG2s)","v":0.30000000000000071},"nges.",{"$f":"sixmsa1_e35(xi2s)","v":50},"sg",{"$f":"sixmsa1_g35(xi2s)","v":4.6565293197962775E-3}]
[]
[null,"Mindestforderung an die Prüfmittelkennzahl",null,null,null,"Cg ≥",1.33]
[null,null,null,null,null,"Cgk ≥",1.33]
[]
[null,null,null,null,null,null,null,null,"Messsystem fähig für T bis"]
[null,null,"=",{"$f":"(0.2*T2s)/(4*sg2s)","v":3.2212832712618424},null,null,null,null,"Tmin/Cg =",{"$f":"Forderungcg2s*G34/0.2","v":0.123863679906581},{"$f":"Einheit2s","v":"mm"}]
[]
[null,null,"=",{"$f":"(0.1*T2s-ABS(xg2s-xm2s))/(2*sg2s)","v":3.0623666298798864},null,null,null,null,"Tmin/Cgk =",{"$f":"(G34/2*Forderungcgk2s+ABS(I31))/0.1","v":0.13866367990655359},{"$f":"Einheit2s","v":"mm"}]
[]
[null,"Auflösung in % von T   = ",null,{"$f":"ROUND(Aufloesung/T2s,10)","v":3.3333333000000001E-3},null,null,null,null,"Tmax. Aufl. =",{"$f":"C7/0.05","v":0.02},{"$f":"Einheit2s","v":"mm"}]
[]
[]
[null,"Hinweise: ","1.)",{"$f":"IF(C7,IF(D45<=0.05,\"Auflösung ist ausreichend ! (Auflösung ist kleiner oder gleich 5% !)\",\"Das Messgerät ist aufgrund der Auflösung für die Messaufgabe nicht geeignet!\"),)","v":"Auflösung ist ausreichend ! (Auflösung ist kleiner oder gleich 5% !)"}]
[null,null,"3.)",{"$f":"IF(UKAL2s<0.1*T2s,\"Die Unsicherheit der Kalibrierung des Normales ist ausreichend (UKAL<0,1*T)\",\"Die Unsicherheit der Kalibrierung des Normales ist zu groß\")","v":"Die Unsicherheit der Kalibrierung des Normales ist ausreichend (UKAL<0,1*T)"}]
[null,null,"2.)",{"$f":"IF(AND(cgk2s>=Forderungcgk2s,cg2s>=Forderungcg2s),\"Das Messmittel ist fähig und erfüllt die Mindestforderung an die Prüfmittelkennzahl\", \"Messmittel ist nicht fähig\")","v":"Das Messmittel ist fähig und erfüllt die Mindestforderung an die Prüfmittelkennzahl"}]
[]
[null,null,"Beschreibung:",null,"m = Master (Normal)",null,"g = Gage (Prüfmittel)"]
[null,"Datum:"," ________",null,"Unterschrift:"," __________________",null,null,"Abteilung:"," __________________"]

{"sheet":"MSA Verfahren 1 3s","index":3,"n_rows":53,"n_cols":14,"rows_kept":53,"cut":false,"hidden":false,"merged":[[57,2,57,10],[58,2,58,7],[49,3,49,9],[55,2,55,9],[48,3,48,9],[1,4,1,7],[1,8,1,10],[1,1,1,3],[3,1,3,3],[3,4,3,6],[3,7,3,10],[5,5,5,6],[4,5,4,6],[4,2,4,3],[5,2,5,3],[6,2,6,3],[6,5,6,6],[7,2,7,3],[9,2,9,10],[7,5,7,6],[47,3,47,9],[8,5,8,6],[21,1,21,10],[29,1,29,2],[29,3,29,4],[29,5,29,6],[29,7,29,8]]}
[]
[null,null,null,null,"Messsystemanalyse \nVerfahren 1: Cg / Cgk"]
[null,"Akt. Dat.: ",{"$f":"TODAY()","v":"2023-05-16"},"Bearb.Name:","Max Mustermann",null,"Abt./Kst.:","Musterfirma",null,"Prüfort:","Messraum",null,null,"Dieser Bereich wird nicht gedruckt"]
[null,"Prüfmittel",null,null,"Normal",null,null,"Merkmal"]
[null,"Bezeichnung:","Vorrichtung",null,"Bezeichnung:","Ring",null,"Bezeichnung:","Durchmesser",null,null,null,null,"Die Vorlage enthält einige Einschränkungen:"]
[null,"Nummer:",452344,null,"Nummer:",1437,null,"Nummer",1,null,null,null,null,{"$f":"\"- das Wasserzeichen \"\"www.sixsigmablackbeltde\"\"\"","v":"- das Wasserzeichen \"www.sixsigmablackbeltde\""}]
[null,"Auflösung:",1E-3,null,"Istwert:",20.302,null,"Nennmaß:",20.3,"OSG:",20.45,null,null,{"$f":"\"- ein Teil der Zellen ist gesperrt\"","v":"- ein Teil der Zellen ist gesperrt"}]
[null,"Prüfgrnd.:","Abnahme",null,"Einheit:","mm",null,"Einheit:","mm","USG:",20.149999999999999,null,null,{"$f":"\"- etc.\"","v":"- etc."}]
[null,null,null,null,"U Kal",2.0000000000000001E-4]
[null,"Bemerkung:",null,null,null,null,null,null,null,null,null,null,null,"Benötigen Sie die Vorlage"]
[null,null,null,null,null,null,null,null,null,null,null,null,null,{"$f":"\"- ohne Einschränkungen\"","v":"- ohne Einschränkungen"}]
[null,null,null,null,null,null,null,null,null,null,null,null,null,{"$f":"\"- in englischer Sprache\"","v":"- in englischer Sprache"}]
[null,null,null,null,null,null,null,null,null,null,null,null,null,{"$f":"\"- mit Ihrem Logo\"","v":"- mit Ihrem Logo"}]
[null,null,null,null,null,null,null,null,null,null,null,null,null,"schreiben Sie an "]
[null,null,null,null,null,null,null,null,null,null,null,null,null,"roland.schnurr@sixsigmablackbelt.de"]
[]
[null,null,null,null,null,null,null,null,null,null,null,null,null,"Eine Übersicht unserer Vorlagen und deren Kosten finden Sie unter:"]
[null,null,null,null,null,null,null,null,null,null,null,null,null,"https://www.sixsigmablackbelt.de/preisvergleich/"]
[]
[null,null,null,null,null,null,null,null,null,null,null,null,null,"Ein Auszug der Unternehmen, die uns vertrauen finden Sie unter:"]
[null,null,null,null,null,null,null,null,null,null,null,null,null,"https://www.sixsigmablackbelt.de/referenzen/"]
[null,"Einzelwerte"]
[null,{"$f":"\"1 - 5\"","v":"1 - 5"},{"$f":"\"6 - 10\"","v":"6 - 10"},{"$f":"\"11 - 15\"","v":"11 - 15"},{"$f":"\"16 - 20\"","v":"16 - 20"},{"$f":"\"21 - 25\"","v":"21 - 25"},{"$f":"\"26 - 30\"","v":"26 - 30"},{"$f":"\"31 - 35\"","v":"31 - 35"},{"$f":"\"36 - 40\"","v":"36 - 40"},{"$f":"\"41 - 45\"","v":"41 - 45"},{"$f":"\"46 - 50\"","v":"46 - 50"},null,null,"Die Validierung der Vorlagen mit Minitab und R, finden Sie unter:"]
[null,20.303000000000001,20.295999999999999,20.311,20.297999999999998,20.311,20.308,20.312999999999999,20.303000000000001,20.306000000000001,20.302,null,null,"https://www.sixsigmablackbelt.de/preisvergleich/"]
[null,20.300999999999998,20.300999999999998,20.297000000000001,20.295000000000002,20.309000000000001,20.302,20.303000000000001,20.309999999999999,20.295999999999999,20.303000000000001]
[null,20.303999999999998,20.3,20.295000000000002,20.300999999999998,20.308,20.294,20.308,20.303999999999998,20.306000000000001,20.306999999999999]
[null,20.303000000000001,20.306999999999999,20.302,20.306999999999999,20.303999999999998,20.302,20.297999999999998,20.309000000000001,20.298999999999999,20.303000000000001]
[null,20.306000000000001,20.305,20.303999999999998,20.312000000000001,20.297999999999998,20.303999999999998,20.306000000000001,20.305,20.3,20.305]
[]
[null,"Spezifikationswerte",null,"Gemessene Werte",null,"Statistische Werte",null,"Syst. Messabweichung"]
[null,"xm",{"$f":"sixmsa1_c31(F7)","v":20.302},null,null,"xg",{"$f":"sixmsa1_g31(xi3s)","v":20.303479999999997},"BIAS",{"$f":"Mittelwert3s-xm3s","v":1.4799999999972613E-3}]
[null,"xm - 0,1*T",{"$f":"sixmsa1_c32(xm3s,T3s)","v":20.271999999999998},"xmin.",{"$f":"sixmsa1_e32(xi3s)","v":20.294},"xg - 3 * sg",{"$f":"sixmsa2_g32(xg3s,sg3s)","v":20.28951041204061},"t",{"$f":"SQRT(E35)*ABS(Mittelwert3s-xm3s)/sg3s","v":2.2474206952914422}]
[null,"xm + 0,1*T",{"$f":"sixmsa1_c33(xm3s,T3s)","v":20.332000000000001},"xmax.",{"$f":"sixmsa1_e33(xi3s)","v":20.312999999999999},"xg + 3 * sg",{"$f":"sixmsa2_g33(xg3s,sg3s)","v":20.317449587959384}]
[null,"0,2 * T",{"$f":"sixmsa1_c34(T3s)","v":6.0000000000000143E-2},"R",{"$f":"sixmsa1_e34(xmax3s, xmin3s)","v":1.8999999999998352E-2},"6 * sg",{"$f":"sixmsa2_g34(sg3s)","v":2.7939175918777665E-2}]
[null,"T",{"$f":"sixmsa1_c35(OSG3s,USG3s)","v":0.30000000000000071},"nges.",{"$f":"sixmsa1_e35(xi3s)","v":50},"sg",{"$f":"sixmsa1_g35(xi3s)","v":4.6565293197962775E-3}]
[]
[null,"Mindestforderung an die Prüfmittelkennzahl",null,null,null,"Cg ≥",1.33]
[null,null,null,null,null,"Cgk ≥",1.33]
[]
[null,null,null,null,null,null,null,null,"Messsystem fähig für T bis"]
[null,null,"=",{"$f":"C34/G34","v":2.1475221808412286},null,null,null,null,"Tmin/Cg =",{"$f":"Forderungcg3s*G34/0.2","v":0.18579551985987147},{"$f":"Einheit3s","v":"mm"}]
[]
[null,null,"=",{"$f":"(0.1*T3s-ABS(xg3s-xm3s))/(3*sg3s)","v":2.0415777532532573},null,null,null,null,"Tmin/Cgk =",{"$f":"(G34/2*Forderungcgk3s+ABS(I31))/0.1","v":0.20059551985984408},{"$f":"Einheit3s","v":"mm"}]
[]
[null,"Auflösung in % von T   = ",null,{"$f":"ROUND(Aufloesung/T3s,10)","v":3.3333333000000001E-3},null,null,null,null,"Tmax. Aufl. =",{"$f":"C7/0.05","v":0.02},{"$f":"Einheit3s","v":"mm"}]
[]
[]
[null,"Hinweise: ","1.)",{"$f":"IF(C7,IF(D45<=0.05,\"Auflösung ist ausreichend ! (Auflösung ist kleiner oder gleich 5% !)\",\"Das Messgerät ist aufgrund der Auflösung für die Messaufgabe nicht geeignet!\"),)","v":"Auflösung ist ausreichend ! (Auflösung ist kleiner oder gleich 5% !)"}]
[null,null,"3.)",{"$f":"IF(UKAL3s<0.1*T3s,\"Die Unsicherheit der Kalibrierung des Normales ist ausreichend (UKAL<0,1*T)\",\"Die Unsicherheit der Kalibrierung des Normales ist zu groß\")","v":"Die Unsicherheit der Kalibrierung des Normales ist ausreichend (UKAL<0,1*T)"}]
[null,null,"2.)",{"$f":"IF(AND(cgk3s>=Forderungcgk3s,cg3s>=Forderungcg3s),\"Das Messmittel ist fähig und erfüllt die Mindestforderung an die Prüfmittelkennzahl\", \"Messmittel ist nicht fähig\")","v":"Das Messmittel ist fähig und erfüllt die Mindestforderung an die Prüfmittelkennzahl"}]
[]
[null,null,"Beschreibung:",null,"m = Master (Normal)",null,"g = Gage (Prüfmittel)"]
[null,"Datum:"," ________",null,"Unterschrift:"," __________________",null,null,"Abteilung:"," __________________"]

{"sheet":"MSA Verfahren 1 Berechnung 2s","index":4,"n_rows":54,"n_cols":19,"rows_kept":54,"cut":false,"hidden":true,"merged":[[0,3,0,13],[16,16,16,23],[18,16,18,24],[19,16,19,21],[21,15,21,26]]}
[null,null,null,"Diagramm",null,null,null,null,null,null,null,null,null,null,null,"Diagramm cg und cgk"]
[]
["Bezeichnung für Diagramm",{"$f":"'MSA Verfahren 1 2s'!$I$5","v":"Durchmesser"},null,"Durchmesser","Mittelwert Merkmal",{"$f":"\"+2 sg\"","v":"+2 sg"},{"$f":"\"+3 sg\"","v":"+3 sg"},{"$f":"\"-2 sg\"","v":"-2 sg"},{"$f":"\"-3 sg\"","v":"-3 sg"},"OSG Merkmal","USG Merkmal","Mittelwert Normal","USG Normal","OSG Normal",null,"cgk",0,{"$f":"cgk2s","v":3.0623666298798864},0]
["i","x(i)",null,"x(i)","xg","xg+2*sg","xg+3*sg","xg-2*sg","xg-3*sg","OSG","USG","xm","xm-0,1*T","xm+0,1*T",null,"Anforderung cgk",{"$f":"Forderungcgk2s","v":1.33},0,{"$f":"ABS(Q4-R3)+0.2","v":1.9323666298798863}]
[1,{"$f":"IF('MSA Verfahren 1 2s'!B24=\"\",#N/A,'MSA Verfahren 1 2s'!B24)","v":20.303000000000001},{"$f":"IF(B5<>\"\",A5,1)","v":1},{"$f":"IF(B5<>\"\",B5,\"\")","v":20.303000000000001},{"$f":"Mittelwert2s","v":20.303479999999997},{"$f":"xg2s+2*sg2s","v":20.312793058639588},{"$f":"xg2s+3*sg2s","v":20.317449587959384},{"$f":"xg2s-2*sg2s","v":20.294166941360405},{"$f":"xg2s-3*sg2s","v":20.28951041204061},{"$f":"OSG2s","v":20.45},{"$f":"USG2s","v":20.149999999999999},{"$f":"xm2s","v":20.302},{"$f":"xm2s-0.1*T2s","v":20.271999999999998},{"$f":"xm2s+0.1*T2s","v":20.332000000000001}]
[2,{"$f":"IF('MSA Verfahren 1 2s'!B25=\"\",#N/A,'MSA Verfahren 1 2s'!B25)","v":20.300999999999998},{"$f":"IF(B6<>\"\",A6,C5)","v":2},{"$f":"IF(B6<>\"\",B6,\"\")","v":20.300999999999998},20.303479999999997,20.312793058639588,20.317449587959384,20.294166941360405,20.28951041204061,20.45,20.149999999999999,20.302,20.271999999999998,20.332000000000001,null,"cg",0,{"$f":"cg2s","v":3.2212832712618424},0]
[3,{"$f":"IF('MSA Verfahren 1 2s'!B26=\"\",#N/A,'MSA Verfahren 1 2s'!B26)","v":20.303999999999998},{"$f":"IF(B7<>\"\",A7,C6)","v":3},20.303999999999998,20.303479999999997,20.312793058639588,20.317449587959384,20.294166941360405,20.28951041204061,20.45,20.149999999999999,20.302,20.271999999999998,20.332000000000001,null,"Anforderung cg",{"$f":"Forderungcg2s","v":1.33},0,{"$f":"ABS(Q7-R6)+0.2","v":2.0912832712618425}]
[4,{"$f":"IF('MSA Verfahren 1 2s'!B27=\"\",#N/A,'MSA Verfahren 1 2s'!B27)","v":20.303000000000001},4,20.303000000000001,20.303479999999997,20.312793058639588,20.317449587959384,20.294166941360405,20.28951041204061,20.45,20.149999999999999,20.302,20.271999999999998,20.332000000000001]
[5,{"$f":"IF('MSA Verfahren 1 2s'!B28=\"\",#N/A,'MSA Verfahren 1 2s'!B28)","v":20.306000000000001},5,20.306000000000001,20.303479999999997,20.312793058639588,20.317449587959384,20.294166941360405,20.28951041204061,20.45,20.149999999999999,20.302,20.271999999999998,20.332000000000001]
[6,{"$f":"IF('MSA Verfahren 1 2s'!C24=\"\",#N/A,'MSA Verfahren 1 2s'!C24)","v":20.295999999999999},6,20.295999999999999,20.303479999999997,20.312793058639588,20.317449587959384,20.294166941360405,20.28951041204061,20.45,20.149999999999999,20.302,20.271999999999998,20.332000000000001]
[7,{"$f":"IF('MSA Verfahren 1 2s'!C25=\"\",#N/A,'MSA Verfahren 1 2s'!C25)","v":20.300999999999998},7,20.300999999999998,20.303479999999997,20.312793058639588,20.317449587959384,20.294166941360405,20.28951041204061,20.45,20.149999999999999,20.302,20.271999999999998,20.332000000000001]
[8,{"$f":"IF('MSA Verfahren 1 2s'!C26=\"\",#N/A,'MSA Verfahren 1 2s'!C26)","v":20.3},8,20.3,20.303479999999997,20.312793058639588,20.317449587959384,20.294166941360405,20.28951041204061,20.45,20.149999999999999,20.302,20.271999999999998,20.332000000000001]
[9,{"$f":"IF('MSA Verfahren 1 2s'!C27=\"\",#N/A,'MSA Verfahren 1 2s'!C27)","v":20.306999999999999},9,20.306999999999999,20.303479999999997,20.312793058639588,20.317449587959384,20.294166941360405,20.28951041204061,20.45,20.149999999999999,20.302,20.271999999999998,20.332000000000001]
[10,{"$f":"IF('MSA Verfahren 1 2s'!C28=\"\",#N/A,'MSA Verfahren 1 2s'!C28)","v":20.305},10,20.305,20.303479999999997,20.312793058639588,20.317449587959384,20.294166941360405,20.28951041204061,20.45,20.149999999999999,20.302,20.271999999999998,20.332000000000001]
[11,{"$f":"IF('MSA Verfahren 1 2s'!D24=\"\",#N/A,'MSA Verfahren 1 2s'!D24)","v":20.311},11,20.311,20.303479999999997,20.312793058639588,20.317449587959384,20.294166941360405,20.28951041204061,20.45,20.149999999999999,20.302,20.271999999999998,20.332000000000001,null,"Lizenziert für","Ihre_Firma"]
[12,{"$f":"IF('MSA Verfahren 1 2s'!D25=\"\",#N/A,'MSA Verfahren 1 2s'!D25)","v":20.297000000000001},12,20.297000000000001,20.303479999999997,20.312793058639588,20.317449587959384,20.294166941360405,20.28951041204061,20.45,20.149999999999999,20.302,20.271999999999998,20.332000000000001]
[13,{"$f":"IF('MSA Verfahren 1 2s'!D26=\"\",#N/A,'MSA Verfahren 1 2s'!D26)","v":20.295000000000002},13,20.295000000000002,20.303479999999997,20.312793058639588,20.317449587959384,20.294166941360405,20.28951041204061,20.45,20.149999999999999,20.302,20.271999999999998,20.332000000000001,null,"Quelle:","http://www.sixsigmablackbelt.de/msa-messsystemanalyse-messmittelfaehigkeit/"]
[14,{"$f":"IF('MSA Verfahren 1 2s'!D27=\"\",#N/A,'MSA Verfahren 1 2s'!D27)","v":20.302},14,20.302,20.303479999999997,20.312793058639588,20.317449587959384,20.294166941360405,20.28951041204061,20.45,20.149999999999999,20.302,20.271999999999998,20.332000000000001]
[15,{"$f":"IF('MSA Verfahren 1 2s'!D28=\"\",#N/A,'MSA Verfahren 1 2s'!D28)","v":20.303999999999998},15,20.303999999999998,20.303479999999997,20.312793058639588,20.317449587959384,20.294166941360405,20.28951041204061,20.45,20.149999999999999,20.302,20.271999999999998,20.332000000000001,null,"Literatur:","Eignungsnachweis von Prüfprozessen: Prüfmittelfähigkeit und Messunsicherheit im aktuellen Normenumfeld"]
[16,{"$f":"IF('MSA Verfahren 1 2s'!E24=\"\",#N/A,'MSA Verfahren 1 2s'!E24)","v":20.297999999999998},16,20.297999999999998,20.303479999999997,20.312793058639588,20.317449587959384,20.294166941360405,20.28951041204061,20.45,20.149999999999999,20.302,20.271999999999998,20.332000000000001,null,null,"Statistische Verfahren zur Maschinen- und Prozessqualifikation"]
[17,{"$f":"IF('MSA Verfahren 1 2s'!E25=\"\",#N/A,'MSA Verfahren 1 2s'!E25)","v":20.295000000000002},17,20.295000000000002,20.303479999999997,20.312793058639588,20.317449587959384,20.294166941360405,20.28951041204061,20.45,20.149999999999999,20.302,20.271999999999998,20.332000000000001]
[18,{"$f":"IF('MSA Verfahren 1 2s'!E26=\"\",#N/A,'MSA Verfahren 1 2s'!E26)","v":20.300999999999998},18,20.300999999999998,20.303479999999997,20.312793058639588,20.317449587959384,20.294166941360405,20.28951041204061,20.45,20.149999999999999,20.302,20.271999999999998,20.332000000000001,null,"Berechnung mit Minitab"]
[19,{"$f":"IF('MSA Verfahren 1 2s'!E27=\"\",#N/A,'MSA Verfahren 1 2s'!E27)","v":20.306999999999999},19,20.306999999999999,20.303479999999997,20.312793058639588,20.317449587959384,20.294166941360405,20.28951041204061,20.45,20.149999999999999,20.302,20.271999999999998,20.332000000000001]
[20,{"$f":"IF('MSA Verfahren 1 2s'!E28=\"\",#N/A,'MSA Verfahren 1 2s'!E28)","v":20.312000000000001},20,20.312000000000001,20.303479999999997,20.312793058639588,20.317449587959384,20.294166941360405,20.28951041204061,20.45,20.149999999999999,20.302,20.271999999999998,20.332000000000001]
[21,{"$f":"IF('MSA Verfahren 1 2s'!F24=\"\",#N/A,'MSA Verfahren 1 2s'!F24)","v":20.311},21,20.311,20.303479999999997,20.312793058639588,20.317449587959384,20.294166941360405,20.28951041204061,20.45,20.149999999999999,20.302,20.271999999999998,20.332000000000001]
[22,{"$f":"IF('MSA Verfahren 1 2s'!F25=\"\",#N/A,'MSA Verfahren 1 2s'!F25)","v":20.309000000000001},22,20.309000000000001,20.303479999999997,20.312793058639588,20.317449587959384,20.294166941360405,20.28951041204061,20.45,20.149999999999999,20.302,20.271999999999998,20.332000000000001]
[23,{"$f":"IF('MSA Verfahren 1 2s'!F26=\"\",#N/A,'MSA Verfahren 1 2s'!F26)","v":20.308},23,20.308,20.303479999999997,20.312793058639588,20.317449587959384,20.294166941360405,20.28951041204061,20.45,20.149999999999999,20.302,20.271999999999998,20.332000000000001]
[24,{"$f":"IF('MSA Verfahren 1 2s'!F27=\"\",#N/A,'MSA Verfahren 1 2s'!F27)","v":20.303999999999998},24,20.303999999999998,20.303479999999997,20.312793058639588,20.317449587959384,20.294166941360405,20.28951041204061,20.45,20.149999999999999,20.302,20.271999999999998,20.332000000000001]
[25,{"$f":"IF('MSA Verfahren 1 2s'!F28=\"\",#N/A,'MSA Verfahren 1 2s'!F28)","v":20.297999999999998},25,20.297999999999998,20.303479999999997,20.312793058639588,20.317449587959384,20.294166941360405,20.28951041204061,20.45,20.149999999999999,20.302,20.271999999999998,20.332000000000001]
[26,{"$f":"IF('MSA Verfahren 1 2s'!G24=\"\",#N/A,'MSA Verfahren 1 2s'!G24)","v":20.308},26,20.308,20.303479999999997,20.312793058639588,20.317449587959384,20.294166941360405,20.28951041204061,20.45,20.149999999999999,20.302,20.271999999999998,20.332000000000001]
[27,{"$f":"IF('MSA Verfahren 1 2s'!G25=\"\",#N/A,'MSA Verfahren 1 2s'!G25)","v":20.302},27,20.302,20.303479999999997,20.312793058639588,20.317449587959384,20.294166941360405,20.28951041204061,20.45,20.149999999999999,20.302,20.271999999999998,20.332000000000001]
[28,{"$f":"IF('MSA Verfahren 1 2s'!G26=\"\",#N/A,'MSA Verfahren 1 2s'!G26)","v":20.294},28,20.294,20.303479999999997,20.312793058639588,20.317449587959384,20.294166941360405,20.28951041204061,20.45,20.149999999999999,20.302,20.271999999999998,20.332000000000001]
[29,{"$f":"IF('MSA Verfahren 1 2s'!G27=\"\",#N/A,'MSA Verfahren 1 2s'!G27)","v":20.302},29,20.302,20.303479999999997,20.312793058639588,20.317449587959384,20.294166941360405,20.28951041204061,20.45,20.149999999999999,20.302,20.271999999999998,20.332000000000001]
[30,{"$f":"IF('MSA Verfahren 1 2s'!G28=\"\",#N/A,'MSA Verfahren 1 2s'!G28)","v":20.303999999999998},30,20.303999999999998,20.303479999999997,20.312793058639588,20.317449587959384,20.294166941360405,20.28951041204061,20.45,20.149999999999999,20.302,20.271999999999998,20.332000000000001]
[31,{"$f":"IF('MSA Verfahren 1 2s'!H24=\"\",#N/A,'MSA Verfahren 1 2s'!H24)","v":20.312999999999999},31,20.312999999999999,20.303479999999997,20.312793058639588,20.317449587959384,20.294166941360405,20.28951041204061,20.45,20.149999999999999,20.302,20.271999999999998,20.332000000000001]
[32,{"$f":"IF('MSA Verfahren 1 2s'!H25=\"\",#N/A,'MSA Verfahren 1 2s'!H25)","v":20.303000000000001},32,20.303000000000001,20.303479999999997,20.312793058639588,20.317449587959384,20.294166941360405,20.28951041204061,20.45,20.149999999999999,20.302,20.271999999999998,20.332000000000001]
[33,{"$f":"IF('MSA Verfahren 1 2s'!H26=\"\",#N/A,'MSA Verfahren 1 2s'!H26)","v":20.308},33,20.308,{"$f":"Mittelwert2s","v":20.303479999999997},{"$f":"xg2s+2*sg2s","v":20.312793058639588},{"$f":"xg2s+3*sg2s","v":20.317449587959384},{"$f":"xg2s-2*sg2s","v":20.294166941360405},{"$f":"xg2s-3*sg2s","v":20.28951041204061},{"$f":"OSG2s","v":20.45},{"$f":"USG2s","v":20.149999999999999},{"$f":"xm2s","v":20.302},{"$f":"xm2s-0.1*T2s","v":20.271999999999998},{"$f":"xm2s+0.1*T2s","v":20.332000000000001}]
[34,{"$f":"IF('MSA Verfahren 1 2s'!H27=\"\",#N/A,'MSA Verfahren 1 2s'!H27)","v":20.297999999999998},34,20.297999999999998,20.303479999999997,20.312793058639588,20.317449587959384,20.294166941360405,20.28951041204061,20.45,20.149999999999999,20.302,20.271999999999998,20.332000000000001]
[35,{"$f":"IF('MSA Verfahren 1 2s'!H28=\"\",#N/A,'MSA Verfahren 1 2s'!H28)","v":20.306000000000001},35,20.306000000000001,20.303479999999997,20.312793058639588,20.317449587959384,20.294166941360405,20.28951041204061,20.45,20.149999999999999,20.302,20.271999999999998,20.332000000000001]
[36,{"$f":"IF('MSA Verfahren 1 2s'!I24=\"\",#N/A,'MSA Verfahren 1 2s'!I24)","v":20.303000000000001},36,20.303000000000001,20.303479999999997,20.312793058639588,20.317449587959384,20.294166941360405,20.28951041204061,20.45,20.149999999999999,20.302,20.271999999999998,20.332000000000001]
[37,{"$f":"IF('MSA Verfahren 1 2s'!I25=\"\",#N/A,'MSA Verfahren 1 2s'!I25)","v":20.309999999999999},37,20.309999999999999,20.303479999999997,20.312793058639588,20.317449587959384,20.294166941360405,20.28951041204061,20.45,20.149999999999999,20.302,20.271999999999998,20.332000000000001]
[38,{"$f":"IF('MSA Verfahren 1 2s'!I26=\"\",#N/A,'MSA Verfahren 1 2s'!I26)","v":20.303999999999998},38,20.303999999999998,20.303479999999997,20.312793058639588,20.317449587959384,20.294166941360405,20.28951041204061,20.45,20.149999999999999,20.302,20.271999999999998,20.332000000000001]
[39,{"$f":"IF('MSA Verfahren 1 2s'!I27=\"\",#N/A,'MSA Verfahren 1 2s'!I27)","v":20.309000000000001},39,20.309000000000001,20.303479999999997,20.312793058639588,20.317449587959384,20.294166941360405,20.28951041204061,20.45,20.149999999999999,20.302,20.271999999999998,20.332000000000001]
[40,{"$f":"IF('MSA Verfahren 1 2s'!I28=\"\",#N/A,'MSA Verfahren 1 2s'!I28)","v":20.305},40,20.305,20.303479999999997,20.312793058639588,20.317449587959384,20.294166941360405,20.28951041204061,20.45,20.149999999999999,20.302,20.271999999999998,20.332000000000001]
[41,{"$f":"IF('MSA Verfahren 1 2s'!J24=\"\",#N/A,'MSA Verfahren 1 2s'!J24)","v":20.306000000000001},41,20.306000000000001,20.303479999999997,20.312793058639588,20.317449587959384,20.294166941360405,20.28951041204061,20.45,20.149999999999999,20.302,20.271999999999998,20.332000000000001]
[42,{"$f":"IF('MSA Verfahren 1 2s'!J25=\"\",#N/A,'MSA Verfahren 1 2s'!J25)","v":20.295999999999999},42,20.295999999999999,20.303479999999997,20.312793058639588,20.317449587959384,20.294166941360405,20.28951041204061,20.45,20.149999999999999,20.302,20.271999999999998,20.332000000000001]
[43,{"$f":"IF('MSA Verfahren 1 2s'!J26=\"\",#N/A,'MSA Verfahren 1 2s'!J26)","v":20.306000000000001},43,20.306000000000001,20.303479999999997,20.312793058639588,20.317449587959384,20.294166941360405,20.28951041204061,20.45,20.149999999999999,20.302,20.271999999999998,20.332000000000001]
[44,{"$f":"IF('MSA Verfahren 1 2s'!J27=\"\",#N/A,'MSA Verfahren 1 2s'!J27)","v":20.298999999999999},44,20.298999999999999,20.303479999999997,20.312793058639588,20.317449587959384,20.294166941360405,20.28951041204061,20.45,20.149999999999999,20.302,20.271999999999998,20.332000000000001]
[45,{"$f":"IF('MSA Verfahren 1 2s'!J28=\"\",#N/A,'MSA Verfahren 1 2s'!J28)","v":20.3},45,20.3,20.303479999999997,20.312793058639588,20.317449587959384,20.294166941360405,20.28951041204061,20.45,20.149999999999999,20.302,20.271999999999998,20.332000000000001]
[46,{"$f":"IF('MSA Verfahren 1 2s'!K24=\"\",#N/A,'MSA Verfahren 1 2s'!K24)","v":20.302},46,20.302,20.303479999999997,20.312793058639588,20.317449587959384,20.294166941360405,20.28951041204061,20.45,20.149999999999999,20.302,20.271999999999998,20.332000000000001]
[47,{"$f":"IF('MSA Verfahren 1 2s'!K25=\"\",#N/A,'MSA Verfahren 1 2s'!K25)","v":20.303000000000001},47,20.303000000000001,20.303479999999997,20.312793058639588,20.317449587959384,20.294166941360405,20.28951041204061,20.45,20.149999999999999,20.302,20.271999999999998,20.332000000000001]
[48,{"$f":"IF('MSA Verfahren 1 2s'!K26=\"\",#N/A,'MSA Verfahren 1 2s'!K26)","v":20.306999999999999},48,20.306999999999999,20.303479999999997,20.312793058639588,20.317449587959384,20.294166941360405,20.28951041204061,20.45,20.149999999999999,20.302,20.271999999999998,20.332000000000001]
[49,{"$f":"IF('MSA Verfahren 1 2s'!K27=\"\",#N/A,'MSA Verfahren 1 2s'!K27)","v":20.303000000000001},49,20.303000000000001,20.303479999999997,20.312793058639588,20.317449587959384,20.294166941360405,20.28951041204061,20.45,20.149999999999999,20.302,20.271999999999998,20.332000000000001]
[50,{"$f":"IF('MSA Verfahren 1 2s'!K28=\"\",#N/A,'MSA Verfahren 1 2s'!K28)","v":20.305},50,20.305,20.303479999999997,20.312793058639588,20.317449587959384,20.294166941360405,20.28951041204061,20.45,20.149999999999999,20.302,20.271999999999998,20.332000000000001]

{"sheet":"MSA Verfahren 1 Berechnung 3s","index":5,"n_rows":54,"n_cols":19,"rows_kept":54,"cut":false,"hidden":true,"merged":[[0,3,0,13],[16,16,16,23],[18,16,18,24],[19,16,19,21],[21,15,21,25]]}
[null,null,null,"Diagramm",null,null,null,null,null,null,null,null,null,null,null,"Diagramm cg und cgk"]
[]
["Bezeichnung für Diagramm",{"$f":"'MSA Verfahren 1 3s'!$I$5","v":"Durchmesser"},null,"Durchmesser","Mittelwert Merkmal",{"$f":"\"+2 sg\"","v":"+2 sg"},{"$f":"\"+3 sg\"","v":"+3 sg"},{"$f":"\"-2 sg\"","v":"-2 sg"},{"$f":"\"-3 sg\"","v":"-3 sg"},"OSG Merkmal","USG Merkmal","Mittelwert Normal","USG Normal","OSG Normal",null,"cgk",0,{"$f":"cgk3s","v":2.0415777532532573},0]
["i","x(i)",null,"x(i)","xg","xg+2*sg","xg+3*sg","xg-2*sg","xg-3*sg","OSG","USG","xm","xm-0,1*T","xm+0,1*T",null,"Anforderung cgk",{"$f":"Forderungcgk3s","v":1.33},0,{"$f":"ABS(Q4-R3)+0.2","v":0.91157775325325718}]
[1,{"$f":"IF('MSA Verfahren 1 3s'!B24=\"\",#N/A,'MSA Verfahren 1 3s'!B24)","v":20.303000000000001},{"$f":"IF(B5<>\"\",A5,1)","v":1},{"$f":"IF(B5<>\"\",B5,\"\")","v":20.303000000000001},{"$f":"Mittelwert3s","v":20.303479999999997},{"$f":"xg3s+2*sg3s","v":20.312793058639588},{"$f":"xg3s+3*sg3s","v":20.317449587959384},{"$f":"xg3s-2*sg3s","v":20.294166941360405},{"$f":"xg3s-3*sg3s","v":20.28951041204061},{"$f":"OSG3s","v":20.45},{"$f":"USG3s","v":20.149999999999999},{"$f":"xm3s","v":20.302},{"$f":"xm3s-0.1*T3s","v":20.271999999999998},{"$f":"xm3s+0.1*T3s","v":20.332000000000001}]
[2,{"$f":"IF('MSA Verfahren 1 3s'!B25=\"\",#N/A,'MSA Verfahren 1 3s'!B25)","v":20.300999999999998},{"$f":"IF(B6<>\"\",A6,C5)","v":2},{"$f":"IF(B6<>\"\",B6,D5)","v":20.300999999999998},20.303479999999997,20.312793058639588,20.317449587959384,20.294166941360405,20.28951041204061,20.45,20.149999999999999,20.302,20.271999999999998,20.332000000000001,null,"cg",0,{"$f":"cg3s","v":2.1475221808412286},0]
[3,{"$f":"IF('MSA Verfahren 1 3s'!B26=\"\",#N/A,'MSA Verfahren 1 3s'!B26)","v":20.303999999999998},{"$f":"IF(B7<>\"\",A7,C6)","v":3},{"$f":"IF(B7<>\"\",B7,D6)","v":20.303999999999998},20.303479999999997,20.312793058639588,20.317449587959384,20.294166941360405,20.28951041204061,20.45,20.149999999999999,20.302,20.271999999999998,20.332000000000001,null,"Anforderung cg",{"$f":"Forderungcg3s","v":1.33},0,{"$f":"ABS(Q7-R6)+0.2","v":1.0175221808412285}]
[4,{"$f":"IF('MSA Verfahren 1 3s'!B27=\"\",#N/A,'MSA Verfahren 1 3s'!B27)","v":20.303000000000001},4,20.303000000000001,20.303479999999997,20.312793058639588,20.317449587959384,20.294166941360405,20.28951041204061,20.45,20.149999999999999,20.302,20.271999999999998,20.332000000000001]
[5,{"$f":"IF('MSA Verfahren 1 3s'!B28=\"\",#N/A,'MSA Verfahren 1 3s'!B28)","v":20.306000000000001},5,20.306000000000001,20.303479999999997,20.312793058639588,20.317449587959384,20.294166941360405,20.28951041204061,20.45,20.149999999999999,20.302,20.271999999999998,20.332000000000001]
[6,{"$f":"IF('MSA Verfahren 1 3s'!C24=\"\",#N/A,'MSA Verfahren 1 3s'!C24)","v":20.295999999999999},6,20.295999999999999,20.303479999999997,20.312793058639588,20.317449587959384,20.294166941360405,20.28951041204061,20.45,20.149999999999999,20.302,20.271999999999998,20.332000000000001]
[7,{"$f":"IF('MSA Verfahren 1 3s'!C25=\"\",#N/A,'MSA Verfahren 1 3s'!C25)","v":20.300999999999998},7,20.300999999999998,20.303479999999997,20.312793058639588,20.317449587959384,20.294166941360405,20.28951041204061,20.45,20.149999999999999,20.302,20.271999999999998,20.332000000000001]
[8,{"$f":"IF('MSA Verfahren 1 3s'!C26=\"\",#N/A,'MSA Verfahren 1 3s'!C26)","v":20.3},8,20.3,20.303479999999997,20.312793058639588,20.317449587959384,20.294166941360405,20.28951041204061,20.45,20.149999999999999,20.302,20.271999999999998,20.332000000000001]
[9,{"$f":"IF('MSA Verfahren 1 3s'!C27=\"\",#N/A,'MSA Verfahren 1 3s'!C27)","v":20.306999999999999},9,20.306999999999999,20.303479999999997,20.312793058639588,20.317449587959384,20.294166941360405,20.28951041204061,20.45,20.149999999999999,20.302,20.271999999999998,20.332000000000001]
[10,{"$f":"IF('MSA Verfahren 1 3s'!C28=\"\",#N/A,'MSA Verfahren 1 3s'!C28)","v":20.305},10,20.305,20.303479999999997,20.312793058639588,20.317449587959384,20.294166941360405,20.28951041204061,20.45,20.149999999999999,20.302,20.271999999999998,20.332000000000001]
[11,{"$f":"IF('MSA Verfahren 1 3s'!D24=\"\",#N/A,'MSA Verfahren 1 3s'!D24)","v":20.311},11,20.311,20.303479999999997,20.312793058639588,20.317449587959384,20.294166941360405,20.28951041204061,20.45,20.149999999999999,20.302,20.271999999999998,20.332000000000001]
[12,{"$f":"IF('MSA Verfahren 1 3s'!D25=\"\",#N/A,'MSA Verfahren 1 3s'!D25)","v":20.297000000000001},12,20.297000000000001,20.303479999999997,20.312793058639588,20.317449587959384,20.294166941360405,20.28951041204061,20.45,20.149999999999999,20.302,20.271999999999998,20.332000000000001]
[13,{"$f":"IF('MSA Verfahren 1 3s'!D26=\"\",#N/A,'MSA Verfahren 1 3s'!D26)","v":20.295000000000002},13,20.295000000000002,20.303479999999997,20.312793058639588,20.317449587959384,20.294166941360405,20.28951041204061,20.45,20.149999999999999,20.302,20.271999999999998,20.332000000000001,null,"Quelle:","http://www.sixsigmablackbelt.de/msa-messsystemanalyse-messmittelfaehigkeit/"]
[14,{"$f":"IF('MSA Verfahren 1 3s'!D27=\"\",#N/A,'MSA Verfahren 1 3s'!D27)","v":20.302},14,20.302,20.303479999999997,20.312793058639588,20.317449587959384,20.294166941360405,20.28951041204061,20.45,20.149999999999999,20.302,20.271999999999998,20.332000000000001]
[15,{"$f":"IF('MSA Verfahren 1 3s'!D28=\"\",#N/A,'MSA Verfahren 1 3s'!D28)","v":20.303999999999998},15,20.303999999999998,20.303479999999997,20.312793058639588,20.317449587959384,20.294166941360405,20.28951041204061,20.45,20.149999999999999,20.302,20.271999999999998,20.332000000000001,null,"Literatur:","Eignungsnachweis von Prüfprozessen: Prüfmittelfähigkeit und Messunsicherheit im aktuellen Normenumfeld"]
[16,{"$f":"IF('MSA Verfahren 1 3s'!E24=\"\",#N/A,'MSA Verfahren 1 3s'!E24)","v":20.297999999999998},16,20.297999999999998,20.303479999999997,20.312793058639588,20.317449587959384,20.294166941360405,20.28951041204061,20.45,20.149999999999999,20.302,20.271999999999998,20.332000000000001,null,null,"Statistische Verfahren zur Maschinen- und Prozessqualifikation"]
[17,{"$f":"IF('MSA Verfahren 1 3s'!E25=\"\",#N/A,'MSA Verfahren 1 3s'!E25)","v":20.295000000000002},17,20.295000000000002,20.303479999999997,20.312793058639588,20.317449587959384,20.294166941360405,20.28951041204061,20.45,20.149999999999999,20.302,20.271999999999998,20.332000000000001]
[18,{"$f":"IF('MSA Verfahren 1 3s'!E26=\"\",#N/A,'MSA Verfahren 1 3s'!E26)","v":20.300999999999998},18,20.300999999999998,20.303479999999997,20.312793058639588,20.317449587959384,20.294166941360405,20.28951041204061,20.45,20.149999999999999,20.302,20.271999999999998,20.332000000000001,null,"Berechnung mit Minitab"]
[19,{"$f":"IF('MSA Verfahren 1 3s'!E27=\"\",#N/A,'MSA Verfahren 1 3s'!E27)","v":20.306999999999999},19,20.306999999999999,20.303479999999997,20.312793058639588,20.317449587959384,20.294166941360405,20.28951041204061,20.45,20.149999999999999,20.302,20.271999999999998,20.332000000000001]
[20,{"$f":"IF('MSA Verfahren 1 3s'!E28=\"\",#N/A,'MSA Verfahren 1 3s'!E28)","v":20.312000000000001},20,20.312000000000001,20.303479999999997,20.312793058639588,20.317449587959384,20.294166941360405,20.28951041204061,20.45,20.149999999999999,20.302,20.271999999999998,20.332000000000001]
[21,{"$f":"IF('MSA Verfahren 1 3s'!F24=\"\",#N/A,'MSA Verfahren 1 3s'!F24)","v":20.311},21,20.311,20.303479999999997,20.312793058639588,20.317449587959384,20.294166941360405,20.28951041204061,20.45,20.149999999999999,20.302,20.271999999999998,20.332000000000001]
[22,{"$f":"IF('MSA Verfahren 1 3s'!F25=\"\",#N/A,'MSA Verfahren 1 3s'!F25)","v":20.309000000000001},22,20.309000000000001,20.303479999999997,20.312793058639588,20.317449587959384,20.294166941360405,20.28951041204061,20.45,20.149999999999999,20.302,20.271999999999998,20.332000000000001]
[23,{"$f":"IF('MSA Verfahren 1 3s'!F26=\"\",#N/A,'MSA Verfahren 1 3s'!F26)","v":20.308},23,20.308,20.303479999999997,20.312793058639588,20.317449587959384,20.294166941360405,20.28951041204061,20.45,20.149999999999999,20.302,20.271999999999998,20.332000000000001]
[24,{"$f":"IF('MSA Verfahren 1 3s'!F27=\"\",#N/A,'MSA Verfahren 1 3s'!F27)","v":20.303999999999998},24,20.303999999999998,20.303479999999997,20.312793058639588,20.317449587959384,20.294166941360405,20.28951041204061,20.45,20.149999999999999,20.302,20.271999999999998,20.332000000000001]
[25,{"$f":"IF('MSA Verfahren 1 3s'!F28=\"\",#N/A,'MSA Verfahren 1 3s'!F28)","v":20.297999999999998},25,20.297999999999998,20.303479999999997,20.312793058639588,20.317449587959384,20.294166941360405,20.28951041204061,20.45,20.149999999999999,20.302,20.271999999999998,20.332000000000001]
[26,{"$f":"IF('MSA Verfahren 1 3s'!G24=\"\",#N/A,'MSA Verfahren 1 3s'!G24)","v":20.308},26,20.308,20.303479999999997,20.312793058639588,20.317449587959384,20.294166941360405,20.28951041204061,20.45,20.149999999999999,20.302,20.271999999999998,20.332000000000001]
[27,{"$f":"IF('MSA Verfahren 1 3s'!G25=\"\",#N/A,'MSA Verfahren 1 3s'!G25)","v":20.302},27,20.302,20.303479999999997,20.312793058639588,20.317449587959384,20.294166941360405,20.28951041204061,20.45,20.149999999999999,20.302,20.271999999999998,20.332000000000001]
[28,{"$f":"IF('MSA Verfahren 1 3s'!G26=\"\",#N/A,'MSA Verfahren 1 3s'!G26)","v":20.294},28,20.294,20.303479999999997,20.312793058639588,20.317449587959384,20.294166941360405,20.28951041204061,20.45,20.149999999999999,20.302,20.271999999999998,20.332000000000001]
[29,{"$f":"IF('MSA Verfahren 1 3s'!G27=\"\",#N/A,'MSA Verfahren 1 3s'!G27)","v":20.302},29,20.302,20.303479999999997,20.312793058639588,20.317449587959384,20.294166941360405,20.28951041204061,20.45,20.149999999999999,20.302,20.271999999999998,20.332000000000001]
[30,{"$f":"IF('MSA Verfahren 1 3s'!G28=\"\",#N/A,'MSA Verfahren 1 3s'!G28)","v":20.303999999999998},30,20.303999999999998,20.303479999999997,20.312793058639588,20.317449587959384,20.294166941360405,20.28951041204061,20.45,20.149999999999999,20.302,20.271999999999998,20.332000000000001]
[31,{"$f":"IF('MSA Verfahren 1 3s'!H24=\"\",#N/A,'MSA Verfahren 1 3s'!H24)","v":20.312999999999999},31,20.312999999999999,20.303479999999997,20.312793058639588,20.317449587959384,20.294166941360405,20.28951041204061,20.45,20.149999999999999,20.302,20.271999999999998,20.332000000000001]
[32,{"$f":"IF('MSA Verfahren 1 3s'!H25=\"\",#N/A,'MSA Verfahren 1 3s'!H25)","v":20.303000000000001},32,20.303000000000001,20.303479999999997,20.312793058639588,20.317449587959384,20.294166941360405,20.28951041204061,20.45,20.149999999999999,20.302,20.271999999999998,20.332000000000001]
[33,{"$f":"IF('MSA Verfahren 1 3s'!H26=\"\",#N/A,'MSA Verfahren 1 3s'!H26)","v":20.308},33,20.308,20.303479999999997,{"$f":"xg3s+2*sg3s","v":20.312793058639588},{"$f":"xg3s+3*sg3s","v":20.317449587959384},{"$f":"xg3s-2*sg3s","v":20.294166941360405},{"$f":"xg3s-3*sg3s","v":20.28951041204061},20.45,20.149999999999999,20.302,20.271999999999998,20.332000000000001]
[34,{"$f":"IF('MSA Verfahren 1 3s'!H27=\"\",#N/A,'MSA Verfahren 1 3s'!H27)","v":20.297999999999998},34,20.297999999999998,20.303479999999997,20.312793058639588,20.317449587959384,20.294166941360405,20.28951041204061,20.45,20.149999999999999,20.302,20.271999999999998,20.332000000000001]
[35,{"$f":"IF('MSA Verfahren 1 3s'!H28=\"\",#N/A,'MSA Verfahren 1 3s'!H28)","v":20.306000000000001},35,20.306000000000001,20.303479999999997,20.312793058639588,20.317449587959384,20.294166941360405,20.28951041204061,20.45,20.149999999999999,20.302,20.271999999999998,20.332000000000001]
[36,{"$f":"IF('MSA Verfahren 1 3s'!I24=\"\",#N/A,'MSA Verfahren 1 3s'!I24)","v":20.303000000000001},36,20.303000000000001,20.303479999999997,20.312793058639588,20.317449587959384,20.294166941360405,20.28951041204061,20.45,20.149999999999999,20.302,20.271999999999998,20.332000000000001]
[37,{"$f":"IF('MSA Verfahren 1 3s'!I25=\"\",#N/A,'MSA Verfahren 1 3s'!I25)","v":20.309999999999999},37,20.309999999999999,20.303479999999997,20.312793058639588,20.317449587959384,20.294166941360405,20.28951041204061,20.45,20.149999999999999,20.302,20.271999999999998,20.332000000000001]
[38,{"$f":"IF('MSA Verfahren 1 3s'!I26=\"\",#N/A,'MSA Verfahren 1 3s'!I26)","v":20.303999999999998},38,20.303999999999998,20.303479999999997,20.312793058639588,20.317449587959384,20.294166941360405,20.28951041204061,20.45,20.149999999999999,20.302,20.271999999999998,20.332000000000001]
[39,{"$f":"IF('MSA Verfahren 1 3s'!I27=\"\",#N/A,'MSA Verfahren 1 3s'!I27)","v":20.309000000000001},39,20.309000000000001,20.303479999999997,20.312793058639588,20.317449587959384,20.294166941360405,20.28951041204061,20.45,20.149999999999999,20.302,20.271999999999998,20.332000000000001]
[40,{"$f":"IF('MSA Verfahren 1 3s'!I28=\"\",#N/A,'MSA Verfahren 1 3s'!I28)","v":20.305},40,20.305,20.303479999999997,20.312793058639588,20.317449587959384,20.294166941360405,20.28951041204061,20.45,20.149999999999999,20.302,20.271999999999998,20.332000000000001]
[41,{"$f":"IF('MSA Verfahren 1 3s'!J24=\"\",#N/A,'MSA Verfahren 1 3s'!J24)","v":20.306000000000001},41,20.306000000000001,20.303479999999997,20.312793058639588,20.317449587959384,20.294166941360405,20.28951041204061,20.45,20.149999999999999,20.302,20.271999999999998,20.332000000000001]
[42,{"$f":"IF('MSA Verfahren 1 3s'!J25=\"\",#N/A,'MSA Verfahren 1 3s'!J25)","v":20.295999999999999},42,20.295999999999999,20.303479999999997,20.312793058639588,20.317449587959384,20.294166941360405,20.28951041204061,20.45,20.149999999999999,20.302,20.271999999999998,20.332000000000001]
[43,{"$f":"IF('MSA Verfahren 1 3s'!J26=\"\",#N/A,'MSA Verfahren 1 3s'!J26)","v":20.306000000000001},43,20.306000000000001,20.303479999999997,20.312793058639588,20.317449587959384,20.294166941360405,20.28951041204061,20.45,20.149999999999999,20.302,20.271999999999998,20.332000000000001]
[44,{"$f":"IF('MSA Verfahren 1 3s'!J27=\"\",#N/A,'MSA Verfahren 1 3s'!J27)","v":20.298999999999999},44,20.298999999999999,20.303479999999997,20.312793058639588,20.317449587959384,20.294166941360405,20.28951041204061,20.45,20.149999999999999,20.302,20.271999999999998,20.332000000000001]
[45,{"$f":"IF('MSA Verfahren 1 3s'!J28=\"\",#N/A,'MSA Verfahren 1 3s'!J28)","v":20.3},45,20.3,20.303479999999997,20.312793058639588,20.317449587959384,20.294166941360405,20.28951041204061,20.45,20.149999999999999,20.302,20.271999999999998,20.332000000000001]
[46,{"$f":"IF('MSA Verfahren 1 3s'!K24=\"\",#N/A,'MSA Verfahren 1 3s'!K24)","v":20.302},46,20.302,20.303479999999997,20.312793058639588,20.317449587959384,20.294166941360405,20.28951041204061,20.45,20.149999999999999,20.302,20.271999999999998,20.332000000000001]
[47,{"$f":"IF('MSA Verfahren 1 3s'!K25=\"\",#N/A,'MSA Verfahren 1 3s'!K25)","v":20.303000000000001},47,20.303000000000001,20.303479999999997,20.312793058639588,20.317449587959384,20.294166941360405,20.28951041204061,20.45,20.149999999999999,20.302,20.271999999999998,20.332000000000001]
[48,{"$f":"IF('MSA Verfahren 1 3s'!K26=\"\",#N/A,'MSA Verfahren 1 3s'!K26)","v":20.306999999999999},48,20.306999999999999,20.303479999999997,20.312793058639588,20.317449587959384,20.294166941360405,20.28951041204061,20.45,20.149999999999999,20.302,20.271999999999998,20.332000000000001]
[49,{"$f":"IF('MSA Verfahren 1 3s'!K27=\"\",#N/A,'MSA Verfahren 1 3s'!K27)","v":20.303000000000001},49,20.303000000000001,20.303479999999997,20.312793058639588,20.317449587959384,20.294166941360405,20.28951041204061,20.45,20.149999999999999,20.302,20.271999999999998,20.332000000000001]
[50,{"$f":"IF('MSA Verfahren 1 3s'!K28=\"\",#N/A,'MSA Verfahren 1 3s'!K28)","v":20.305},50,20.305,20.303479999999997,20.312793058639588,20.317449587959384,20.294166941360405,20.28951041204061,20.45,20.149999999999999,20.302,20.271999999999998,20.332000000000001]