{"text_format":"1","workbook":"xlsx","n_sheets":5,"sheets":["Start","input","calculation","info_setup","language"],"not_rendered":{"charts":3,"images":11,"macros":1,"external_links":0,"defined_names":39,"comments":0,"pivot_tables":0},"unopened":[],"bounds":{"document_bytes":16777216,"sheet_cells":100000,"rows_first":2000,"rows_last":500,"rows_between":2000,"halvings":0,"cell_chars":16384,"cell_head_chars":4096},"cells_cut":0,"cells_raw":0,"read":"whole","date_system":"1900"}

{"sheet":"Start","index":0,"n_rows":10,"n_cols":2,"rows_kept":10,"cut":false,"hidden":true,"merged":[]}
[]
[]
[]
[null,"Das Makro ist momentan nicht aktiviert"]
[null,"Bitte Aktivieren Sie das Makro"]
[null,"Ohne Makro funktioniert diese Datei nicht"]
[]
[null,"roland.schnurr@sixsigmablackbelt.de"]
[]
[null,"https://www.sixsigmablackbelt.de"]

{"sheet":"input","index":1,"n_rows":55,"n_cols":28,"rows_kept":55,"cut":false,"hidden":false,"merged":[[1,1,1,12],[7,14,7,15],[8,14,8,15],[1,13,1,19],[10,14,10,15],[1,20,1,24],[3,13,3,15],[4,13,4,15],[9,14,9,15],[6,14,6,15],[47,17,53,24],[11,14,11,15],[13,14,13,15],[36,13,36,14],[41,13,41,15],[46,13,46,15],[38,13,38,14],[34,13,34,14],[14,13,14,14],[15,13,15,14],[17,13,17,14],[12,14,12,15],[24,13,24,14],[16,13,16,14],[47,13,49,13],[42,13,44,13],[39,13,39,14],[30,13,33,13],[27,13,28,14],[37,13,37,14],[27,15,28,15],[26,13,26,14],[25,13,25,14],[21,14,21,15],[21,13,22,13],[22,14,22,15]]}
[]
[null,null,null,null,null,null,null,null,null,null,null,null,null,{"$f":"language!C1","v":"Prozess- und Maschinenfähigkeit"},null,null,null,null,null,null,null,null,null,null,null,null,null,{"$f":"IF(calculation!A210=0,language!BJ1,language!BK1)","v":"Status: Die Werte im Arbeitsblatt sind kalkuliert"}]
[]
[null,"i","xi",null,"i","xi",null,"i","xi",null,"i","xi",null,{"$f":"language!D1","v":"Werte können geändert werden"}]
[null,1,0.13,null,51,null,null,101,null,null,151,null,null,{"$f":"language!E1","v":"Werte werden berechnet (Blatt Berechnung)"}]
[null,2,0.78,null,52,null,null,102,null,null,152]
[null,3,0.23,null,53,null,null,103,null,null,153,null,null,{"$f":"language!F1","v":"Artikel:"},"Halter"]
[null,4,0.04,null,54,null,null,104,null,null,154,null,null,{"$f":"language!G1","v":"Nummer:"},"C2G234824ß"]
[null,5,0.25,null,55,null,null,105,null,null,155,null,null,{"$f":"language!H1","v":"Zeichnung:"},"UZT1340124357"]
[null,6,0.3,null,56,null,null,106,null,null,156,null,null,{"$f":"language!I1","v":"Prüfer:"},"Maier"]
[null,7,0.35,null,57,null,null,107,null,null,157,null,null,{"$f":"language!J1","v":"Messmittel:"},"Waage 47.22452"]
[null,8,0.34,null,58,null,null,108,null,null,158,null,null,{"$f":"language!K1","v":"Datum:"},"2014-12-10"]
[null,9,0.42,null,59,null,null,109,null,null,159,null,null,{"$f":"language!L1","v":"Merkmal:"},"Länge"]
[null,10,0.39,null,60,null,null,110,null,null,160,null,null,{"$f":"language!M1","v":"Maßeinheit:"},"mm"]
[null,11,0.32,null,61,null,null,111,null,null,161,null,null,{"$f":"language!N1","v":"Sollwert msoll ="},null,20]
[null,12,0.16,null,62,null,null,112,null,null,162,null,null,{"$f":"language!O1","v":"UGW"}]
[null,13,0.48,null,63,null,null,113,null,null,163,null,null,{"$f":"language!P1","v":"OGW"},null,1]
[null,14,0.1,null,64,null,null,114,null,null,164,null,null,{"$f":"language!Q1","v":"Anzahl Klassen Histogramm"},null,20]
[null,15,0.22,null,65,null,null,115,null,null,165,null,null,{"$f":"language!R1","v":"Cpk<"},1.33,{"$f":"language!V1","v":"Prozess nicht fähig"}]
[null,16,0.3,null,66,null,null,116,null,null,166,null,null,{"$f":"language!S1","v":"Cpk"},{"$f":"language!U1","v":"dazwischen"},{"$f":"language!W1","v":"Prozess bedingt fähig"}]
[null,17,0.46,null,67,null,null,117,null,null,167,null,null,{"$f":"language!T1","v":"Cpk>"},1.66,{"$f":"language!X1","v":"Prozess fähig"}]
[null,18,0.14000000000000001,null,68,null,null,118,null,null,168,null,null,{"$f":"language!BP1","v":"Verteilung"},{"$f":"language!BR1","v":"Normalverteilung"}]
[null,19,0.22,null,69,null,null,119,null,null,169,null,null,null,{"$f":"language!BS1","v":"Betragsverteilung 1. Art"}]
[null,20,0.45,null,70,null,null,120,null,null,170]
[null,21,null,null,71,null,null,121,null,null,171,null,null,{"$f":"language!Y1","v":"Stichprobenumfang"},null,{"$f":"calculation!I25","v":20}]
[null,22,null,null,72,null,null,122,null,null,172,null,null,{"$f":"language!Z1","v":"Mittelwert"},null,{"$f":"calculation!I27","v":0.30399999999999999}]
[null,23,null,null,73,null,null,123,null,null,173,null,null,{"$f":"language!AA1","v":"Standardabweichung"},null,{"$f":"Standardabweichung","v":0.16850425576}]
[null,24,null,null,74,null,null,124,null,null,174,null,null,{"$f":"language!AB1","v":"Die Werte sind nach Andersson Darling Test"},null,{"$f":"IF(calculation!I22<0.05,language!AD1,language!AC1)","v":"normalverteilt"}]
[null,25,null,null,75,null,null,125,null,null,175]
[null,26,null,null,76,null,null,126,null,null,176]
[null,27,null,null,77,null,null,127,null,null,177,null,null,{"$f":"language!AP1","v":"Fähigkeits- kennwerte"},{"$f":"language!AL1","v":"Cmu"},{"$f":"calculation!I31","v":""}]
[null,28,null,null,78,null,null,128,null,null,178,null,null,null,{"$f":"language!AM1","v":"Cmo"},{"$f":"calculation!I32","v":""}]
[null,29,null,null,79,null,null,129,null,null,179,null,null,null,{"$f":"language!AN1","v":"Cm"},{"$f":"calculation!I30","v":""}]
[null,30,null,null,80,null,null,130,null,null,180,null,null,null,{"$f":"language!AO1","v":"Cmk"},{"$f":"calculation!I33","v":1.3308}]
[null,31,null,null,81,null,null,131,null,null,181,null,null,{"$f":"language!AQ1","v":"Bewertung cmk =>"},null,{"$f":"IF(P34<O19,P19,IF(P34>O21,P21,P20))","v":"Prozess bedingt fähig"}]
[null,32,null,null,82,null,null,132,null,null,182]
[null,33,null,null,83,null,null,133,null,null,183,null,null,{"$f":"language!AR1","v":"Median z"},null,{"$f":"Median","v":0.3}]
[null,34,null,null,84,null,null,134,null,null,184,null,null,{"$f":"language!AS1","v":"Spannweite R"},null,{"$f":"Spannweite","v":0.74}]
[null,35,null,null,85,null,null,135,null,null,185,null,null,{"$f":"language!AT1","v":"Minimum"},null,{"$f":"Minimum","v":0.04}]
[null,36,null,null,86,null,null,136,null,null,186,null,null,{"$f":"language!AU1","v":"Maximum"},null,{"$f":"Maximum","v":0.78}]
[null,37,null,null,87,null,null,137,null,null,187]
[null,38,null,null,88,null,null,138,null,null,188,null,null,{"$f":"language!AV1","v":"Berechnete Leistung in ppm"}]
[null,39,null,null,89,null,null,139,null,null,189,null,null,{"$f":"language!AW1","v":"Über- schreitungs- anteil"},{"$f":"language!AX1","v":"pUGW"},{"$f":"calculation!I35","v":0}]
[null,40,null,null,90,null,null,140,null,null,190,null,null,null,{"$f":"language!AY1","v":"pOGW"},{"$f":"calculation!I34","v":33}]
[null,41,null,null,91,null,null,141,null,null,191,null,null,null,{"$f":"language!AZ1","v":"p"},{"$f":"P43+P44","v":33}]
[null,42,null,null,92,null,null,142,null,null,192]
[null,43,null,null,93,null,null,143,null,null,193,null,null,{"$f":"language!BA1","v":"Beobachtete Leistung in ppm"}]
[null,44,null,null,94,null,null,144,null,null,194,null,null,{"$f":"language!AW1","v":"Über- schreitungs- anteil"},{"$f":"language!AX1","v":"pUGW"},{"$f":"BEOBPUGW","v":0},null,{"$f":"language!BL1","v":"Ist Ihr Messwert einseitig begrenzt, so geben Sie nur den entsprechenden oberen oder unteren Grenzwert an. Bei einer einseitigen Grenze wird im industriellen Umfeld nur der Cmk berechnet."}]
[null,45,null,null,95,null,null,145,null,null,195,null,null,null,{"$f":"language!AY1","v":"pOGW"},{"$f":"BEOBPOGW","v":0}]
[null,46,null,null,96,null,null,146,null,null,196,null,null,null,{"$f":"language!AZ1","v":"p"},{"$f":"P49+P48","v":0}]
[null,47,null,null,97,null,null,147,null,null,197]
[null,48,null,null,98,null,null,148,null,null,198]
[null,49,null,null,99,null,null,149,null,null,199]
[null,50,null,null,100,null,null,150,null,null,200]
[null,50,56,null,100,22,null,150,6,null,200,33]

{"sheet":"calculation","index":2,"n_rows":210,"n_cols":67,"rows_kept":210,"cut":false,"hidden":true,"merged":[[57,16,57,25]]}
["[\"{\\\"ergebnisuservalidieren\\\":[\\\"user 0 mit cmk in datensatz nicht vorhanden\\\"],\\\"ergebnisuservalidieren_status\\\":[\\\"nein\\\"],\\\"pwertadtest\\\":[\\\"0.5187\\\"],\\\"Verteilung\\\":[\\\"betrag1\\\"],\\\"summe\\\":[6.08],\\\"stichprobenumfang\\\":[20],\\\"sd\\\":[0.16850425576],\\\"mittelwert\\\":[0.304],\\\"Lizenzdatum\\\":[\\\"\\\"],\\\"Notiz\\\":[\\\" \\\"],\\\"cp\\\":[\\\"\\\"],\\\"cpu\\\":[\\\"\\\"],\\\"cpo\\\":[\\\"\\\"],\\\"cpk\\\":[\\\"1.3308\\\"],\\\"ppmo\\\":[\\\"33\\\"],\\\"ppmu\\\":[\\\"0\\\"],\\\"platz1\\\":[\\\"platz1\\\"],\\\"platz2\\\":[\\\"platz1\\\"],\\\"platz3\\\":[\\\"platz1\\\"],\\\"Verteilung Diagramm\\\":[{\\\"qfoldnorm\\\":919,\\\"dfoldnorm\\\":1087963},{\\\"qfoldnorm\\\":9183,\\\"dfoldnorm\\\":1090680},{\\\"qfoldnorm\\\":22860,\\\"dfoldnorm\\\":1104876},{\\\"qfoldnorm\\\":45055,\\\"dfoldnorm\\\":1152882},{\\\"qfoldnorm\\\":85844,\\\"dfoldnorm\\\":1312864},{\\\"qfoldnorm\\\":152527,\\\"dfoldnorm\\\":1702119},{\\\"qfoldnorm\\\":206126,\\\"dfoldnorm\\\":2019645},{\\\"qfoldnorm\\\":253164,\\\"dfoldnorm\\\":2213380},{\\\"qfoldnorm\\\":297513,\\\"dfoldnorm\\\":2274185},{\\\"qfoldnorm\\\":342006,\\\"dfoldnorm\\\":2197989},{\\\"qfoldnorm\\\":389673,\\\"dfoldnorm\\\":1976475},{\\\"qfoldnorm\\\":445488,\\\"dfoldnorm\\\":1590923},{\\\"qfoldnorm\\\":522910,\\\"dfoldnorm\\\":997170},{\\\"qfoldnorm\\\":586851,\\\"dfoldnorm\\\":585996},{\\\"qfoldnorm\\\":642311,\\\"dfoldnorm\\\":332071},{\\\"qfoldnorm\\\":706795,\\\"dfoldnorm\\\":151430},{\\\"qfoldnorm\\\":841240,\\\"dfoldnorm\\\":19130}]}\"]"]
[{"$f":"IF(B2=C2,0,1)","v":0},"betrag1",{"$f":"M16","v":"betrag1"}]
[{"$f":"IF(B3=C3,0,1)","v":0},"1",{"$f":"O16","v":"1"}]
[0,"",{"$f":"Q16","v":""}]
[{"$f":"IF(B5=C5,0,1)","v":0},0.13,{"$f":"IF(input!C5=\"\",\"\",input!C5)","v":0.13},"\"",{"$f":"SUBSTITUTE(C5,\",\",\".\")","v":"0.13"},"\", ",",",null,null,null,null,null,null,null,null,null,null,null,null,null,null,null,null,null,null,null,null,null,null,null,1,{"$f":"IF((Anzahl>AE5),AE5,Anzahl)","v":1},{"$f":"IF(B5<>\"\",B5,#N/A)","v":0.13},{"$f":"IF(OGW=\"\",#N/A,IF(B5<>\"\",OGW,#N/A))","v":1},{"$f":"IF(UGW=\"\",#N/A,IF(B5<>\"\",UGW,#N/A))","v":{"$error":"#N/A"}},{"$f":"I27-Standardabweichung","v":0.13549574423999999},{"$f":"fxds+Standardabweichung","v":0.47250425575999999},{"$f":"fxds-2*Standardabweichung","v":-3.3008511520000006E-2},{"$f":"fxds+2*Standardabweichung","v":0.64100851151999994},{"$f":"fxds-3*Standardabweichung","v":-0.20151276727999995},{"$f":"fxds+3*Standardabweichung","v":0.80951276727999999},{"$f":"fxds","v":0.30399999999999999},null,{"$f":"IF(AND(B5<>\"\",B5<UGW),1,0)","v":0},{"$f":"IF(AND(B5<>\"\",B5>OGW),1,0)","v":0},null,null,null,-6,{"$f":"fxds+AW5*Standardabweichung","v":-0.70702553455999984},3,{"$f":"AY5*2","v":6},{"$f":"AX5","v":-0.70702553455999984},null,null,1,{"$f":"IF(B5=\"\",NA(),SMALL(xi,BF5))","v":0.04},{"$f":"IF(B5=\"\",\"\",1)","v":1},{"$f":"IF(B5=\"\",\"\",NORMSDIST((BE5-fxds)/Standardabweichung))","v":5.8589374419449482E-2},{"$f":"IF(B5=\"\",\"\",1-BG5)","v":0.94141062558055055},{"$f":"IF(IF(B5=\"\",\"\",SMALL(BG,BF5))=0,0.0001,IF(B5=\"\",\"\",SMALL(BG,BF5)))","v":2.3651047488307819E-3},{"$f":"IF(B5=\"\",\"\",(2*BF5-1)*(LN(BI5)+LN(BG5)))","v":-8.8841348894992116},{"$f":"IF(B5=\"\",NA(),NORMSINV((BF5-0.3)/(Anzahl+0.4)))","v":-1.8208645376396548},null,null,{"$f":"Standardabweichung*BO5+fxds","v":0.80951276727999999},3]
[{"$f":"IF(B6=C6,0,1)","v":0},0.78,{"$f":"IF(input!C6=\"\",\"\",input!C6)","v":0.78},"\"",{"$f":"SUBSTITUTE(C6,\",\",\".\")","v":"0.78"},"\", ",null,null,null,null,null,null,null,null,null,null,null,null,null,null,null,null,null,null,null,null,null,null,null,null,2,2,{"$f":"IF(B6<>\"\",B6,#N/A)","v":0.78},1,{"$error":"#N/A"},{"$f":"AJ5","v":0.13549574423999999},0.47250425575999999,-3.3008511520000006E-2,0.64100851151999994,-0.20151276727999995,0.80951276727999999,0.30399999999999999,null,0,0,null,null,null,-5,-0.5385212788,3,{"$f":"AY6*2","v":6},{"$f":"BA5","v":-0.70702553455999984},null,null,2,0.1,{"$f":"IF(B6=\"\",\"\",1+BF5)","v":2},0.11301441916903474,{"$f":"IF(B6=\"\",\"\",1-BG6)","v":0.88698558083096524},0.14813075772139661,{"$f":"IF(B6=\"\",\"\",(2*BF6-1)*(LN(BI6)+LN(BG6)))","v":-12.269699286899462},-1.3829941271006372,null,null,{"$f":"Standardabweichung*BO6+fxds","v":0.30399999999999999},0]
[0,0.23,{"$f":"IF(input!C7=\"\",\"\",input!C7)","v":0.23},"\"","0.23","\", ",null,null,"string nach R",{"$f":"_xlfn.CONCAT(H16:R16,D5:F204,T16)","v":"\"a\":[\"0\",\"0\",\"betrag1\",\"1\",\"\",\"0.13\", \"0.78\", \"0.23\", \"0.04\", \"0.25\", \"0.3\", \"0.35\", \"0.34\", \"0.42\", \"0.39\", \"0.32\", \"0.16\", \"0.48\", \"0.1\", \"0.22\", \"0.3\", \"0.46\", \"0.14\", \"0.22\", \"0.45\", \"\", \"\", \"\", \"\", \"\", \"\", \"\", \"\", \"\", \"\", \"\", \"\", \"\", \"\", \"\", \"\", \"\", \"\", \"\", \"\", \"\", \"\", \"\", \"\", \"\", \"\", \"\", \"\", \"\", \"\", \"\", \"\", \"\", \"\", \"\", \"\", \"\", \"\", \"\", \"\", \"\", \"\", \"\", \"\", \"\", \"\", \"\", \"\", \"\", \"\", \"\", \"\", \"\", \"\", \"\", \"\", \"\", \"\", \"\", \"\", \"\", \"\", \"\", \"\", \"\", \"\", \"\", \"\", \"\", \"\", \"\", \"\", \"\", \"\", \"\", \"\", \"\", \"\", \"\", \"\", \"\", \"\", \"\", \"\", \"\", \"\", \"\", \"\", \"\", \"\", \"\", \"\", \"\", \"\", \"\", \"\", \"\", \"\", \"\", \"\", \"\", \"\", \"\", \"\", \"\", \"\", \"\", \"\", \"\", \"\", \"\", \"\", \"\", \"\", \"\", \"\", \"\", \"\", \"\", \"\", \"\", \"\", \"\", \"\", \"\", \"\", \"\", \"\", \"\", \"\", \"\", \"\", \"\", \"\", \"\", \"\", \"\", \"\", \"\", \"\", \"\", \"\", \"\", \"\", \"\", \"\", \"\", \"\", \"\", \"\", \"\", \"\", \"\", \"\", \"\", \"\", \"\", \"\", \"\", \"\", \"\", \"\", \"\", \"\", \"\", \"\", \"\", \"\", \"\", \"\", \"\", \"\", \"\", \"\", \"\", \"\", \"\", \"\", \"\", \"\"]"},null,null,null,null,null,null,null,null,null,null,null,null,null,null,null,null,null,null,null,null,3,3,0.23,1,{"$error":"#N/A"},0.13549574423999999,0.47250425575999999,-3.3008511520000006E-2,0.64100851151999994,-0.20151276727999995,0.80951276727999999,0.30399999999999999,null,0,0,null,null,null,-4,-0.37001702304,3,6,{"$f":"BA6","v":-0.70702553455999984},null,null,3,0.13,{"$f":"IF(B7=\"\",\"\",1+BF6)","v":3},0.15089208348779259,0.84910791651220741,0.17727687608201559,-18.106164367588512,-1.1153373577337857,null,null,{"$f":"Standardabweichung*BO7+fxds","v":-0.20151276727999995},-3]
[0,0.04,{"$f":"IF(input!C8=\"\",\"\",input!C8)","v":0.04},"\"","0.04","\", ",null,null,null,null,null,null,null,null,null,null,null,null,null,null,null,null,null,null,null,null,null,null,null,null,4,4,0.04,1,{"$error":"#N/A"},0.13549574423999999,0.47250425575999999,-3.3008511520000006E-2,0.64100851151999994,-0.20151276727999995,0.80951276727999999,0.30399999999999999,null,0,0,null,null,null,-2,-3.3008511520000006E-2,3,6,-0.70702553455999984,null,null,4,0.14000000000000001,4,0.16520976622558445,0.83479023377441552,0.19312255075722617,-24.114787309396899,-0.91014679640886487]
[0,0.25,{"$f":"IF(input!C9=\"\",\"\",input!C9)","v":0.25},"\"","0.25","\", ",null,null,null,null,null,null,null,null,null,null,null,null,null,null,null,null,null,null,null,null,null,null,null,null,5,5,0.25,1,{"$error":"#N/A"},0.13549574423999999,0.47250425575999999,-3.3008511520000006E-2,0.64100851151999994,-0.20151276727999995,0.80951276727999999,0.30399999999999999,null,0,0,null,null,null,-1,0.13549574423999999,3,6,-0.70702553455999984,null,null,5,0.16,5,0.19639245470053124,0.80360754529946876,0.24559734161901381,-27.285319877544403,-0.73755597988205279]
[0,0.3,{"$f":"IF(input!C10=\"\",\"\",input!C10)","v":0.3},"\"","0.3","\", ",null,null,null,null,null,null,null,null,null,null,null,null,null,null,null,null,null,null,null,null,null,null,null,null,6,6,0.3,1,{"$error":"#N/A"},0.13549574423999999,0.47250425575999999,-3.3008511520000006E-2,0.64100851151999994,-0.20151276727999995,0.80951276727999999,0.30399999999999999,null,0,0,null,null,null,1,0.47250425575999999,3,6,-0.70702553455999984,null,null,6,0.22,6,0.30906452045404409,0.69093547954595591,0.30489513127342294,-25.981918745325501,-0.58458985705947353]
[0,0.35,{"$f":"IF(input!C11=\"\",\"\",input!C11)","v":0.35},"\"","0.35","\", ",null,null,null,null,null,null,null,null,null,null,null,null,null,null,null,null,null,null,null,null,null,null,null,null,7,7,0.35,1,{"$error":"#N/A"},0.13549574423999999,0.47250425575999999,-3.3008511520000006E-2,0.64100851151999994,-0.20151276727999995,0.80951276727999999,0.30399999999999999,null,0,0,null,null,null,2,0.64100851151999994,3,6,-0.70702553455999984,null,null,7,0.22,7,0.30906452045404409,0.69093547954595591,0.39243039832308257,-27.424816983460463,-0.44424875676134479]
[0,0.34,{"$f":"IF(input!C12=\"\",\"\",input!C12)","v":0.34},"\"","0.34","\", ",null,null,null,null,null,null,null,null,null,null,null,null,null,null,null,null,null,null,null,null,null,null,null,null,8,8,0.34,1,{"$error":"#N/A"},0.13549574423999999,0.47250425575999999,-3.3008511520000006E-2,0.64100851151999994,-0.20151276727999995,0.80951276727999999,0.30399999999999999,null,0,0,null,null,null,4,0.97801702304000004,3,6,-0.70702553455999984,null,null,8,0.23,8,0.33027351038093722,0.66972648961906278,0.4154121645392701,-29.794773487770776,-0.3121823291636498]
[0,0.42,{"$f":"IF(input!C13=\"\",\"\",input!C13)","v":0.42},"\"","0.42","\", ",null,null,null,null,null,null,null,null,null,null,null,null,null,null,null,null,null,null,null,null,null,null,null,null,9,9,0.42,1,{"$error":"#N/A"},0.13549574423999999,0.47250425575999999,-3.3008511520000006E-2,0.64100851151999994,-0.20151276727999995,0.80951276727999999,0.30399999999999999,null,0,0,null,null,null,5,1.1465212788000001,3,6,-0.70702553455999984,null,null,9,0.25,9,0.37430729119579936,0.62569270880420058,0.46217604306669591,-29.826289193060234,-0.18536701728959676]
[0,0.39,{"$f":"IF(input!C14=\"\",\"\",input!C14)","v":0.39},"\"","0.39","\", ",null,null,null,null,null,null,null,null,null,null,null,null,null,null,null,null,null,null,null,null,null,null,null,null,10,10,0.39,1,{"$error":"#N/A"},0.13549574423999999,0.47250425575999999,-3.3008511520000006E-2,0.64100851151999994,-0.20151276727999995,0.80951276727999999,0.30399999999999999,null,0,0,null,null,null,6,1.3150255345599999,3,6,-0.70702553455999984,null,null,10,0.3,10,0.49053068863886767,0.50946931136113238,0.50946931136113238,-26.346408840881288,-6.1475667639406824E-2]
[0,0.32,{"$f":"IF(input!C15=\"\",\"\",input!C15)","v":0.32},"\"","0.32","\", ",null,null,"userapiname",null,"userapikey",null,"verteilung",null,"\"OGW:",null,"\"UGW:",null,null,null,null,null,null,null,null,null,null,null,null,null,11,11,0.32,1,{"$error":"#N/A"},0.13549574423999999,0.47250425575999999,-3.3008511520000006E-2,0.64100851151999994,-0.20151276727999995,0.80951276727999999,0.30399999999999999,null,0,0,null,null,null,-3,-0.20151276727999995,3,6,-0.70702553455999984,null,null,11,0.3,11,0.49053068863886767,0.50946931136113238,0.50946931136113238,-29.119715034658267,6.1475667639406824E-2]
[0,0.16,{"$f":"IF(input!C16=\"\",\"\",input!C16)","v":0.16},"\"","0.16","\", ",null,"\"a\":[\"",{"$f":"info_setup!C5","v":0},"\",\"",{"$f":"info_setup!C6","v":0},"\",\"","betrag1","\",\"",{"$f":"IF(OGW=\"\",\"\",SUBSTITUTE(OGW,\",\",\".\"))","v":"1"},"\",\"",{"$f":"IF(UGW=\"\",\"\",SUBSTITUTE(UGW,\",\",\".\"))","v":""},"\",",null,"]",null,null,null,null,null,null,null,null,null,null,12,12,0.16,1,{"$error":"#N/A"},0.13549574423999999,0.47250425575999999,-3.3008511520000006E-2,0.64100851151999994,-0.20151276727999995,0.80951276727999999,0.30399999999999999,null,0,0,null,null,null,3,0.80951276727999999,3,6,-0.70702553455999984,null,null,12,0.32,12,0.53782395693330409,0.46217604306669591,0.62569270880420058,-25.049757674046539,0.18536701728959662]
[0,0.48,{"$f":"IF(input!C17=\"\",\"\",input!C17)","v":0.48},"\"","0.48","\", ",null,null,null,null,null,null,null,null,null,null,null,null,null,null,null,null,null,null,null,null,null,null,null,null,13,13,0.48,1,{"$error":"#N/A"},0.13549574423999999,0.47250425575999999,-3.3008511520000006E-2,0.64100851151999994,-0.20151276727999995,0.80951276727999999,0.30399999999999999,null,0,0,null,null,null,null,null,null,null,null,null,null,13,0.34,13,0.5845878354607299,0.4154121645392701,0.66972648961906278,-23.44335273065462,0.31218232916364996]
[0,0.1,{"$f":"IF(input!C18=\"\",\"\",input!C18)","v":0.1},"\"","0.1","\", ",null,null,null,null,null,null,null,null,null,null,null,null,null,null,null,null,null,null,null,null,null,null,null,null,14,14,0.1,1,{"$error":"#N/A"},0.13549574423999999,0.47250425575999999,-3.3008511520000006E-2,0.64100851151999994,-0.20151276727999995,0.80951276727999999,0.30399999999999999,null,0,0,null,null,"Mittelwert",{"$f":"Mittelwert","v":0.30399999999999999},3,null,null,null,null,null,14,0.35,14,0.60756960167691743,0.39243039832308257,0.69093547954595591,-23.435929039257328,0.44424875676134512]
[0,0.22,{"$f":"IF(input!C19=\"\",\"\",input!C19)","v":0.22},"\"","0.22","\", ",null,null,null,null,null,null,null,null,null,null,null,null,null,null,null,null,null,null,null,null,null,null,null,null,15,15,0.22,1,{"$error":"#N/A"},0.13549574423999999,0.47250425575999999,-3.3008511520000006E-2,0.64100851151999994,-0.20151276727999995,0.80951276727999999,0.30399999999999999,null,0,0,null,null,"OGW",{"$f":"OGW","v":1},3,null,null,null,null,null,15,0.39,15,0.69510486872657706,0.30489513127342294,0.69093547954595591,-21.268640214353766,0.58458985705947353]
[0,0.3,{"$f":"IF(input!C20=\"\",\"\",input!C20)","v":0.3},"\"","0.3","\", ",null,"ergebnisuservalidieren:user 0 mit cmk in datensatz nicht vorhanden",null,null,null,null,null,null,null,null,null,null,null,null,null,null,null,null,null,null,null,null,null,null,16,16,0.3,1,{"$error":"#N/A"},0.13549574423999999,0.47250425575999999,-3.3008511520000006E-2,0.64100851151999994,-0.20151276727999995,0.80951276727999999,0.30399999999999999,null,0,0,null,null,"UGW",{"$f":"UGW","v":0},3,null,null,null,null,null,16,0.42,16,0.75440265838098619,0.24559734161901381,0.80360754529946876,-15.514671696974268,0.73755597988205235]
[0,0.46,{"$f":"IF(input!C21=\"\",\"\",input!C21)","v":0.46},"\"","0.46","\", ",null,"nein",{"$f":"H21","v":"nein"},null,null,null,null,null,null,null,null,null,null,null,null,null,null,null,null,null,null,null,null,null,17,17,0.46,1,{"$error":"#N/A"},0.13549574423999999,0.47250425575999999,-3.3008511520000006E-2,0.64100851151999994,-0.20151276727999995,0.80951276727999999,0.30399999999999999,null,0,0,null,null,"Sollwert",{"$f":"Sollwert","v":20},3,null,null,null,null,null,17,0.45,17,0.80687744924277383,0.19312255075722617,0.83479023377441552,-13.040223393338234,0.91014679640886487]
[0,0.14000000000000001,{"$f":"IF(input!C22=\"\",\"\",input!C22)","v":0.14000000000000001},"\"","0.14","\", ",null,0.51870000000000005,{"$f":"H22","v":0.51870000000000005},null,null,null,null,null,null,null,null,null,null,null,null,null,null,null,null,null,null,null,null,null,18,18,0.14000000000000001,1,{"$error":"#N/A"},{"$f":"AJ21","v":0.13549574423999999},0.47250425575999999,-3.3008511520000006E-2,0.64100851151999994,-0.20151276727999995,0.80951276727999999,0.30399999999999999,null,0,0,null,null,null,null,null,null,null,null,null,null,18,0.46,18,0.82272312391798441,0.17727687608201559,0.84910791651220741,-12.554659195943497,1.1153373577337866]
[0,0.22,{"$f":"IF(input!C23=\"\",\"\",input!C23)","v":0.22},"\"","0.22","\", ",null,"betrag1","betrag1",null,null,null,null,null,null,null,null,{"$f":"Maßeinheit","v":"mm"},{"$f":"Merkmal","v":"Länge"},{"$f":"IF(UGW<>\"\",six_cmu(Mittelwert,UGW,Standardabweichung),\"\")","v":""},{"$f":"MEDIAN(xi)","v":0.3},{"$f":"IF(UGW<>0,NORMDIST(UGW,Mittelwert,Standardabweichung,1)*1000000,0)","v":0},{"$f":"IF(UGW<>\"\",AR205/S24*1000000,0)","v":0},null,null,null,null,null,null,null,19,19,0.22,1,{"$error":"#N/A"},0.13549574423999999,0.47250425575999999,-3.3008511520000006E-2,0.64100851151999994,-0.20151276727999995,0.80951276727999999,0.30399999999999999,null,0,0,null,null,null,null,null,null,null,null,null,null,19,0.48,19,0.85186924227860339,0.14813075772139661,0.88698558083096524,-10.369205168907465,1.3829941271006405]
[0,0.45,{"$f":"IF(input!C24=\"\",\"\",input!C24)","v":0.45},"\"","0.45","\", ",null,6.08,6.08,null,null,null,null,null,null,null,null,{"$f":"Sollwert","v":20},{"$f":"six_a(xi)","v":20},{"$f":"IF(OGW<>\"\",six_cmo(OGW,Mittelwert,Standardabweichung),\"\")","v":1.3768198254318085},{"$f":"Maximum-Minimum","v":0.74},{"$f":"IF(OGW<>\"\",(1-NORMDIST(OGW,Mittelwert,Standardabweichung,1))*1000000,0)","v":18.101945559290122},{"$f":"IF(OGW<>\"\",AS205/S24*1000000,0)","v":0},null,null,null,null,null,null,null,20,20,0.45,1,{"$error":"#N/A"},0.13549574423999999,0.47250425575999999,-3.3008511520000006E-2,0.64100851151999994,-0.20151276727999995,0.80951276727999999,0.30399999999999999,null,0,0,null,null,null,null,null,null,null,null,null,null,20,0.78,20,0.99763489525116922,2.3651047488307819E-3,0.94141062558055055,-2.4470069951705113,1.8208645376396548]
[0,null,{"$f":"IF(input!C25=\"\",\"\",input!C25)","v":""},"\"","","\", ",null,20,20,null,null,null,null,null,null,null,null,{"$f":"UGW","v":0},{"$f":"six_m(xi)","v":0.30399999999999994},{"$f":"IF(OR(UGW=\"\",OGW=\"\"),\"\",six_cm(OGW,UGW,Standardabweichung))","v":""},{"$f":"MIN(xi)","v":0.04},{"$f":"BERPOGW+BERPUGW","v":33},{"$f":"W24+W23","v":0},null,null,null,null,null,null,null,21,20,{"$error":"#N/A"},{"$error":"#N/A"},{"$error":"#N/A"},0.13549574423999999,0.47250425575999999,-3.3008511520000006E-2,0.64100851151999994,-0.20151276727999995,0.80951276727999999,0.30399999999999999,null,0,0,null,null,null,null,null,null,null,null,null,null,21,{"$error":"#N/A"},"","","","","",{"$error":"#N/A"}]
[0,null,{"$f":"IF(input!C26=\"\",\"\",input!C26)","v":""},"\"","","\", ",null,0.16850425576,0.16850425576,null,null,null,null,null,null,null,null,{"$f":"OGW","v":1},{"$f":"six_st(xi)","v":0.16850425576384234},{"$f":"IF(OGW=\"\",CMU,IF(UGW=\"\",CMO,six_ck(CMO,CMU)))","v":""},{"$f":"MAX(xi)","v":0.78},null,null,null,null,null,null,null,null,null,22,20,{"$error":"#N/A"},{"$error":"#N/A"},{"$error":"#N/A"},0.13549574423999999,0.47250425575999999,-3.3008511520000006E-2,0.64100851151999994,-0.20151276727999995,0.80951276727999999,0.30399999999999999,null,0,0,null,null,null,null,null,null,null,null,null,null,22,{"$error":"#N/A"},"","","","","",{"$error":"#N/A"}]
[0,null,{"$f":"IF(input!C27=\"\",\"\",input!C27)","v":""},"\"","","\", ",null,0.30399999999999999,0.30399999999999999,null,"normal",null,null,null,null,null,null,null,"Stichprobe chronologisch","OGW",null,null,null,null,null,null,null,null,null,null,23,20,{"$error":"#N/A"},{"$error":"#N/A"},{"$error":"#N/A"},0.13549574423999999,0.47250425575999999,-3.3008511520000006E-2,0.64100851151999994,-0.20151276727999995,0.80951276727999999,0.30399999999999999,null,0,0,null,null,null,null,null,null,null,null,null,null,23,{"$error":"#N/A"},"","","","","",{"$error":"#N/A"}]
[0,null,{"$f":"IF(input!C28=\"\",\"\",input!C28)","v":""},"\"","","\", ",null,null,0,null,"betrag1",null,null,null,null,null,null,null,"Wahrscheinlichkeitsnetz","UGW",null,null,null,null,null,null,null,null,null,null,24,20,{"$error":"#N/A"},{"$error":"#N/A"},{"$error":"#N/A"},0.13549574423999999,0.47250425575999999,-3.3008511520000006E-2,0.64100851151999994,-0.20151276727999995,0.80951276727999999,0.30399999999999999,null,0,0,null,null,null,null,null,null,null,null,null,null,24,{"$error":"#N/A"},"","","","","",{"$error":"#N/A"}]
[0,null,{"$f":"IF(input!C29=\"\",\"\",input!C29)","v":""},"\"","","\", ",null," "," ",null,null,null,null,null,null,null,null,null,"Test auf Normalverteilung (Anderson Darling)",{"$f":"\"+ 3 Sigma\"","v":"+ 3 Sigma"},null,null,null,null,null,null,null,null,null,null,25,20,{"$error":"#N/A"},{"$error":"#N/A"},{"$error":"#N/A"},0.13549574423999999,0.47250425575999999,-3.3008511520000006E-2,0.64100851151999994,-0.20151276727999995,0.80951276727999999,0.30399999999999999,null,0,0,null,null,null,null,null,null,null,null,null,null,25,{"$error":"#N/A"},"","","","","",{"$error":"#N/A"}]
[0,null,{"$f":"IF(input!C30=\"\",\"\",input!C30)","v":""},"\"","","\", ",null,null,{"$f":"IF(H30=\"\",\"\",H30)","v":""},null,null,null,null,null,null,null,null,null,"Prozess- und Maschinenfähigkeit",{"$f":"\"- 3 Sigma\"","v":"- 3 Sigma"},null,null,null,null,null,null,null,null,null,null,26,20,{"$error":"#N/A"},{"$error":"#N/A"},{"$error":"#N/A"},0.13549574423999999,0.47250425575999999,-3.3008511520000006E-2,0.64100851151999994,-0.20151276727999995,0.80951276727999999,0.30399999999999999,null,0,0,null,null,null,null,null,null,null,null,null,null,26,{"$error":"#N/A"},"","","","","",{"$error":"#N/A"}]
[0,null,{"$f":"IF(input!C31=\"\",\"\",input!C31)","v":""},"\"","","\", ",null,null,{"$f":"IF(H31=\"\",\"\",H31)","v":""},null,null,null,null,null,null,null,null,null,null,"Mittelwert",null,null,null,null,null,null,null,null,null,null,27,20,{"$error":"#N/A"},{"$error":"#N/A"},{"$error":"#N/A"},0.13549574423999999,0.47250425575999999,-3.3008511520000006E-2,0.64100851151999994,-0.20151276727999995,0.80951276727999999,0.30399999999999999,null,0,0,null,null,null,null,null,null,null,null,null,null,27,{"$error":"#N/A"},"","","","","",{"$error":"#N/A"}]
[0,null,{"$f":"IF(input!C32=\"\",\"\",input!C32)","v":""},"\"","","\", ",null,null,"",null,null,null,null,null,null,null,null,null,null,"Sollwert",null,null,null,null,null,null,null,null,null,null,28,20,{"$error":"#N/A"},{"$error":"#N/A"},{"$error":"#N/A"},0.13549574423999999,0.47250425575999999,-3.3008511520000006E-2,0.64100851151999994,-0.20151276727999995,0.80951276727999999,0.30399999999999999,null,0,0,null,null,null,null,null,null,null,null,null,null,28,{"$error":"#N/A"},"","","","","",{"$error":"#N/A"}]
[0,null,{"$f":"IF(input!C33=\"\",\"\",input!C33)","v":""},"\"","","\", ",null,1.3308,1.3308,null,null,null,null,null,null,null,null,"OGW","UGW",{"$f":"\" - 1 Sigma\"","v":" - 1 Sigma"},{"$f":"\" + 1 Sigma\"","v":" + 1 Sigma"},{"$f":"\"-  2 Sigma\"","v":"-  2 Sigma"},{"$f":"\" + 2 Sigma\"","v":" + 2 Sigma"},{"$f":"\" - 3 Sigma\"","v":" - 3 Sigma"},{"$f":"\" + 3 Sigma\"","v":" + 3 Sigma"},{"$f":"\" Mittelwert\"","v":" Mittelwert"},null,null,null,null,29,20,{"$error":"#N/A"},{"$error":"#N/A"},{"$error":"#N/A"},0.13549574423999999,0.47250425575999999,-3.3008511520000006E-2,0.64100851151999994,-0.20151276727999995,0.80951276727999999,0.30399999999999999,null,0,0,null,null,null,null,null,null,null,null,null,null,29,{"$error":"#N/A"},"","","","","",{"$error":"#N/A"}]
[0,null,{"$f":"IF(input!C34=\"\",\"\",input!C34)","v":""},"\"","","\", ",null,33,{"$f":"H34","v":33},null,null,null,null,null,null,null,null,{"$f":"IF(OGW<>\"\",\"OGW\",\"\")","v":"OGW"},{"$f":"IF(UGW<>\"\",\"UGW\",\"\")","v":""},null,null,null,null,null,null,null,null,null,null,null,30,20,{"$error":"#N/A"},{"$error":"#N/A"},{"$error":"#N/A"},0.13549574423999999,0.47250425575999999,-3.3008511520000006E-2,0.64100851151999994,-0.20151276727999995,0.80951276727999999,0.30399999999999999,null,0,0,null,null,null,null,null,null,null,null,null,null,30,{"$error":"#N/A"},"","","","","",{"$error":"#N/A"}]
[0,null,{"$f":"IF(input!C35=\"\",\"\",input!C35)","v":""},"\"","","\", ",null,0,{"$f":"H35","v":0},null,null,null,null,null,null,null,null,null,null,null,null,null,null,null,null,null,null,null,null,null,31,20,{"$error":"#N/A"},{"$error":"#N/A"},{"$error":"#N/A"},0.13549574423999999,0.47250425575999999,-3.3008511520000006E-2,0.64100851151999994,-0.20151276727999995,0.80951276727999999,0.30399999999999999,null,0,0,null,null,null,null,null,null,null,null,null,null,31,{"$error":"#N/A"},"","","","","",{"$error":"#N/A"}]
[0,null,{"$f":"IF(input!C36=\"\",\"\",input!C36)","v":""},"\"","","\", ",null,"platz1:platz1",{"$f":"H36/1000000","v":{"$error":"#VALUE!"}},null,null,null,null,null,null,null,null,null,null,null,null,null,null,null,null,null,null,null,null,null,32,20,{"$error":"#N/A"},{"$error":"#N/A"},{"$error":"#N/A"},0.13549574423999999,0.47250425575999999,-3.3008511520000006E-2,0.64100851151999994,-0.20151276727999995,0.80951276727999999,0.30399999999999999,null,0,0,null,null,null,null,null,null,null,null,null,null,32,{"$error":"#N/A"},"","","","","",{"$error":"#N/A"}]
[0,null,{"$f":"IF(input!C37=\"\",\"\",input!C37)","v":""},"\"","","\", ",null,"platz2:platz1",{"$error":"#VALUE!"},null,null,null,null,null,null,null,null,null,null,null,null,null,null,null,null,null,null,null,null,null,33,{"$f":"IF((Anzahl>AE37),AE37,Anzahl)","v":20},{"$error":"#N/A"},{"$f":"IF(OGW=\"\",#N/A,IF(B37<>\"\",OGW,#N/A))","v":{"$error":"#N/A"}},{"$f":"IF(UGW=\"\",#N/A,IF(B37<>\"\",UGW,#N/A))","v":{"$error":"#N/A"}},0.13549574423999999,0.47250425575999999,-3.3008511520000006E-2,0.64100851151999994,-0.20151276727999995,0.80951276727999999,0.30399999999999999,null,{"$f":"IF(AND(B37<>\"\",B37<UGW),1,0)","v":0},{"$f":"IF(AND(B37<>\"\",B37>OGW),1,0)","v":0},null,null,null,null,null,null,null,null,null,null,33,{"$f":"IF(B37=\"\",NA(),SMALL(xi,BF37))","v":{"$error":"#N/A"}},"",{"$f":"IF(B37=\"\",\"\",NORMSDIST((BE37-fxds)/Standardabweichung))","v":""},"",{"$f":"IF(IF(B37=\"\",\"\",SMALL(BG,BF37))=0,0.0001,IF(B37=\"\",\"\",SMALL(BG,BF37)))","v":""},"",{"$f":"IF(B37=\"\",NA(),NORMSINV((BF37-0.3)/(Anzahl+0.4)))","v":{"$error":"#N/A"}}]
[0,null,{"$f":"IF(input!C38=\"\",\"\",input!C38)","v":""},"\"","","\", ",null,"platz3:platz1",{"$error":"#VALUE!"},null,null,null,null,null,null,null,null,null,null,null,null,null,null,null,null,null,null,null,null,null,34,20,{"$error":"#N/A"},{"$error":"#N/A"},{"$error":"#N/A"},{"$f":"AJ37","v":0.13549574423999999},0.47250425575999999,-3.3008511520000006E-2,0.64100851151999994,-0.20151276727999995,0.80951276727999999,0.30399999999999999,null,0,0,null,null,null,null,null,null,null,null,null,null,34,{"$error":"#N/A"},"","","","","",{"$error":"#N/A"}]
[0,null,{"$f":"IF(input!C39=\"\",\"\",input!C39)","v":""},"\"","","\", ",null,919,9.19E-4,null,null,null,null,null,null,null,null,null,null,null,null,null,null,null,null,null,null,null,null,null,35,20,{"$error":"#N/A"},{"$error":"#N/A"},{"$error":"#N/A"},0.13549574423999999,0.47250425575999999,-3.3008511520000006E-2,0.64100851151999994,-0.20151276727999995,0.80951276727999999,0.30399999999999999,null,0,0,null,null,null,null,null,null,null,null,null,null,35,{"$error":"#N/A"},"","","","","",{"$error":"#N/A"}]
[0,null,{"$f":"IF(input!C40=\"\",\"\",input!C40)","v":""},"\"","","\", ",null,1087963,1.087963,null,null,null,null,null,null,null,null,null,null,null,null,null,null,null,null,null,null,null,null,null,36,20,{"$error":"#N/A"},{"$error":"#N/A"},{"$error":"#N/A"},0.13549574423999999,0.47250425575999999,-3.3008511520000006E-2,0.64100851151999994,-0.20151276727999995,0.80951276727999999,0.30399999999999999,null,0,0,null,null,null,null,null,null,null,null,null,null,36,{"$error":"#N/A"},"","","","","",{"$error":"#N/A"}]
[0,null,{"$f":"IF(input!C41=\"\",\"\",input!C41)","v":""},"\"","","\", ",null,9183,9.1830000000000002E-3,null,null,null,null,null,null,null,null,null,null,null,null,null,null,null,null,null,null,null,null,null,37,20,{"$error":"#N/A"},{"$error":"#N/A"},{"$error":"#N/A"},0.13549574423999999,0.47250425575999999,-3.3008511520000006E-2,0.64100851151999994,-0.20151276727999995,0.80951276727999999,0.30399999999999999,null,0,0,null,null,null,null,null,null,null,null,null,null,37,{"$error":"#N/A"},"","","","","",{"$error":"#N/A"}]
[0,null,{"$f":"IF(input!C42=\"\",\"\",input!C42)","v":""},"\"","","\", ",null,1090680,1.0906800000000001,null,null,null,null,null,null,null,null,null,null,null,null,null,null,null,null,null,null,null,null,null,38,20,{"$error":"#N/A"},{"$error":"#N/A"},{"$error":"#N/A"},0.13549574423999999,0.47250425575999999,-3.3008511520000006E-2,0.64100851151999994,-0.20151276727999995,0.80951276727999999,0.30399999999999999,null,0,0,null,null,null,null,null,null,null,null,null,null,38,{"$error":"#N/A"},"","","","","",{"$error":"#N/A"}]
[0,null,{"$f":"IF(input!C43=\"\",\"\",input!C43)","v":""},"\"","","\", ",null,22860,2.2859999999999998E-2,null,null,null,null,null,null,null,null,null,null,null,null,null,null,null,null,null,null,null,null,null,39,20,{"$error":"#N/A"},{"$error":"#N/A"},{"$error":"#N/A"},0.13549574423999999,0.47250425575999999,-3.3008511520000006E-2,0.64100851151999994,-0.20151276727999995,0.80951276727999999,0.30399999999999999,null,0,0,null,null,null,null,null,null,null,null,null,null,39,{"$error":"#N/A"},"","","","","",{"$error":"#N/A"}]
[0,null,{"$f":"IF(input!C44=\"\",\"\",input!C44)","v":""},"\"","","\", ",null,1104876,1.104876,null,null,null,null,null,null,null,null,null,null,null,null,null,null,null,null,null,null,null,null,null,40,20,{"$error":"#N/A"},{"$error":"#N/A"},{"$error":"#N/A"},0.13549574423999999,0.47250425575999999,-3.3008511520000006E-2,0.64100851151999994,-0.20151276727999995,0.80951276727999999,0.30399999999999999,null,0,0,null,null,null,null,null,null,null,null,null,null,40,{"$error":"#N/A"},"","","","","",{"$error":"#N/A"}]
[0,null,{"$f":"IF(input!C45=\"\",\"\",input!C45)","v":""},"\"","","\", ",null,45055,4.5054999999999998E-2,null,null,null,null,null,null,null,null,null,null,null,null,null,null,null,null,null,null,null,null,null,41,20,{"$error":"#N/A"},{"$error":"#N/A"},{"$error":"#N/A"},0.13549574423999999,0.47250425575999999,-3.3008511520000006E-2,0.64100851151999994,-0.20151276727999995,0.80951276727999999,0.30399999999999999,null,0,0,null,null,null,null,null,null,null,null,null,null,41,{"$error":"#N/A"},"","","","","",{"$error":"#N/A"}]
[0,null,{"$f":"IF(input!C46=\"\",\"\",input!C46)","v":""},"\"","","\", ",null,1152882,1.152882,null,null,null,null,null,null,null,null,null,null,null,null,null,null,null,null,null,null,null,null,null,42,20,{"$error":"#N/A"},{"$error":"#N/A"},{"$error":"#N/A"},0.13549574423999999,0.47250425575999999,-3.3008511520000006E-2,0.64100851151999994,-0.20151276727999995,0.80951276727999999,0.30399999999999999,null,0,0,null,null,null,null,null,null,null,null,null,null,42,{"$error":"#N/A"},"","","","","",{"$error":"#N/A"}]
[0,null,{"$f":"IF(input!C47=\"\",\"\",input!C47)","v":""},"\"","","\", ",null,85844,8.5844000000000004E-2,null,null,null,null,null,null,null,null,null,null,null,null,null,null,null,null,null,null,null,null,null,43,20,{"$error":"#N/A"},{"$error":"#N/A"},{"$error":"#N/A"},0.13549574423999999,0.47250425575999999,-3.3008511520000006E-2,0.64100851151999994,-0.20151276727999995,0.80951276727999999,0.30399999999999999,null,0,0,null,null,null,null,null,null,null,null,null,null,43,{"$error":"#N/A"},"","","","","",{"$error":"#N/A"}]
[0,null,{"$f":"IF(input!C48=\"\",\"\",input!C48)","v":""},"\"","","\", ",null,1312864,1.312864,null,null,null,null,null,null,null,null,null,null,null,null,null,null,null,null,null,null,null,null,null,44,20,{"$error":"#N/A"},{"$error":"#N/A"},{"$error":"#N/A"},0.13549574423999999,0.47250425575999999,-3.3008511520000006E-2,0.64100851151999994,-0.20151276727999995,0.80951276727999999,0.30399999999999999,null,0,0,null,null,null,null,null,null,null,null,null,null,44,{"$error":"#N/A"},"","","","","",{"$error":"#N/A"}]
[0,null,{"$f":"IF(input!C49=\"\",\"\",input!C49)","v":""},"\"","","\", ",null,152527,0.152527,null,null,null,null,null,null,null,null,null,null,null,null,null,null,null,null,null,null,null,null,null,45,20,{"$error":"#N/A"},{"$error":"#N/A"},{"$error":"#N/A"},0.13549574423999999,0.47250425575999999,-3.3008511520000006E-2,0.64100851151999994,-0.20151276727999995,0.80951276727999999,0.30399999999999999,null,0,0,null,null,null,null,null,null,null,null,null,null,45,{"$error":"#N/A"},"","","","","",{"$error":"#N/A"}]
[0,null,{"$f":"IF(input!C50=\"\",\"\",input!C50)","v":""},"\"","","\", ",null,1702119,1.7021189999999999,null,null,null,null,null,null,null,null,null,null,null,null,null,null,null,null,null,null,null,null,null,46,20,{"$error":"#N/A"},{"$error":"#N/A"},{"$error":"#N/A"},0.13549574423999999,0.47250425575999999,-3.3008511520000006E-2,0.64100851151999994,-0.20151276727999995,0.80951276727999999,0.30399999999999999,null,0,0,null,null,null,null,null,null,null,null,null,null,46,{"$error":"#N/A"},"","","","","",{"$error":"#N/A"}]
[0,null,{"$f":"IF(input!C51=\"\",\"\",input!C51)","v":""},"\"","","\", ",null,206126,0.206126,null,null,null,null,null,null,null,null,null,null,null,null,null,null,null,null,null,null,null,null,null,47,20,{"$error":"#N/A"},{"$error":"#N/A"},{"$error":"#N/A"},0.13549574423999999,0.47250425575999999,-3.3008511520000006E-2,0.64100851151999994,-0.20151276727999995,0.80951276727999999,0.30399999999999999,null,0,0,null,null,null,null,null,null,null,null,null,null,47,{"$error":"#N/A"},"","","","","",{"$error":"#N/A"}]
[0,null,{"$f":"IF(input!C52=\"\",\"\",input!C52)","v":""},"\"","","\", ",null,2019645,2.0196450000000001,null,null,null,null,null,null,null,null,null,null,null,null,null,null,null,null,null,null,null,null,null,48,20,{"$error":"#N/A"},{"$error":"#N/A"},{"$error":"#N/A"},0.13549574423999999,0.47250425575999999,-3.3008511520000006E-2,0.64100851151999994,-0.20151276727999995,0.80951276727999999,0.30399999999999999,null,0,0,null,null,null,null,null,null,null,null,null,null,48,{"$error":"#N/A"},"","","","","",{"$error":"#N/A"}]
[0,null,{"$f":"IF(input!C53=\"\",\"\",input!C53)","v":""},"\"","","\", ",null,253164,0.253164,null,null,null,null,null,null,null,null,null,null,null,null,null,null,null,null,null,null,null,null,null,49,20,{"$error":"#N/A"},{"$error":"#N/A"},{"$error":"#N/A"},0.13549574423999999,0.47250425575999999,-3.3008511520000006E-2,0.64100851151999994,-0.20151276727999995,0.80951276727999999,0.30399999999999999,null,0,0,null,null,null,null,null,null,null,null,null,null,49,{"$error":"#N/A"},"","","","","",{"$error":"#N/A"}]
[0,null,{"$f":"IF(input!C54=\"\",\"\",input!C54)","v":""},"\"","","\", ",null,2213380,2.2133799999999999,null,null,null,null,null,null,null,null,null,null,null,null,null,null,null,null,null,null,null,null,null,50,20,{"$error":"#N/A"},{"$error":"#N/A"},{"$error":"#N/A"},{"$f":"AJ53","v":0.13549574423999999},0.47250425575999999,-3.3008511520000006E-2,0.64100851151999994,-0.20151276727999995,0.80951276727999999,0.30399999999999999,null,0,0,null,null,null,null,null,null,null,null,null,null,50,{"$error":"#N/A"},"","","","","",{"$error":"#N/A"}]
[0,null,{"$f":"IF(input!F5=\"\",\"\",input!F5)","v":""},"\"","","\", ",null,297513,0.29751300000000003,null,null,null,null,null,null,null,null,null,null,null,null,null,null,null,null,null,null,null,null,null,51,20,{"$error":"#N/A"},{"$error":"#N/A"},{"$error":"#N/A"},0.13549574423999999,0.47250425575999999,-3.3008511520000006E-2,0.64100851151999994,-0.20151276727999995,0.80951276727999999,0.30399999999999999,null,0,0,null,null,null,null,null,null,null,null,null,null,51,{"$error":"#N/A"},"","","","","",{"$error":"#N/A"}]
[0,null,{"$f":"IF(input!F6=\"\",\"\",input!F6)","v":""},"\"","","\", ",null,2274185,2.2741850000000001,null,null,null,null,null,null,null,null,null,null,null,null,null,null,null,null,null,null,null,null,null,52,20,{"$error":"#N/A"},{"$error":"#N/A"},{"$error":"#N/A"},0.13549574423999999,0.47250425575999999,-3.3008511520000006E-2,0.64100851151999994,-0.20151276727999995,0.80951276727999999,0.30399999999999999,null,0,0,null,null,null,null,null,null,null,null,null,null,52,{"$error":"#N/A"},"","","","","",{"$error":"#N/A"}]
[0,null,{"$f":"IF(input!F7=\"\",\"\",input!F7)","v":""},"\"","","\", ",null,342006,0.34200599999999998,null,null,null,null,null,null,null,null,null,null,null,null,null,null,null,null,null,null,null,null,null,53,20,{"$error":"#N/A"},{"$error":"#N/A"},{"$error":"#N/A"},0.13549574423999999,0.47250425575999999,-3.3008511520000006E-2,0.64100851151999994,-0.20151276727999995,0.80951276727999999,0.30399999999999999,null,0,0,null,null,null,null,null,null,null,null,null,null,53,{"$error":"#N/A"},"","","","","",{"$error":"#N/A"}]
[0,null,{"$f":"IF(input!F8=\"\",\"\",input!F8)","v":""},"\"","","\", ",null,2197989,2.1979890000000002,null,null,null,null,null,null,null,null,null,null,null,null,null,null,null,null,null,null,null,null,null,54,20,{"$error":"#N/A"},{"$error":"#N/A"},{"$error":"#N/A"},0.13549574423999999,0.47250425575999999,-3.3008511520000006E-2,0.64100851151999994,-0.20151276727999995,0.80951276727999999,0.30399999999999999,null,0,0,null,null,null,null,null,null,null,null,null,null,54,{"$error":"#N/A"},"","","","","",{"$error":"#N/A"}]
[0,null,{"$f":"IF(input!F9=\"\",\"\",input!F9)","v":""},"\"","","\", ",null,389673,0.38967299999999999,null,null,null,null,null,null,null,null,null,null,null,null,null,null,null,null,null,null,null,null,null,55,20,{"$error":"#N/A"},{"$error":"#N/A"},{"$error":"#N/A"},0.13549574423999999,0.47250425575999999,-3.3008511520000006E-2,0.64100851151999994,-0.20151276727999995,0.80951276727999999,0.30399999999999999,null,0,0,null,null,null,null,null,null,null,null,null,null,55,{"$error":"#N/A"},"","","","","",{"$error":"#N/A"}]
[0,null,{"$f":"IF(input!F10=\"\",\"\",input!F10)","v":""},"\"","","\", ",null,1976475,1.976475,null,null,null,null,null,null,null,null,null,null,null,null,null,null,null,null,null,null,null,null,null,56,20,{"$error":"#N/A"},{"$error":"#N/A"},{"$error":"#N/A"},0.13549574423999999,0.47250425575999999,-3.3008511520000006E-2,0.64100851151999994,-0.20151276727999995,0.80951276727999999,0.30399999999999999,null,0,0,null,null,null,null,null,null,null,null,null,null,56,{"$error":"#N/A"},"","","","","",{"$error":"#N/A"}]
[0,null,{"$f":"IF(input!F11=\"\",\"\",input!F11)","v":""},"\"","","\", ",null,445488,0.445488,null,null,null,null,null,null,null,null,null,null,null,null,null,null,null,null,null,null,null,null,null,57,20,{"$error":"#N/A"},{"$error":"#N/A"},{"$error":"#N/A"},0.13549574423999999,0.47250425575999999,-3.3008511520000006E-2,0.64100851151999994,-0.20151276727999995,0.80951276727999999,0.30399999999999999,null,0,0,null,null,null,null,null,null,null,null,null,null,57,{"$error":"#N/A"},"","","","","",{"$error":"#N/A"}]
[0,null,{"$f":"IF(input!F12=\"\",\"\",input!F12)","v":""},"\"","","\", ",null,1590923,1.5909230000000001,null,null,null,null,null,null,null,null,null,null,null,null,null,null,null,null,null,null,null,null,null,58,20,{"$error":"#N/A"},{"$error":"#N/A"},{"$error":"#N/A"},0.13549574423999999,0.47250425575999999,-3.3008511520000006E-2,0.64100851151999994,-0.20151276727999995,0.80951276727999999,0.30399999999999999,null,0,0,null,null,null,null,null,null,null,null,null,null,58,{"$error":"#N/A"},"","","","","",{"$error":"#N/A"}]
[0,null,{"$f":"IF(input!F13=\"\",\"\",input!F13)","v":""},"\"","","\", ",null,522910,0.52290999999999999,null,null,null,null,null,null,null,null,null,null,null,null,null,null,null,null,null,null,null,null,null,59,20,{"$error":"#N/A"},{"$error":"#N/A"},{"$error":"#N/A"},0.13549574423999999,0.47250425575999999,-3.3008511520000006E-2,0.64100851151999994,-0.20151276727999995,0.80951276727999999,0.30399999999999999,null,0,0,null,null,null,null,null,null,null,null,null,null,59,{"$error":"#N/A"},"","","","","",{"$error":"#N/A"}]
[0,null,{"$f":"IF(input!F14=\"\",\"\",input!F14)","v":""},"\"","","\", ",null,997170,0.99717,null,null,null,null,null,null,null,1,{"$f":"Minimum","v":0.04},{"$f":"R64+U64","v":7.6999999999999999E-2},{"$f":"(S64+R64)/2","v":5.8499999999999996E-2},{"$f":"Spannweite/AnzahlKlassenHistogramm","v":3.6999999999999998E-2},{"$f":"FREQUENCY(xi,S64)","v":1},{"$f":"$V64/Anzahl","v":0.05},{"$f":"V64","v":1},{"$f":"X64/Anzahl","v":0.05},{"$f":"Y64/U64","v":1.3513513513513515},null,null,null,null,60,20,{"$error":"#N/A"},{"$error":"#N/A"},{"$error":"#N/A"},0.13549574423999999,0.47250425575999999,-3.3008511520000006E-2,0.64100851151999994,-0.20151276727999995,0.80951276727999999,0.30399999999999999,null,0,0,null,null,null,null,null,null,null,null,null,null,60,{"$error":"#N/A"},"","","","","",{"$error":"#N/A"}]
[0,null,{"$f":"IF(input!F15=\"\",\"\",input!F15)","v":""},"\"","","\", ",null,586851,0.58685100000000001,null,null,null,null,null,null,null,2,{"$f":"IF(AnzahlKlassenHistogramm<Q65,R64,R64+U65+0.00000001)","v":7.7000009999999994E-2},{"$f":"R65+U65","v":0.11400000999999998},{"$f":"(S65+R65)/2","v":9.5500009999999996E-2},3.6999999999999998E-2,2,0.1,{"$f":"V65-V64","v":1},0.05,{"$f":"Y65/U65","v":1.3513513513513515},null,null,null,null,61,20,{"$error":"#N/A"},{"$error":"#N/A"},{"$error":"#N/A"},0.13549574423999999,0.47250425575999999,-3.3008511520000006E-2,0.64100851151999994,-0.20151276727999995,0.80951276727999999,0.30399999999999999,null,0,0,null,null,null,null,null,null,null,null,null,null,61,{"$error":"#N/A"},"","","","","",{"$error":"#N/A"}]
[0,null,{"$f":"IF(input!F16=\"\",\"\",input!F16)","v":""},"\"","","\", ",null,585996,0.58599599999999996,null,null,null,null,null,null,null,3,0.11400001999999998,{"$f":"R66+U66","v":0.15100001999999998},{"$f":"(S66+R66)/2","v":0.13250002},3.6999999999999998E-2,4,0.2,{"$f":"V66-V65","v":2},0.1,2.7027027027027031,null,null,null,null,62,20,{"$error":"#N/A"},{"$error":"#N/A"},{"$error":"#N/A"},0.13549574423999999,0.47250425575999999,-3.3008511520000006E-2,0.64100851151999994,-0.20151276727999995,0.80951276727999999,0.30399999999999999,null,0,0,null,null,null,null,null,null,null,null,null,null,62,{"$error":"#N/A"},"","","","","",{"$error":"#N/A"}]
[0,null,{"$f":"IF(input!F17=\"\",\"\",input!F17)","v":""},"\"","","\", ",null,642311,0.64231099999999997,null,null,null,null,null,null,null,4,0.15100002999999998,0.18800002999999998,0.16950002999999997,3.6999999999999998E-2,5,0.25,1,0.05,1.3513513513513515,null,null,null,null,63,20,{"$error":"#N/A"},{"$error":"#N/A"},{"$error":"#N/A"},0.13549574423999999,0.47250425575999999,-3.3008511520000006E-2,0.64100851151999994,-0.20151276727999995,0.80951276727999999,0.30399999999999999,null,0,0,null,null,null,null,null,null,null,null,null,null,63,{"$error":"#N/A"},"","","","","",{"$error":"#N/A"}]
[0,null,{"$f":"IF(input!F18=\"\",\"\",input!F18)","v":""},"\"","","\", ",null,332071,0.33207100000000001,null,null,null,null,null,null,null,5,0.18800003999999998,0.22500003999999998,0.20650004,3.6999999999999998E-2,7,0.35,2,0.1,2.7027027027027031,null,null,null,null,64,20,{"$error":"#N/A"},{"$error":"#N/A"},{"$error":"#N/A"},0.13549574423999999,0.47250425575999999,-3.3008511520000006E-2,0.64100851151999994,-0.20151276727999995,0.80951276727999999,0.30399999999999999,null,0,0,null,null,null,null,null,null,null,null,null,null,64,{"$error":"#N/A"},"","","","","",{"$error":"#N/A"}]
[0,null,{"$f":"IF(input!F19=\"\",\"\",input!F19)","v":""},"\"","","\", ",null,706795,0.70679499999999995,null,null,null,null,null,null,null,6,0.22500004999999998,0.26200004999999998,0.24350004999999997,3.6999999999999998E-2,9,0.45,2,0.1,2.7027027027027031,null,null,null,null,65,{"$f":"IF((Anzahl>AE69),AE69,Anzahl)","v":20},{"$error":"#N/A"},{"$f":"IF(OGW=\"\",#N/A,IF(B69<>\"\",OGW,#N/A))","v":{"$error":"#N/A"}},{"$f":"IF(UGW=\"\",#N/A,IF(B69<>\"\",UGW,#N/A))","v":{"$error":"#N/A"}},0.13549574423999999,0.47250425575999999,-3.3008511520000006E-2,0.64100851151999994,-0.20151276727999995,0.80951276727999999,0.30399999999999999,null,{"$f":"IF(AND(B69<>\"\",B69<UGW),1,0)","v":0},{"$f":"IF(AND(B69<>\"\",B69>OGW),1,0)","v":0},null,null,null,null,null,null,null,null,null,null,65,{"$f":"IF(B69=\"\",NA(),SMALL(xi,BF69))","v":{"$error":"#N/A"}},"",{"$f":"IF(B69=\"\",\"\",NORMSDIST((BE69-fxds)/Standardabweichung))","v":""},"",{"$f":"IF(IF(B69=\"\",\"\",SMALL(BG,BF69))=0,0.0001,IF(B69=\"\",\"\",SMALL(BG,BF69)))","v":""},"",{"$f":"IF(B69=\"\",NA(),NORMSINV((BF69-0.3)/(Anzahl+0.4)))","v":{"$error":"#N/A"}}]
[{"$f":"IF(B70=C70,0,1)","v":0},null,{"$f":"IF(input!F20=\"\",\"\",input!F20)","v":""},"\"",{"$f":"SUBSTITUTE(C70,\",\",\".\")","v":""},"\", ",null,151430,0.15143000000000001,null,null,null,null,null,null,null,7,0.26200005999999998,0.29900005999999996,0.28050005999999994,3.6999999999999998E-2,9,0.45,0,0,0,null,null,null,null,66,20,{"$f":"IF(B70<>\"\",B70,#N/A)","v":{"$error":"#N/A"}},{"$error":"#N/A"},{"$error":"#N/A"},{"$f":"AJ69","v":0.13549574423999999},0.47250425575999999,-3.3008511520000006E-2,0.64100851151999994,-0.20151276727999995,0.80951276727999999,0.30399999999999999,null,0,0,null,null,null,null,null,null,null,null,null,null,66,{"$error":"#N/A"},"","",{"$f":"IF(B70=\"\",\"\",1-BG70)","v":""},"",{"$f":"IF(B70=\"\",\"\",(2*BF70-1)*(LN(BI70)+LN(BG70)))","v":""},{"$error":"#N/A"}]
[0,null,{"$f":"IF(input!F21=\"\",\"\",input!F21)","v":""},"\"","","\", ",null,841240,0.84123999999999999,null,null,null,null,null,null,null,8,0.29900006999999995,0.33600006999999993,0.31750006999999991,3.6999999999999998E-2,12,0.6,3,0.15,4.0540540540540544,null,null,null,null,67,20,{"$error":"#N/A"},{"$error":"#N/A"},{"$error":"#N/A"},0.13549574423999999,0.47250425575999999,-3.3008511520000006E-2,0.64100851151999994,-0.20151276727999995,0.80951276727999999,0.30399999999999999,null,0,0,null,null,null,null,null,null,null,null,null,null,67,{"$error":"#N/A"},{"$f":"IF(B71=\"\",\"\",1+BF70)","v":""},"","","","",{"$error":"#N/A"}]
[0,null,{"$f":"IF(input!F22=\"\",\"\",input!F22)","v":""},"\"","","\", ",null,19130,1.9130000000000001E-2,null,null,null,null,null,null,null,9,0.33600007999999992,0.3730000799999999,0.35450007999999988,3.6999999999999998E-2,14,0.7,2,0.1,2.7027027027027031,null,null,null,null,68,20,{"$error":"#N/A"},{"$error":"#N/A"},{"$error":"#N/A"},0.13549574423999999,0.47250425575999999,-3.3008511520000006E-2,0.64100851151999994,-0.20151276727999995,0.80951276727999999,0.30399999999999999,null,0,0,null,null,null,null,null,null,null,null,null,null,68,{"$error":"#N/A"},"","","","","",{"$error":"#N/A"}]
[0,null,{"$f":"IF(input!F23=\"\",\"\",input!F23)","v":""},"\"","","\", ",null,0,0,null,null,null,null,null,null,null,10,0.3730000899999999,0.41000008999999987,0.39150008999999986,3.6999999999999998E-2,15,0.75,1,0.05,1.3513513513513515,null,null,null,null,69,20,{"$error":"#N/A"},{"$error":"#N/A"},{"$error":"#N/A"},0.13549574423999999,0.47250425575999999,-3.3008511520000006E-2,0.64100851151999994,-0.20151276727999995,0.80951276727999999,0.30399999999999999,null,0,0,null,null,null,null,null,null,null,null,null,null,69,{"$error":"#N/A"},"","","","","",{"$error":"#N/A"}]
[0,null,{"$f":"IF(input!F24=\"\",\"\",input!F24)","v":""},"\"","","\", ",null,null,null,null,null,null,null,null,null,null,11,0.41000009999999987,0.44700009999999984,0.42850009999999983,3.6999999999999998E-2,16,0.8,1,0.05,1.3513513513513515,null,null,null,null,70,20,{"$error":"#N/A"},{"$error":"#N/A"},{"$error":"#N/A"},0.13549574423999999,0.47250425575999999,-3.3008511520000006E-2,0.64100851151999994,-0.20151276727999995,0.80951276727999999,0.30399999999999999,null,0,0,null,null,null,null,null,null,null,null,null,null,70,{"$error":"#N/A"},"","","","","",{"$error":"#N/A"}]
[0,null,{"$f":"IF(input!F25=\"\",\"\",input!F25)","v":""},"\"","","\", ",null,null,null,null,null,null,null,null,null,null,12,0.44700010999999984,0.48400010999999982,0.4655001099999998,3.6999999999999998E-2,19,0.95,3,0.15,4.0540540540540544,null,null,null,null,71,20,{"$error":"#N/A"},{"$error":"#N/A"},{"$error":"#N/A"},0.13549574423999999,0.47250425575999999,-3.3008511520000006E-2,0.64100851151999994,-0.20151276727999995,0.80951276727999999,0.30399999999999999,null,0,0,null,null,null,null,null,null,null,null,null,null,71,{"$error":"#N/A"},"","","","","",{"$error":"#N/A"}]
[0,null,{"$f":"IF(input!F26=\"\",\"\",input!F26)","v":""},"\"","","\", ",null,null,null,null,null,null,null,null,null,null,13,0.48400011999999981,0.52100011999999984,0.50250011999999988,3.6999999999999998E-2,19,0.95,0,0,0,null,null,null,null,72,20,{"$error":"#N/A"},{"$error":"#N/A"},{"$error":"#N/A"},0.13549574423999999,0.47250425575999999,-3.3008511520000006E-2,0.64100851151999994,-0.20151276727999995,0.80951276727999999,0.30399999999999999,null,0,0,null,null,null,null,null,null,null,null,null,null,72,{"$error":"#N/A"},"","","","","",{"$error":"#N/A"}]
[0,null,{"$f":"IF(input!F27=\"\",\"\",input!F27)","v":""},"\"","","\", ",null,null,null,null,null,null,null,null,null,null,14,0.52100012999999989,0.55800012999999993,0.53950012999999997,3.6999999999999998E-2,19,0.95,0,0,0,null,null,null,null,73,20,{"$error":"#N/A"},{"$error":"#N/A"},{"$error":"#N/A"},0.13549574423999999,0.47250425575999999,-3.3008511520000006E-2,0.64100851151999994,-0.20151276727999995,0.80951276727999999,0.30399999999999999,null,0,0,null,null,null,null,null,null,null,null,null,null,73,{"$error":"#N/A"},"","","","","",{"$error":"#N/A"}]
[0,null,{"$f":"IF(input!F28=\"\",\"\",input!F28)","v":""},"\"","","\", ",null,null,null,null,null,null,null,null,null,null,15,0.55800013999999998,0.59500014000000001,0.57650014000000005,3.6999999999999998E-2,19,0.95,0,0,0,null,null,null,null,74,20,{"$error":"#N/A"},{"$error":"#N/A"},{"$error":"#N/A"},0.13549574423999999,0.47250425575999999,-3.3008511520000006E-2,0.64100851151999994,-0.20151276727999995,0.80951276727999999,0.30399999999999999,null,0,0,null,null,null,null,null,null,null,null,null,null,74,{"$error":"#N/A"},"","","","","",{"$error":"#N/A"}]
[0,null,{"$f":"IF(input!F29=\"\",\"\",input!F29)","v":""},"\"","","\", ",null,null,null,null,null,null,null,null,null,null,16,0.59500015000000006,0.63200015000000009,0.61350015000000013,3.6999999999999998E-2,19,0.95,0,0,0,null,null,null,null,75,20,{"$error":"#N/A"},{"$error":"#N/A"},{"$error":"#N/A"},0.13549574423999999,0.47250425575999999,-3.3008511520000006E-2,0.64100851151999994,-0.20151276727999995,0.80951276727999999,0.30399999999999999,null,0,0,null,null,null,null,null,null,null,null,null,null,75,{"$error":"#N/A"},"","","","","",{"$error":"#N/A"}]
[0,null,{"$f":"IF(input!F30=\"\",\"\",input!F30)","v":""},"\"","","\", ",null,null,null,null,null,null,null,null,null,null,17,0.63200016000000014,0.66900016000000018,0.65050016000000022,3.6999999999999998E-2,19,0.95,0,0,0,null,null,null,null,76,20,{"$error":"#N/A"},{"$error":"#N/A"},{"$error":"#N/A"},0.13549574423999999,0.47250425575999999,-3.3008511520000006E-2,0.64100851151999994,-0.20151276727999995,0.80951276727999999,0.30399999999999999,null,0,0,null,null,null,null,null,null,null,null,null,null,76,{"$error":"#N/A"},"","","","","",{"$error":"#N/A"}]
[0,null,{"$f":"IF(input!F31=\"\",\"\",input!F31)","v":""},"\"","","\", ",null,null,null,null,null,null,null,null,null,null,18,0.66900017000000023,0.70600017000000026,0.6875001700000003,3.6999999999999998E-2,19,0.95,0,0,0,null,null,null,null,77,20,{"$error":"#N/A"},{"$error":"#N/A"},{"$error":"#N/A"},0.13549574423999999,0.47250425575999999,-3.3008511520000006E-2,0.64100851151999994,-0.20151276727999995,0.80951276727999999,0.30399999999999999,null,0,0,null,null,null,null,null,null,null,null,null,null,77,{"$error":"#N/A"},"","","","","",{"$error":"#N/A"}]
[0,null,{"$f":"IF(input!F32=\"\",\"\",input!F32)","v":""},"\"","","\", ",null,null,null,null,null,null,null,null,null,null,19,0.70600018000000031,0.74300018000000034,0.72450018000000038,3.6999999999999998E-2,19,0.95,0,0,0,null,null,null,null,78,20,{"$error":"#N/A"},{"$error":"#N/A"},{"$error":"#N/A"},0.13549574423999999,0.47250425575999999,-3.3008511520000006E-2,0.64100851151999994,-0.20151276727999995,0.80951276727999999,0.30399999999999999,null,0,0,null,null,null,null,null,null,null,null,null,null,78,{"$error":"#N/A"},"","","","","",{"$error":"#N/A"}]
[0,null,{"$f":"IF(input!F33=\"\",\"\",input!F33)","v":""},"\"","","\", ",null,null,null,null,null,null,null,null,null,null,20,0.74300019000000039,0.78000019000000043,0.76150019000000047,3.6999999999999998E-2,20,1,1,0.05,1.3513513513513515,null,null,null,null,79,20,{"$error":"#N/A"},{"$error":"#N/A"},{"$error":"#N/A"},0.13549574423999999,0.47250425575999999,-3.3008511520000006E-2,0.64100851151999994,-0.20151276727999995,0.80951276727999999,0.30399999999999999,null,0,0,null,null,null,null,null,null,null,null,null,null,79,{"$error":"#N/A"},"","","","","",{"$error":"#N/A"}]
[0,null,{"$f":"IF(input!F34=\"\",\"\",input!F34)","v":""},"\"","","\", ",null,null,null,null,null,null,null,null,null,null,null,null,null,null,null,null,null,null,null,null,null,null,null,null,80,20,{"$error":"#N/A"},{"$error":"#N/A"},{"$error":"#N/A"},0.13549574423999999,0.47250425575999999,-3.3008511520000006E-2,0.64100851151999994,-0.20151276727999995,0.80951276727999999,0.30399999999999999,null,0,0,null,null,null,null,null,null,null,null,null,null,80,{"$error":"#N/A"},"","","","","",{"$error":"#N/A"}]
[0,null,{"$f":"IF(input!F35=\"\",\"\",input!F35)","v":""},"\"","","\", ",null,null,null,null,null,null,null,null,null,null,null,null,null,null,null,null,null,null,null,null,null,null,null,null,81,20,{"$error":"#N/A"},{"$error":"#N/A"},{"$error":"#N/A"},0.13549574423999999,0.47250425575999999,-3.3008511520000006E-2,0.64100851151999994,-0.20151276727999995,0.80951276727999999,0.30399999999999999,null,0,0,null,null,null,null,null,null,null,null,null,null,81,{"$error":"#N/A"},"","","","","",{"$error":"#N/A"}]
[0,null,{"$f":"IF(input!F36=\"\",\"\",input!F36)","v":""},"\"","","\", ",null,null,null,null,null,null,null,null,null,null,null,null,null,null,null,null,null,null,null,null,null,null,null,null,82,20,{"$error":"#N/A"},{"$error":"#N/A"},{"$error":"#N/A"},{"$f":"AJ85","v":0.13549574423999999},0.47250425575999999,-3.3008511520000006E-2,0.64100851151999994,-0.20151276727999995,0.80951276727999999,0.30399999999999999,null,0,0,null,null,null,null,null,null,null,null,null,null,82,{"$error":"#N/A"},"","","","","",{"$error":"#N/A"}]
[0,null,{"$f":"IF(input!F37=\"\",\"\",input!F37)","v":""},"\"","","\", ",null,null,null,null,null,null,null,null,null,null,null,null,{"$f":"I39","v":9.19E-4},{"$f":"I40","v":1.087963},null,null,{"$f":"IF(OGW<>\"\",OGW,#N/A)","v":1},{"$f":"MAX(Häufigkeitsdichte)*1.05","v":4.256756756756757},null,null,null,null,null,null,83,20,{"$error":"#N/A"},{"$error":"#N/A"},{"$error":"#N/A"},0.13549574423999999,0.47250425575999999,-3.3008511520000006E-2,0.64100851151999994,-0.20151276727999995,0.80951276727999999,0.30399999999999999,null,0,0,null,null,null,null,null,null,null,null,null,null,83,{"$error":"#N/A"},"","","","","",{"$error":"#N/A"}]
[0,null,{"$f":"IF(input!F38=\"\",\"\",input!F38)","v":""},"\"","","\", ",null,null,null,null,null,null,null,null,null,null,null,null,{"$f":"I41","v":9.1830000000000002E-3},{"$f":"I42","v":1.0906800000000001},null,null,{"$f":"IF(UGW<>\"\",UGW,#N/A)","v":{"$error":"#N/A"}},4.256756756756757,null,null,null,null,null,null,84,20,{"$error":"#N/A"},{"$error":"#N/A"},{"$error":"#N/A"},0.13549574423999999,0.47250425575999999,-3.3008511520000006E-2,0.64100851151999994,-0.20151276727999995,0.80951276727999999,0.30399999999999999,null,0,0,null,null,null,null,null,null,null,null,null,null,84,{"$error":"#N/A"},"","","","","",{"$error":"#N/A"}]
[0,null,{"$f":"IF(input!F39=\"\",\"\",input!F39)","v":""},"\"","","\", ",null,null,null,null,null,null,null,null,null,null,null,null,{"$f":"I43","v":2.2859999999999998E-2},{"$f":"I44","v":1.104876},null,null,{"$f":"fxds+3*Standardabweichung","v":0.80951276727999999},4.256756756756757,null,null,null,null,null,null,85,20,{"$error":"#N/A"},{"$error":"#N/A"},{"$error":"#N/A"},0.13549574423999999,0.47250425575999999,-3.3008511520000006E-2,0.64100851151999994,-0.20151276727999995,0.80951276727999999,0.30399999999999999,null,0,0,null,null,null,null,null,null,null,null,null,null,85,{"$error":"#N/A"},"","","","","",{"$error":"#N/A"}]
[0,null,{"$f":"IF(input!F40=\"\",\"\",input!F40)","v":""},"\"","","\", ",null,null,null,null,null,null,null,null,null,null,null,null,{"$f":"I45","v":4.5054999999999998E-2},{"$f":"I46","v":1.152882},null,null,{"$f":"fxds-3*Standardabweichung","v":-0.20151276727999995},4.256756756756757,null,null,null,null,null,null,86,20,{"$error":"#N/A"},{"$error":"#N/A"},{"$error":"#N/A"},0.13549574423999999,0.47250425575999999,-3.3008511520000006E-2,0.64100851151999994,-0.20151276727999995,0.80951276727999999,0.30399999999999999,null,0,0,null,null,null,null,null,null,null,null,null,null,86,{"$error":"#N/A"},"","","","","",{"$error":"#N/A"}]
[0,null,{"$f":"IF(input!F41=\"\",\"\",input!F41)","v":""},"\"","","\", ",null,null,null,null,null,null,null,null,null,null,null,null,{"$f":"I47","v":8.5844000000000004E-2},{"$f":"I48","v":1.312864},null,null,{"$f":"fxds","v":0.30399999999999999},4.256756756756757,null,null,null,null,null,null,87,20,{"$error":"#N/A"},{"$error":"#N/A"},{"$error":"#N/A"},0.13549574423999999,0.47250425575999999,-3.3008511520000006E-2,0.64100851151999994,-0.20151276727999995,0.80951276727999999,0.30399999999999999,null,0,0,null,null,null,null,null,null,null,null,null,null,87,{"$error":"#N/A"},"","","","","",{"$error":"#N/A"}]
[0,null,{"$f":"IF(input!F42=\"\",\"\",input!F42)","v":""},"\"","","\", ",null,null,null,null,null,null,null,null,null,null,null,null,{"$f":"I49","v":0.152527},{"$f":"I50","v":1.7021189999999999},null,null,{"$f":"Sollwert","v":20},4.256756756756757,null,null,null,null,null,null,88,20,{"$error":"#N/A"},{"$error":"#N/A"},{"$error":"#N/A"},0.13549574423999999,0.47250425575999999,-3.3008511520000006E-2,0.64100851151999994,-0.20151276727999995,0.80951276727999999,0.30399999999999999,null,0,0,null,null,null,null,null,null,null,null,null,null,88,{"$error":"#N/A"},"","","","","",{"$error":"#N/A"}]
[0,null,{"$f":"IF(input!F43=\"\",\"\",input!F43)","v":""},"\"","","\", ",null,null,null,null,null,null,null,null,null,null,null,null,{"$f":"I51","v":0.206126},{"$f":"I52","v":2.0196450000000001},null,null,null,null,null,null,null,null,null,null,89,20,{"$error":"#N/A"},{"$error":"#N/A"},{"$error":"#N/A"},0.13549574423999999,0.47250425575999999,-3.3008511520000006E-2,0.64100851151999994,-0.20151276727999995,0.80951276727999999,0.30399999999999999,null,0,0,null,null,null,null,null,null,null,null,null,null,89,{"$error":"#N/A"},"","","","","",{"$error":"#N/A"}]
[0,null,{"$f":"IF(input!F44=\"\",\"\",input!F44)","v":""},"\"","","\", ",null,null,null,null,null,null,null,null,null,null,null,null,{"$f":"I53","v":0.253164},{"$f":"I54","v":2.2133799999999999},null,null,null,null,null,null,null,null,null,null,90,20,{"$error":"#N/A"},{"$error":"#N/A"},{"$error":"#N/A"},0.13549574423999999,0.47250425575999999,-3.3008511520000006E-2,0.64100851151999994,-0.20151276727999995,0.80951276727999999,0.30399999999999999,null,0,0,null,null,null,null,null,null,null,null,null,null,90,{"$error":"#N/A"},"","","","","",{"$error":"#N/A"}]
[0,null,{"$f":"IF(input!F45=\"\",\"\",input!F45)","v":""},"\"","","\", ",null,null,null,null,null,null,null,null,null,null,null,null,{"$f":"I55","v":0.29751300000000003},{"$f":"I56","v":2.2741850000000001},null,null,null,null,null,null,null,null,null,null,91,20,{"$error":"#N/A"},{"$error":"#N/A"},{"$error":"#N/A"},0.13549574423999999,0.47250425575999999,-3.3008511520000006E-2,0.64100851151999994,-0.20151276727999995,0.80951276727999999,0.30399999999999999,null,0,0,null,null,null,null,null,null,null,null,null,null,91,{"$error":"#N/A"},"","","","","",{"$error":"#N/A"}]
[0,null,{"$f":"IF(input!F46=\"\",\"\",input!F46)","v":""},"\"","","\", ",null,null,null,null,null,null,null,null,null,null,null,null,{"$f":"I57","v":0.34200599999999998},{"$f":"I58","v":2.1979890000000002},null,null,null,null,null,null,null,null,null,null,92,20,{"$error":"#N/A"},{"$error":"#N/A"},{"$error":"#N/A"},0.13549574423999999,0.47250425575999999,-3.3008511520000006E-2,0.64100851151999994,-0.20151276727999995,0.80951276727999999,0.30399999999999999,null,0,0,null,null,null,null,null,null,null,null,null,null,92,{"$error":"#N/A"},"","","","","",{"$error":"#N/A"}]
[0,null,{"$f":"IF(input!F47=\"\",\"\",input!F47)","v":""},"\"","","\", ",null,null,null,null,null,null,null,null,null,null,null,null,{"$f":"I59","v":0.38967299999999999},{"$f":"I60","v":1.976475},null,null,null,null,null,null,null,null,null,null,93,20,{"$error":"#N/A"},{"$error":"#N/A"},{"$error":"#N/A"},0.13549574423999999,0.47250425575999999,-3.3008511520000006E-2,0.64100851151999994,-0.20151276727999995,0.80951276727999999,0.30399999999999999,null,0,0,null,null,null,null,null,null,null,null,null,null,93,{"$error":"#N/A"},"","","","","",{"$error":"#N/A"}]
[0,null,{"$f":"IF(input!F48=\"\",\"\",input!F48)","v":""},"\"","","\", ",null,null,null,null,null,null,null,null,null,null,null,null,{"$f":"I61","v":0.445488},{"$f":"I62","v":1.5909230000000001},null,null,null,null,null,null,null,null,null,null,94,20,{"$error":"#N/A"},{"$error":"#N/A"},{"$error":"#N/A"},0.13549574423999999,0.47250425575999999,-3.3008511520000006E-2,0.64100851151999994,-0.20151276727999995,0.80951276727999999,0.30399999999999999,null,0,0,null,null,null,null,null,null,null,null,null,null,94,{"$error":"#N/A"},"","","","","",{"$error":"#N/A"}]
[0,null,{"$f":"IF(input!F49=\"\",\"\",input!F49)","v":""},"\"","","\", ",null,null,null,null,null,null,null,null,null,null,null,null,{"$f":"I63","v":0.52290999999999999},{"$f":"I64","v":0.99717},null,null,null,null,null,null,null,null,null,null,95,20,{"$error":"#N/A"},{"$error":"#N/A"},{"$error":"#N/A"},0.13549574423999999,0.47250425575999999,-3.3008511520000006E-2,0.64100851151999994,-0.20151276727999995,0.80951276727999999,0.30399999999999999,null,0,0,null,null,null,null,null,null,null,null,null,null,95,{"$error":"#N/A"},"","","","","",{"$error":"#N/A"}]
[0,null,{"$f":"IF(input!F50=\"\",\"\",input!F50)","v":""},"\"","","\", ",null,null,null,null,null,null,null,null,null,null,null,null,{"$f":"I65","v":0.58685100000000001},{"$f":"I66","v":0.58599599999999996},null,null,null,null,null,null,null,null,null,null,96,20,{"$error":"#N/A"},{"$error":"#N/A"},{"$error":"#N/A"},0.13549574423999999,0.47250425575999999,-3.3008511520000006E-2,0.64100851151999994,-0.20151276727999995,0.80951276727999999,0.30399999999999999,null,0,0,null,null,null,null,null,null,null,null,null,null,96,{"$error":"#N/A"},"","","","","",{"$error":"#N/A"}]
[0,null,{"$f":"IF(input!F51=\"\",\"\",input!F51)","v":""},"\"","","\", ",null,null,null,null,null,null,null,null,null,null,null,null,{"$f":"I67","v":0.64231099999999997},{"$f":"I68","v":0.33207100000000001},null,null,null,null,null,null,null,null,null,null,97,{"$f":"IF((Anzahl>AE101),AE101,Anzahl)","v":20},{"$error":"#N/A"},{"$f":"IF(OGW=\"\",#N/A,IF(B101<>\"\",OGW,#N/A))","v":{"$error":"#N/A"}},{"$f":"IF(UGW=\"\",#N/A,IF(B101<>\"\",UGW,#N/A))","v":{"$error":"#N/A"}},0.13549574423999999,0.47250425575999999,-3.3008511520000006E-2,0.64100851151999994,-0.20151276727999995,0.80951276727999999,0.30399999999999999,null,{"$f":"IF(AND(B101<>\"\",B101<UGW),1,0)","v":0},{"$f":"IF(AND(B101<>\"\",B101>OGW),1,0)","v":0},null,null,null,null,null,null,null,null,null,null,97,{"$f":"IF(B101=\"\",NA(),SMALL(xi,BF101))","v":{"$error":"#N/A"}},"",{"$f":"IF(B101=\"\",\"\",NORMSDIST((BE101-fxds)/Standardabweichung))","v":""},"",{"$f":"IF(IF(B101=\"\",\"\",SMALL(BG,BF101))=0,0.0001,IF(B101=\"\",\"\",SMALL(BG,BF101)))","v":""},"",{"$f":"IF(B101=\"\",NA(),NORMSINV((BF101-0.3)/(Anzahl+0.4)))","v":{"$error":"#N/A"}}]
[0,null,{"$f":"IF(input!F52=\"\",\"\",input!F52)","v":""},"\"","","\", ",null,null,null,null,null,null,null,null,null,null,null,null,{"$f":"I69","v":0.70679499999999995},{"$f":"I70","v":0.15143000000000001},null,null,null,null,null,null,null,null,null,null,98,20,{"$error":"#N/A"},{"$error":"#N/A"},{"$error":"#N/A"},{"$f":"AJ101","v":0.13549574423999999},0.47250425575999999,-3.3008511520000006E-2,0.64100851151999994,-0.20151276727999995,0.80951276727999999,0.30399999999999999,null,0,0,null,null,null,null,null,null,null,null,null,null,98,{"$error":"#N/A"},"","","","","",{"$error":"#N/A"}]
[0,null,{"$f":"IF(input!F53=\"\",\"\",input!F53)","v":""},"\"","","\", ",null,null,null,null,null,null,null,null,null,null,null,null,{"$f":"I71","v":0.84123999999999999},{"$f":"I72","v":1.9130000000000001E-2},null,null,null,null,null,null,null,null,null,null,99,20,{"$error":"#N/A"},{"$error":"#N/A"},{"$error":"#N/A"},0.13549574423999999,0.47250425575999999,-3.3008511520000006E-2,0.64100851151999994,-0.20151276727999995,0.80951276727999999,0.30399999999999999,null,0,0,null,null,null,null,null,null,null,null,null,null,99,{"$error":"#N/A"},"","","","","",{"$error":"#N/A"}]
[0,null,{"$f":"IF(input!F54=\"\",\"\",input!F54)","v":""},"\"","","\", ",null,null,null,null,null,null,null,null,null,null,null,null,null,null,null,null,null,null,null,null,null,null,null,null,100,20,{"$error":"#N/A"},{"$error":"#N/A"},{"$error":"#N/A"},0.13549574423999999,0.47250425575999999,-3.3008511520000006E-2,0.64100851151999994,-0.20151276727999995,0.80951276727999999,0.30399999999999999,null,0,0,null,null,null,null,null,null,null,null,null,null,100,{"$error":"#N/A"},"","","","","",{"$error":"#N/A"}]
[0,null,{"$f":"IF(input!I5=\"\",\"\",input!I5)","v":""},"\"","","\", ",null,null,null,null,null,null,null,null,null,null,null,null,null,null,null,null,null,null,null,null,null,null,null,null,101,20,{"$error":"#N/A"},{"$error":"#N/A"},{"$error":"#N/A"},0.13549574423999999,0.47250425575999999,-3.3008511520000006E-2,0.64100851151999994,-0.20151276727999995,0.80951276727999999,0.30399999999999999,null,0,0,null,null,null,null,null,null,null,null,null,null,101,{"$error":"#N/A"},"","","","","",{"$error":"#N/A"}]
[0,null,{"$f":"IF(input!I6=\"\",\"\",input!I6)","v":""},"\"","","\", ",null,null,null,null,null,null,null,null,null,null,null,null,null,null,null,null,null,null,null,null,null,null,null,null,102,20,{"$error":"#N/A"},{"$error":"#N/A"},{"$error":"#N/A"},0.13549574423999999,0.47250425575999999,-3.3008511520000006E-2,0.64100851151999994,-0.20151276727999995,0.80951276727999999,0.30399999999999999,null,0,0,null,null,null,null,null,null,null,null,null,null,102,{"$error":"#N/A"},"","","","","",{"$error":"#N/A"}]
[0,null,{"$f":"IF(input!I7=\"\",\"\",input!I7)","v":""},"\"","","\", ",null,null,null,null,null,null,null,null,null,null,null,null,null,null,null,null,null,null,null,null,null,null,null,null,103,20,{"$error":"#N/A"},{"$error":"#N/A"},{"$error":"#N/A"},0.13549574423999999,0.47250425575999999,-3.3008511520000006E-2,0.64100851151999994,-0.20151276727999995,0.80951276727999999,0.30399999999999999,null,0,0,null,null,null,null,null,null,null,null,null,null,103,{"$error":"#N/A"},"","","","","",{"$error":"#N/A"}]
[0,null,{"$f":"IF(input!I8=\"\",\"\",input!I8)","v":""},"\"","","\", ",null,null,null,null,null,null,null,null,null,null,null,null,null,null,null,null,null,null,null,null,null,null,null,null,104,20,{"$error":"#N/A"},{"$error":"#N/A"},{"$error":"#N/A"},0.13549574423999999,0.47250425575999999,-3.3008511520000006E-2,0.64100851151999994,-0.20151276727999995,0.80951276727999999,0.30399999999999999,null,0,0,null,null,null,null,null,null,null,null,null,null,104,{"$error":"#N/A"},"","","","","",{"$error":"#N/A"}]
[0,null,{"$f":"IF(input!I9=\"\",\"\",input!I9)","v":""},"\"","","\", ",null,null,null,null,null,null,null,null,null,null,null,null,null,null,null,null,null,null,null,null,null,null,null,null,105,20,{"$error":"#N/A"},{"$error":"#N/A"},{"$error":"#N/A"},0.13549574423999999,0.47250425575999999,-3.3008511520000006E-2,0.64100851151999994,-0.20151276727999995,0.80951276727999999,0.30399999999999999,null,0,0,null,null,null,null,null,null,null,null,null,null,105,{"$error":"#N/A"},"","","","","",{"$error":"#N/A"}]
[0,null,{"$f":"IF(input!I10=\"\",\"\",input!I10)","v":""},"\"","","\", ",null,null,null,null,null,null,null,null,null,null,null,null,null,null,null,null,null,null,null,null,null,null,null,null,106,20,{"$error":"#N/A"},{"$error":"#N/A"},{"$error":"#N/A"},0.13549574423999999,0.47250425575999999,-3.3008511520000006E-2,0.64100851151999994,-0.20151276727999995,0.80951276727999999,0.30399999999999999,null,0,0,null,null,null,null,null,null,null,null,null,null,106,{"$error":"#N/A"},"","","","","",{"$error":"#N/A"}]
[0,null,{"$f":"IF(input!I11=\"\",\"\",input!I11)","v":""},"\"","","\", ",null,null,null,null,null,null,null,null,null,null,null,null,null,null,null,null,null,null,null,null,null,null,null,null,107,20,{"$error":"#N/A"},{"$error":"#N/A"},{"$error":"#N/A"},0.13549574423999999,0.47250425575999999,-3.3008511520000006E-2,0.64100851151999994,-0.20151276727999995,0.80951276727999999,0.30399999999999999,null,0,0,null,null,null,null,null,null,null,null,null,null,107,{"$error":"#N/A"},"","","","","",{"$error":"#N/A"}]
[0,null,{"$f":"IF(input!I12=\"\",\"\",input!I12)","v":""},"\"","","\", ",null,null,null,null,null,null,null,null,null,null,null,null,null,null,null,null,null,null,null,null,null,null,null,null,108,20,{"$error":"#N/A"},{"$error":"#N/A"},{"$error":"#N/A"},0.13549574423999999,0.47250425575999999,-3.3008511520000006E-2,0.64100851151999994,-0.20151276727999995,0.80951276727999999,0.30399999999999999,null,0,0,null,null,null,null,null,null,null,null,null,null,108,{"$error":"#N/A"},"","","","","",{"$error":"#N/A"}]
[0,null,{"$f":"IF(input!I13=\"\",\"\",input!I13)","v":""},"\"","","\", ",null,null,null,null,null,null,null,null,null,null,null,null,null,null,null,null,null,null,null,null,null,null,null,null,109,20,{"$error":"#N/A"},{"$error":"#N/A"},{"$error":"#N/A"},0.13549574423999999,0.47250425575999999,-3.3008511520000006E-2,0.64100851151999994,-0.20151276727999995,0.80951276727999999,0.30399999999999999,null,0,0,null,null,null,null,null,null,null,null,null,null,109,{"$error":"#N/A"},"","","","","",{"$error":"#N/A"}]
[0,null,{"$f":"IF(input!I14=\"\",\"\",input!I14)","v":""},"\"","","\", ",null,null,null,null,null,null,null,null,null,null,null,null,null,null,null,null,null,null,null,null,null,null,null,null,110,20,{"$error":"#N/A"},{"$error":"#N/A"},{"$error":"#N/A"},0.13549574423999999,0.47250425575999999,-3.3008511520000006E-2,0.64100851151999994,-0.20151276727999995,0.80951276727999999,0.30399999999999999,null,0,0,null,null,null,null,null,null,null,null,null,null,110,{"$error":"#N/A"},"","","","","",{"$error":"#N/A"}]
[0,null,{"$f":"IF(input!I15=\"\",\"\",input!I15)","v":""},"\"","","\", ",null,null,null,null,null,null,null,null,null,null,null,null,null,null,null,null,null,null,null,null,null,null,null,null,111,20,{"$error":"#N/A"},{"$error":"#N/A"},{"$error":"#N/A"},0.13549574423999999,0.47250425575999999,-3.3008511520000006E-2,0.64100851151999994,-0.20151276727999995,0.80951276727999999,0.30399999999999999,null,0,0,null,null,null,null,null,null,null,null,null,null,111,{"$error":"#N/A"},"","","","","",{"$error":"#N/A"}]
[0,null,{"$f":"IF(input!I16=\"\",\"\",input!I16)","v":""},"\"","","\", ",null,null,null,null,null,null,null,null,null,null,null,null,null,null,null,null,null,null,null,null,null,null,null,null,112,20,{"$error":"#N/A"},{"$error":"#N/A"},{"$error":"#N/A"},0.13549574423999999,0.47250425575999999,-3.3008511520000006E-2,0.64100851151999994,-0.20151276727999995,0.80951276727999999,0.30399999999999999,null,0,0,null,null,null,null,null,null,null,null,null,null,112,{"$error":"#N/A"},"","","","","",{"$error":"#N/A"}]
[0,null,{"$f":"IF(input!I17=\"\",\"\",input!I17)","v":""},"\"","","\", ",null,null,null,null,null,null,null,null,null,null,null,null,null,null,null,null,null,null,null,null,null,null,null,null,113,20,{"$error":"#N/A"},{"$error":"#N/A"},{"$error":"#N/A"},0.13549574423999999,0.47250425575999999,-3.3008511520000006E-2,0.64100851151999994,-0.20151276727999995,0.80951276727999999,0.30399999999999999,null,0,0,null,null,null,null,null,null,null,null,null,null,113,{"$error":"#N/A"},"","","","","",{"$error":"#N/A"}]
[0,null,{"$f":"IF(input!I18=\"\",\"\",input!I18)","v":""},"\"","","\", ",null,null,null,null,null,null,null,null,null,null,null,null,null,null,null,null,null,null,null,null,null,null,null,null,114,20,{"$error":"#N/A"},{"$error":"#N/A"},{"$error":"#N/A"},{"$f":"AJ117","v":0.13549574423999999},0.47250425575999999,-3.3008511520000006E-2,0.64100851151999994,-0.20151276727999995,0.80951276727999999,0.30399999999999999,null,0,0,null,null,null,null,null,null,null,null,null,null,114,{"$error":"#N/A"},"","","","","",{"$error":"#N/A"}]
[0,null,{"$f":"IF(input!I19=\"\",\"\",input!I19)","v":""},"\"","","\", ",null,null,null,null,null,null,null,null,null,null,null,null,null,null,null,null,null,null,null,null,null,null,null,null,115,20,{"$error":"#N/A"},{"$error":"#N/A"},{"$error":"#N/A"},0.13549574423999999,0.47250425575999999,-3.3008511520000006E-2,0.64100851151999994,-0.20151276727999995,0.80951276727999999,0.30399999999999999,null,0,0,null,null,null,null,null,null,null,null,null,null,115,{"$error":"#N/A"},"","","","","",{"$error":"#N/A"}]
[0,null,{"$f":"IF(input!I20=\"\",\"\",input!I20)","v":""},"\"","","\", ",null,null,null,null,null,null,null,null,null,null,null,null,null,null,null,null,null,null,null,null,null,null,null,null,116,20,{"$error":"#N/A"},{"$error":"#N/A"},{"$error":"#N/A"},0.13549574423999999,0.47250425575999999,-3.3008511520000006E-2,0.64100851151999994,-0.20151276727999995,0.80951276727999999,0.30399999999999999,null,0,0,null,null,null,null,null,null,null,null,null,null,116,{"$error":"#N/A"},"","","","","",{"$error":"#N/A"}]
[0,null,{"$f":"IF(input!I21=\"\",\"\",input!I21)","v":""},"\"","","\", ",null,null,null,null,null,null,null,null,null,null,null,null,null,null,null,null,null,null,null,null,null,null,null,null,117,20,{"$error":"#N/A"},{"$error":"#N/A"},{"$error":"#N/A"},0.13549574423999999,0.47250425575999999,-3.3008511520000006E-2,0.64100851151999994,-0.20151276727999995,0.80951276727999999,0.30399999999999999,null,0,0,null,null,null,null,null,null,null,null,null,null,117,{"$error":"#N/A"},"","","","","",{"$error":"#N/A"}]
[0,null,{"$f":"IF(input!I22=\"\",\"\",input!I22)","v":""},"\"","","\", ",null,null,null,null,null,null,null,null,null,null,null,null,null,null,null,null,null,null,null,null,null,null,null,null,118,20,{"$error":"#N/A"},{"$error":"#N/A"},{"$error":"#N/A"},0.13549574423999999,0.47250425575999999,-3.3008511520000006E-2,0.64100851151999994,-0.20151276727999995,0.80951276727999999,0.30399999999999999,null,0,0,null,null,null,null,null,null,null,null,null,null,118,{"$error":"#N/A"},"","","","","",{"$error":"#N/A"}]
[0,null,{"$f":"IF(input!I23=\"\",\"\",input!I23)","v":""},"\"","","\", ",null,null,null,null,null,null,null,null,null,null,null,null,null,null,null,null,null,null,null,null,null,null,null,null,119,20,{"$error":"#N/A"},{"$error":"#N/A"},{"$error":"#N/A"},0.13549574423999999,0.47250425575999999,-3.3008511520000006E-2,0.64100851151999994,-0.20151276727999995,0.80951276727999999,0.30399999999999999,null,0,0,null,null,null,null,null,null,null,null,null,null,119,{"$error":"#N/A"},"","","","","",{"$error":"#N/A"}]
[0,null,{"$f":"IF(input!I24=\"\",\"\",input!I24)","v":""},"\"","","\", ",null,null,null,null,null,null,null,null,null,null,null,null,null,null,null,null,null,null,null,null,null,null,null,null,120,20,{"$error":"#N/A"},{"$error":"#N/A"},{"$error":"#N/A"},0.13549574423999999,0.47250425575999999,-3.3008511520000006E-2,0.64100851151999994,-0.20151276727999995,0.80951276727999999,0.30399999999999999,null,0,0,null,null,null,null,null,null,null,null,null,null,120,{"$error":"#N/A"},"","","","","",{"$error":"#N/A"}]
[0,null,{"$f":"IF(input!I25=\"\",\"\",input!I25)","v":""},"\"","","\", ",null,null,null,null,null,null,null,null,null,null,null,null,null,null,null,null,null,null,null,null,null,null,null,null,121,20,{"$error":"#N/A"},{"$error":"#N/A"},{"$error":"#N/A"},0.13549574423999999,0.47250425575999999,-3.3008511520000006E-2,0.64100851151999994,-0.20151276727999995,0.80951276727999999,0.30399999999999999,null,0,0,null,null,null,null,null,null,null,null,null,null,121,{"$error":"#N/A"},"","","","","",{"$error":"#N/A"}]
[0,null,{"$f":"IF(input!I26=\"\",\"\",input!I26)","v":""},"\"","","\", ",null,null,null,null,null,null,null,null,null,null,null,null,null,null,null,null,null,null,null,null,null,null,null,null,122,20,{"$error":"#N/A"},{"$error":"#N/A"},{"$error":"#N/A"},0.13549574423999999,0.47250425575999999,-3.3008511520000006E-2,0.64100851151999994,-0.20151276727999995,0.80951276727999999,0.30399999999999999,null,0,0,null,null,null,null,null,null,null,null,null,null,122,{"$error":"#N/A"},"","","","","",{"$error":"#N/A"}]
[0,null,{"$f":"IF(input!I27=\"\",\"\",input!I27)","v":""},"\"","","\", ",null,null,null,null,null,null,null,null,null,null,null,null,null,null,null,null,null,null,null,null,null,null,null,null,123,20,{"$error":"#N/A"},{"$error":"#N/A"},{"$error":"#N/A"},0.13549574423999999,0.47250425575999999,-3.3008511520000006E-2,0.64100851151999994,-0.20151276727999995,0.80951276727999999,0.30399999999999999,null,0,0,null,null,null,null,null,null,null,null,null,null,123,{"$error":"#N/A"},"","","","","",{"$error":"#N/A"}]
[0,null,{"$f":"IF(input!I28=\"\",\"\",input!I28)","v":""},"\"","","\", ",null,null,null,null,null,null,null,null,null,null,null,null,null,null,null,null,null,null,null,null,null,null,null,null,124,20,{"$error":"#N/A"},{"$error":"#N/A"},{"$error":"#N/A"},0.13549574423999999,0.47250425575999999,-3.3008511520000006E-2,0.64100851151999994,-0.20151276727999995,0.80951276727999999,0.30399999999999999,null,0,0,null,null,null,null,null,null,null,null,null,null,124,{"$error":"#N/A"},"","","","","",{"$error":"#N/A"}]
[0,null,{"$f":"IF(input!I29=\"\",\"\",input!I29)","v":""},"\"","","\", ",null,null,null,null,null,null,null,null,null,null,null,null,null,null,null,null,null,null,null,null,null,null,null,null,125,20,{"$error":"#N/A"},{"$error":"#N/A"},{"$error":"#N/A"},0.13549574423999999,0.47250425575999999,-3.3008511520000006E-2,0.64100851151999994,-0.20151276727999995,0.80951276727999999,0.30399999999999999,null,0,0,null,null,null,null,null,null,null,null,null,null,125,{"$error":"#N/A"},"","","","","",{"$error":"#N/A"}]
[0,null,{"$f":"IF(input!I30=\"\",\"\",input!I30)","v":""},"\"","","\", ",null,null,null,null,null,null,null,null,null,null,null,null,null,null,null,null,null,null,null,null,null,null,null,null,126,20,{"$error":"#N/A"},{"$error":"#N/A"},{"$error":"#N/A"},0.13549574423999999,0.47250425575999999,-3.3008511520000006E-2,0.64100851151999994,-0.20151276727999995,0.80951276727999999,0.30399999999999999,null,0,0,null,null,null,null,null,null,null,null,null,null,126,{"$error":"#N/A"},"","","","","",{"$error":"#N/A"}]
[0,null,{"$f":"IF(input!I31=\"\",\"\",input!I31)","v":""},"\"","","\", ",null,null,null,null,null,null,null,null,null,null,null,null,null,null,null,null,null,null,null,null,null,null,null,null,127,20,{"$error":"#N/A"},{"$error":"#N/A"},{"$error":"#N/A"},0.13549574423999999,0.47250425575999999,-3.3008511520000006E-2,0.64100851151999994,-0.20151276727999995,0.80951276727999999,0.30399999999999999,null,0,0,null,null,null,null,null,null,null,null,null,null,127,{"$error":"#N/A"},"","","","","",{"$error":"#N/A"}]
[0,null,{"$f":"IF(input!I32=\"\",\"\",input!I32)","v":""},"\"","","\", ",null,null,null,null,null,null,null,null,null,null,null,null,null,null,null,null,null,null,null,null,null,null,null,null,128,20,{"$error":"#N/A"},{"$error":"#N/A"},{"$error":"#N/A"},0.13549574423999999,0.47250425575999999,-3.3008511520000006E-2,0.64100851151999994,-0.20151276727999995,0.80951276727999999,0.30399999999999999,null,0,0,null,null,null,null,null,null,null,null,null,null,128,{"$error":"#N/A"},"","","","","",{"$error":"#N/A"}]
[0,null,{"$f":"IF(input!I33=\"\",\"\",input!I33)","v":""},"\"","","\", ",null,null,null,null,null,null,null,null,null,null,null,null,null,null,null,null,null,null,null,null,null,null,null,null,129,{"$f":"IF((Anzahl>AE133),AE133,Anzahl)","v":20},{"$error":"#N/A"},{"$f":"IF(OGW=\"\",#N/A,IF(B133<>\"\",OGW,#N/A))","v":{"$error":"#N/A"}},{"$f":"IF(UGW=\"\",#N/A,IF(B133<>\"\",UGW,#N/A))","v":{"$error":"#N/A"}},0.13549574423999999,0.47250425575999999,-3.3008511520000006E-2,0.64100851151999994,-0.20151276727999995,0.80951276727999999,0.30399999999999999,null,{"$f":"IF(AND(B133<>\"\",B133<UGW),1,0)","v":0},{"$f":"IF(AND(B133<>\"\",B133>OGW),1,0)","v":0},null,null,null,null,null,null,null,null,null,null,129,{"$f":"IF(B133=\"\",NA(),SMALL(xi,BF133))","v":{"$error":"#N/A"}},"",{"$f":"IF(B133=\"\",\"\",NORMSDIST((BE133-fxds)/Standardabweichung))","v":""},"",{"$f":"IF(IF(B133=\"\",\"\",SMALL(BG,BF133))=0,0.0001,IF(B133=\"\",\"\",SMALL(BG,BF133)))","v":""},"",{"$f":"IF(B133=\"\",NA(),NORMSINV((BF133-0.3)/(Anzahl+0.4)))","v":{"$error":"#N/A"}}]
[{"$f":"IF(B134=C134,0,1)","v":0},null,{"$f":"IF(input!I34=\"\",\"\",input!I34)","v":""},"\"",{"$f":"SUBSTITUTE(C134,\",\",\".\")","v":""},"\", ",null,null,null,null,null,null,null,null,null,null,null,null,null,null,null,null,null,null,null,null,null,null,null,null,130,20,{"$f":"IF(B134<>\"\",B134,#N/A)","v":{"$error":"#N/A"}},{"$error":"#N/A"},{"$error":"#N/A"},{"$f":"AJ133","v":0.13549574423999999},0.47250425575999999,-3.3008511520000006E-2,0.64100851151999994,-0.20151276727999995,0.80951276727999999,0.30399999999999999,null,0,0,null,null,null,null,null,null,null,null,null,null,130,{"$error":"#N/A"},"","",{"$f":"IF(B134=\"\",\"\",1-BG134)","v":""},"",{"$f":"IF(B134=\"\",\"\",(2*BF134-1)*(LN(BI134)+LN(BG134)))","v":""},{"$error":"#N/A"}]
[0,null,{"$f":"IF(input!I35=\"\",\"\",input!I35)","v":""},"\"","","\", ",null,null,null,null,null,null,null,null,null,null,null,null,null,null,null,null,null,null,null,null,null,null,null,null,131,20,{"$error":"#N/A"},{"$error":"#N/A"},{"$error":"#N/A"},0.13549574423999999,0.47250425575999999,-3.3008511520000006E-2,0.64100851151999994,-0.20151276727999995,0.80951276727999999,0.30399999999999999,null,0,0,null,null,null,null,null,null,null,null,null,null,131,{"$error":"#N/A"},{"$f":"IF(B135=\"\",\"\",1+BF134)","v":""},"","","","",{"$error":"#N/A"}]
[0,null,{"$f":"IF(input!I36=\"\",\"\",input!I36)","v":""},"\"","","\", ",null,null,null,null,null,null,null,null,null,null,null,null,null,null,null,null,null,null,null,null,null,null,null,null,132,20,{"$error":"#N/A"},{"$error":"#N/A"},{"$error":"#N/A"},0.13549574423999999,0.47250425575999999,-3.3008511520000006E-2,0.64100851151999994,-0.20151276727999995,0.80951276727999999,0.30399999999999999,null,0,0,null,null,null,null,null,null,null,null,null,null,132,{"$error":"#N/A"},"","","","","",{"$error":"#N/A"}]
[0,null,{"$f":"IF(input!I37=\"\",\"\",input!I37)","v":""},"\"","","\", ",null,null,null,null,null,null,null,null,null,null,null,null,null,null,null,null,null,null,null,null,null,null,null,null,133,20,{"$error":"#N/A"},{"$error":"#N/A"},{"$error":"#N/A"},0.13549574423999999,0.47250425575999999,-3.3008511520000006E-2,0.64100851151999994,-0.20151276727999995,0.80951276727999999,0.30399999999999999,null,0,0,null,null,null,null,null,null,null,null,null,null,133,{"$error":"#N/A"},"","","","","",{"$error":"#N/A"}]
[0,null,{"$f":"IF(input!I38=\"\",\"\",input!I38)","v":""},"\"","","\", ",null,null,null,null,null,null,null,null,null,null,null,null,null,null,null,null,null,null,null,null,null,null,null,null,134,20,{"$error":"#N/A"},{"$error":"#N/A"},{"$error":"#N/A"},0.13549574423999999,0.47250425575999999,-3.3008511520000006E-2,0.64100851151999994,-0.20151276727999995,0.80951276727999999,0.30399999999999999,null,0,0,null,null,null,null,null,null,null,null,null,null,134,{"$error":"#N/A"},"","","","","",{"$error":"#N/A"}]
[0,null,{"$f":"IF(input!I39=\"\",\"\",input!I39)","v":""},"\"","","\", ",null,null,null,null,null,null,null,null,null,null,null,null,null,null,null,null,null,null,null,null,null,null,null,null,135,20,{"$error":"#N/A"},{"$error":"#N/A"},{"$error":"#N/A"},0.13549574423999999,0.47250425575999999,-3.3008511520000006E-2,0.64100851151999994,-0.20151276727999995,0.80951276727999999,0.30399999999999999,null,0,0,null,null,null,null,null,null,null,null,null,null,135,{"$error":"#N/A"},"","","","","",{"$error":"#N/A"}]
[0,null,{"$f":"IF(input!I40=\"\",\"\",input!I40)","v":""},"\"","","\", ",null,null,null,null,null,null,null,null,null,null,null,null,null,null,null,null,null,null,null,null,null,null,null,null,136,20,{"$error":"#N/A"},{"$error":"#N/A"},{"$error":"#N/A"},0.13549574423999999,0.47250425575999999,-3.3008511520000006E-2,0.64100851151999994,-0.20151276727999995,0.80951276727999999,0.30399999999999999,null,0,0,null,null,null,null,null,null,null,null,null,null,136,{"$error":"#N/A"},"","","","","",{"$error":"#N/A"}]
[0,null,{"$f":"IF(input!I41=\"\",\"\",input!I41)","v":""},"\"","","\", ",null,null,null,null,null,null,null,null,null,null,null,null,null,null,null,null,null,null,null,null,null,null,null,null,137,20,{"$error":"#N/A"},{"$error":"#N/A"},{"$error":"#N/A"},0.13549574423999999,0.47250425575999999,-3.3008511520000006E-2,0.64100851151999994,-0.20151276727999995,0.80951276727999999,0.30399999999999999,null,0,0,null,null,null,null,null,null,null,null,null,null,137,{"$error":"#N/A"},"","","","","",{"$error":"#N/A"}]
[0,null,{"$f":"IF(input!I42=\"\",\"\",input!I42)","v":""},"\"","","\", ",null,null,null,null,null,null,null,null,null,null,null,null,null,null,null,null,null,null,null,null,null,null,null,null,138,20,{"$error":"#N/A"},{"$error":"#N/A"},{"$error":"#N/A"},0.13549574423999999,0.47250425575999999,-3.3008511520000006E-2,0.64100851151999994,-0.20151276727999995,0.80951276727999999,0.30399999999999999,null,0,0,null,null,null,null,null,null,null,null,null,null,138,{"$error":"#N/A"},"","","","","",{"$error":"#N/A"}]
[0,null,{"$f":"IF(input!I43=\"\",\"\",input!I43)","v":""},"\"","","\", ",null,null,null,null,null,null,null,null,null,null,null,null,null,null,null,null,null,null,null,null,null,null,null,null,139,20,{"$error":"#N/A"},{"$error":"#N/A"},{"$error":"#N/A"},0.13549574423999999,0.47250425575999999,-3.3008511520000006E-2,0.64100851151999994,-0.20151276727999995,0.80951276727999999,0.30399999999999999,null,0,0,null,null,null,null,null,null,null,null,null,null,139,{"$error":"#N/A"},"","","","","",{"$error":"#N/A"}]
[0,null,{"$f":"IF(input!I44=\"\",\"\",input!I44)","v":""},"\"","","\", ",null,null,null,null,null,null,null,null,null,null,null,null,null,null,null,null,null,null,null,null,null,null,null,null,140,20,{"$error":"#N/A"},{"$error":"#N/A"},{"$error":"#N/A"},0.13549574423999999,0.47250425575999999,-3.3008511520000006E-2,0.64100851151999994,-0.20151276727999995,0.80951276727999999,0.30399999999999999,null,0,0,null,null,null,null,null,null,null,null,null,null,140,{"$error":"#N/A"},"","","","","",{"$error":"#N/A"}]
[0,null,{"$f":"IF(input!I45=\"\",\"\",input!I45)","v":""},"\"","","\", ",null,null,null,null,null,null,null,null,null,null,null,null,null,null,null,null,null,null,null,null,null,null,null,null,141,20,{"$error":"#N/A"},{"$error":"#N/A"},{"$error":"#N/A"},0.13549574423999999,0.47250425575999999,-3.3008511520000006E-2,0.64100851151999994,-0.20151276727999995,0.80951276727999999,0.30399999999999999,null,0,0,null,null,null,null,null,null,null,null,null,null,141,{"$error":"#N/A"},"","","","","",{"$error":"#N/A"}]
[0,null,{"$f":"IF(input!I46=\"\",\"\",input!I46)","v":""},"\"","","\", ",null,null,null,null,null,null,null,null,null,null,null,null,null,null,null,null,null,null,null,null,null,null,null,null,142,20,{"$error":"#N/A"},{"$error":"#N/A"},{"$error":"#N/A"},0.13549574423999999,0.47250425575999999,-3.3008511520000006E-2,0.64100851151999994,-0.20151276727999995,0.80951276727999999,0.30399999999999999,null,0,0,null,null,null,null,null,null,null,null,null,null,142,{"$error":"#N/A"},"","","","","",{"$error":"#N/A"}]
[0,null,{"$f":"IF(input!I47=\"\",\"\",input!I47)","v":""},"\"","","\", ",null,null,null,null,null,null,null,null,null,null,null,null,null,null,null,null,null,null,null,null,null,null,null,null,143,20,{"$error":"#N/A"},{"$error":"#N/A"},{"$error":"#N/A"},0.13549574423999999,0.47250425575999999,-3.3008511520000006E-2,0.64100851151999994,-0.20151276727999995,0.80951276727999999,0.30399999999999999,null,0,0,null,null,null,null,null,null,null,null,null,null,143,{"$error":"#N/A"},"","","","","",{"$error":"#N/A"}]
[0,null,{"$f":"IF(input!I48=\"\",\"\",input!I48)","v":""},"\"","","\", ",null,null,null,null,null,null,null,null,null,null,null,null,null,null,null,null,null,null,null,null,null,null,null,null,144,20,{"$error":"#N/A"},{"$error":"#N/A"},{"$error":"#N/A"},0.13549574423999999,0.47250425575999999,-3.3008511520000006E-2,0.64100851151999994,-0.20151276727999995,0.80951276727999999,0.30399999999999999,null,0,0,null,null,null,null,null,null,null,null,null,null,144,{"$error":"#N/A"},"","","","","",{"$error":"#N/A"}]
[0,null,{"$f":"IF(input!I49=\"\",\"\",input!I49)","v":""},"\"","","\", ",null,null,null,null,null,null,null,null,null,null,null,null,null,null,null,null,null,null,null,null,null,null,null,null,145,20,{"$error":"#N/A"},{"$error":"#N/A"},{"$error":"#N/A"},0.13549574423999999,0.47250425575999999,-3.3008511520000006E-2,0.64100851151999994,-0.20151276727999995,0.80951276727999999,0.30399999999999999,null,0,0,null,null,null,null,null,null,null,null,null,null,145,{"$error":"#N/A"},"","","","","",{"$error":"#N/A"}]
[0,null,{"$f":"IF(input!I50=\"\",\"\",input!I50)","v":""},"\"","","\", ",null,null,null,null,null,null,null,null,null,null,null,null,null,null,null,null,null,null,null,null,null,null,null,null,146,20,{"$error":"#N/A"},{"$error":"#N/A"},{"$error":"#N/A"},{"$f":"AJ149","v":0.13549574423999999},0.47250425575999999,-3.3008511520000006E-2,0.64100851151999994,-0.20151276727999995,0.80951276727999999,0.30399999999999999,null,0,0,null,null,null,null,null,null,null,null,null,null,146,{"$error":"#N/A"},"","","","","",{"$error":"#N/A"}]
[0,null,{"$f":"IF(input!I51=\"\",\"\",input!I51)","v":""},"\"","","\", ",null,null,null,null,null,null,null,null,null,null,null,null,null,null,null,null,null,null,null,null,null,null,null,null,147,20,{"$error":"#N/A"},{"$error":"#N/A"},{"$error":"#N/A"},0.13549574423999999,0.47250425575999999,-3.3008511520000006E-2,0.64100851151999994,-0.20151276727999995,0.80951276727999999,0.30399999999999999,null,0,0,null,null,null,null,null,null,null,null,null,null,147,{"$error":"#N/A"},"","","","","",{"$error":"#N/A"}]
[0,null,{"$f":"IF(input!I52=\"\",\"\",input!I52)","v":""},"\"","","\", ",null,null,null,null,null,null,null,null,null,null,null,null,null,null,null,null,null,null,null,null,null,null,null,null,148,20,{"$error":"#N/A"},{"$error":"#N/A"},{"$error":"#N/A"},0.13549574423999999,0.47250425575999999,-3.3008511520000006E-2,0.64100851151999994,-0.20151276727999995,0.80951276727999999,0.30399999999999999,null,0,0,null,null,null,null,null,null,null,null,null,null,148,{"$error":"#N/A"},"","","","","",{"$error":"#N/A"}]
[0,null,{"$f":"IF(input!I53=\"\",\"\",input!I53)","v":""},"\"","","\", ",null,null,null,null,null,null,null,null,null,null,null,null,null,null,null,null,null,null,null,null,null,null,null,null,149,20,{"$error":"#N/A"},{"$error":"#N/A"},{"$error":"#N/A"},0.13549574423999999,0.47250425575999999,-3.3008511520000006E-2,0.64100851151999994,-0.20151276727999995,0.80951276727999999,0.30399999999999999,null,0,0,null,null,null,null,null,null,null,null,null,null,149,{"$error":"#N/A"},"","","","","",{"$error":"#N/A"}]
[0,null,{"$f":"IF(input!I54=\"\",\"\",input!I54)","v":""},"\"","","\", ",null,null,null,null,null,null,null,null,null,null,null,null,null,null,null,null,null,null,null,null,null,null,null,null,150,20,{"$error":"#N/A"},{"$error":"#N/A"},{"$error":"#N/A"},0.13549574423999999,0.47250425575999999,-3.3008511520000006E-2,0.64100851151999994,-0.20151276727999995,0.80951276727999999,0.30399999999999999,null,0,0,null,null,null,null,null,null,null,null,null,null,150,{"$error":"#N/A"},"","","","","",{"$error":"#N/A"}]
[0,null,{"$f":"IF(input!L5=\"\",\"\",input!L5)","v":""},"\"","","\", ",null,null,null,null,null,null,null,null,null,null,null,null,null,null,null,null,null,null,null,null,null,null,null,null,151,20,{"$error":"#N/A"},{"$error":"#N/A"},{"$error":"#N/A"},0.13549574423999999,0.47250425575999999,-3.3008511520000006E-2,0.64100851151999994,-0.20151276727999995,0.80951276727999999,0.30399999999999999,null,0,0,null,null,null,null,null,null,null,null,null,null,151,{"$error":"#N/A"},"","","","","",{"$error":"#N/A"}]
[0,null,{"$f":"IF(input!L6=\"\",\"\",input!L6)","v":""},"\"","","\", ",null,null,null,null,null,null,null,null,null,null,null,null,null,null,null,null,null,null,null,null,null,null,null,null,152,20,{"$error":"#N/A"},{"$error":"#N/A"},{"$error":"#N/A"},0.13549574423999999,0.47250425575999999,-3.3008511520000006E-2,0.64100851151999994,-0.20151276727999995,0.80951276727999999,0.30399999999999999,null,0,0,null,null,null,null,null,null,null,null,null,null,152,{"$error":"#N/A"},"","","","","",{"$error":"#N/A"}]
[0,null,{"$f":"IF(input!L7=\"\",\"\",input!L7)","v":""},"\"","","\", ",null,null,null,null,null,null,null,null,null,null,null,null,null,null,null,null,null,null,null,null,null,null,null,null,153,20,{"$error":"#N/A"},{"$error":"#N/A"},{"$error":"#N/A"},0.13549574423999999,0.47250425575999999,-3.3008511520000006E-2,0.64100851151999994,-0.20151276727999995,0.80951276727999999,0.30399999999999999,null,0,0,null,null,null,null,null,null,null,null,null,null,153,{"$error":"#N/A"},"","","","","",{"$error":"#N/A"}]
[0,null,{"$f":"IF(input!L8=\"\",\"\",input!L8)","v":""},"\"","","\", ",null,null,null,null,null,null,null,null,null,null,null,null,null,null,null,null,null,null,null,null,null,null,null,null,154,20,{"$error":"#N/A"},{"$error":"#N/A"},{"$error":"#N/A"},0.13549574423999999,0.47250425575999999,-3.3008511520000006E-2,0.64100851151999994,-0.20151276727999995,0.80951276727999999,0.30399999999999999,null,0,0,null,null,null,null,null,null,null,null,null,null,154,{"$error":"#N/A"},"","","","","",{"$error":"#N/A"}]
[0,null,{"$f":"IF(input!L9=\"\",\"\",input!L9)","v":""},"\"","","\", ",null,null,null,null,null,null,null,null,null,null,null,null,null,null,null,null,null,null,null,null,null,null,null,null,155,20,{"$error":"#N/A"},{"$error":"#N/A"},{"$error":"#N/A"},0.13549574423999999,0.47250425575999999,-3.3008511520000006E-2,0.64100851151999994,-0.20151276727999995,0.80951276727999999,0.30399999999999999,null,0,0,null,null,null,null,null,null,null,null,null,null,155,{"$error":"#N/A"},"","","","","",{"$error":"#N/A"}]
[0,null,{"$f":"IF(input!L10=\"\",\"\",input!L10)","v":""},"\"","","\", ",null,null,null,null,null,null,null,null,null,null,null,null,null,null,null,null,null,null,null,null,null,null,null,null,156,20,{"$error":"#N/A"},{"$error":"#N/A"},{"$error":"#N/A"},0.13549574423999999,0.47250425575999999,-3.3008511520000006E-2,0.64100851151999994,-0.20151276727999995,0.80951276727999999,0.30399999999999999,null,0,0,null,null,null,null,null,null,null,null,null,null,156,{"$error":"#N/A"},"","","","","",{"$error":"#N/A"}]
[0,null,{"$f":"IF(input!L11=\"\",\"\",input!L11)","v":""},"\"","","\", ",null,null,null,null,null,null,null,null,null,null,null,null,null,null,null,null,null,null,null,null,null,null,null,null,157,20,{"$error":"#N/A"},{"$error":"#N/A"},{"$error":"#N/A"},0.13549574423999999,0.47250425575999999,-3.3008511520000006E-2,0.64100851151999994,-0.20151276727999995,0.80951276727999999,0.30399999999999999,null,0,0,null,null,null,null,null,null,null,null,null,null,157,{"$error":"#N/A"},"","","","","",{"$error":"#N/A"}]
[0,null,{"$f":"IF(input!L12=\"\",\"\",input!L12)","v":""},"\"","","\", ",null,null,null,null,null,null,null,null,null,null,null,null,null,null,null,null,null,null,null,null,null,null,null,null,158,20,{"$error":"#N/A"},{"$error":"#N/A"},{"$error":"#N/A"},0.13549574423999999,0.47250425575999999,-3.3008511520000006E-2,0.64100851151999994,-0.20151276727999995,0.80951276727999999,0.30399999999999999,null,0,0,null,null,null,null,null,null,null,null,null,null,158,{"$error":"#N/A"},"","","","","",{"$error":"#N/A"}]
[0,null,{"$f":"IF(input!L13=\"\",\"\",input!L13)","v":""},"\"","","\", ",null,null,null,null,null,null,null,null,null,null,null,null,null,null,null,null,null,null,null,null,null,null,null,null,159,20,{"$error":"#N/A"},{"$error":"#N/A"},{"$error":"#N/A"},0.13549574423999999,0.47250425575999999,-3.3008511520000006E-2,0.64100851151999994,-0.20151276727999995,0.80951276727999999,0.30399999999999999,null,0,0,null,null,null,null,null,null,null,null,null,null,159,{"$error":"#N/A"},"","","","","",{"$error":"#N/A"}]
[0,null,{"$f":"IF(input!L14=\"\",\"\",input!L14)","v":""},"\"","","\", ",null,null,null,null,null,null,null,null,null,null,null,null,null,null,null,null,null,null,null,null,null,null,null,null,160,20,{"$error":"#N/A"},{"$error":"#N/A"},{"$error":"#N/A"},0.13549574423999999,0.47250425575999999,-3.3008511520000006E-2,0.64100851151999994,-0.20151276727999995,0.80951276727999999,0.30399999999999999,null,0,0,null,null,null,null,null,null,null,null,null,null,160,{"$error":"#N/A"},"","","","","",{"$error":"#N/A"}]
[0,null,{"$f":"IF(input!L15=\"\",\"\",input!L15)","v":""},"\"","","\", ",null,null,null,null,null,null,null,null,null,null,null,null,null,null,null,null,null,null,null,null,null,null,null,null,161,{"$f":"IF((Anzahl>AE165),AE165,Anzahl)","v":20},{"$error":"#N/A"},{"$f":"IF(OGW=\"\",#N/A,IF(B165<>\"\",OGW,#N/A))","v":{"$error":"#N/A"}},{"$f":"IF(UGW=\"\",#N/A,IF(B165<>\"\",UGW,#N/A))","v":{"$error":"#N/A"}},0.13549574423999999,0.47250425575999999,-3.3008511520000006E-2,0.64100851151999994,-0.20151276727999995,0.80951276727999999,0.30399999999999999,null,{"$f":"IF(AND(B165<>\"\",B165<UGW),1,0)","v":0},{"$f":"IF(AND(B165<>\"\",B165>OGW),1,0)","v":0},null,null,null,null,null,null,null,null,null,null,161,{"$f":"IF(B165=\"\",NA(),SMALL(xi,BF165))","v":{"$error":"#N/A"}},"",{"$f":"IF(B165=\"\",\"\",NORMSDIST((BE165-fxds)/Standardabweichung))","v":""},"",{"$f":"IF(IF(B165=\"\",\"\",SMALL(BG,BF165))=0,0.0001,IF(B165=\"\",\"\",SMALL(BG,BF165)))","v":""},"",{"$f":"IF(B165=\"\",NA(),NORMSINV((BF165-0.3)/(Anzahl+0.4)))","v":{"$error":"#N/A"}}]
[0,null,{"$f":"IF(input!L16=\"\",\"\",input!L16)","v":""},"\"","","\", ",null,null,null,null,null,null,null,null,null,null,null,null,null,null,null,null,null,null,null,null,null,null,null,null,162,20,{"$error":"#N/A"},{"$error":"#N/A"},{"$error":"#N/A"},{"$f":"AJ165","v":0.13549574423999999},0.47250425575999999,-3.3008511520000006E-2,0.64100851151999994,-0.20151276727999995,0.80951276727999999,0.30399999999999999,null,0,0,null,null,null,null,null,null,null,null,null,null,162,{"$error":"#N/A"},"","","","","",{"$error":"#N/A"}]
[0,null,{"$f":"IF(input!L17=\"\",\"\",input!L17)","v":""},"\"","","\", ",null,null,null,null,null,null,null,null,null,null,null,null,null,null,null,null,null,null,null,null,null,null,null,null,163,20,{"$error":"#N/A"},{"$error":"#N/A"},{"$error":"#N/A"},0.13549574423999999,0.47250425575999999,-3.3008511520000006E-2,0.64100851151999994,-0.20151276727999995,0.80951276727999999,0.30399999999999999,null,0,0,null,null,null,null,null,null,null,null,null,null,163,{"$error":"#N/A"},"","","","","",{"$error":"#N/A"}]
[0,null,{"$f":"IF(input!L18=\"\",\"\",input!L18)","v":""},"\"","","\", ",null,null,null,null,null,null,null,null,null,null,null,null,null,null,null,null,null,null,null,null,null,null,null,null,164,20,{"$error":"#N/A"},{"$error":"#N/A"},{"$error":"#N/A"},0.13549574423999999,0.47250425575999999,-3.3008511520000006E-2,0.64100851151999994,-0.20151276727999995,0.80951276727999999,0.30399999999999999,null,0,0,null,null,null,null,null,null,null,null,null,null,164,{"$error":"#N/A"},"","","","","",{"$error":"#N/A"}]
[0,null,{"$f":"IF(input!L19=\"\",\"\",input!L19)","v":""},"\"","","\", ",null,null,null,null,null,null,null,null,null,null,null,null,null,null,null,null,null,null,null,null,null,null,null,null,165,20,{"$error":"#N/A"},{"$error":"#N/A"},{"$error":"#N/A"},0.13549574423999999,0.47250425575999999,-3.3008511520000006E-2,0.64100851151999994,-0.20151276727999995,0.80951276727999999,0.30399999999999999,null,0,0,null,null,null,null,null,null,null,null,null,null,165,{"$error":"#N/A"},"","","","","",{"$error":"#N/A"}]
[0,null,{"$f":"IF(input!L20=\"\",\"\",input!L20)","v":""},"\"","","\", ",null,null,null,null,null,null,null,null,null,null,null,null,null,null,null,null,null,null,null,null,null,null,null,null,166,20,{"$error":"#N/A"},{"$error":"#N/A"},{"$error":"#N/A"},0.13549574423999999,0.47250425575999999,-3.3008511520000006E-2,0.64100851151999994,-0.20151276727999995,0.80951276727999999,0.30399999999999999,null,0,0,null,null,null,null,null,null,null,null,null,null,166,{"$error":"#N/A"},"","","","","",{"$error":"#N/A"}]
[0,null,{"$f":"IF(input!L21=\"\",\"\",input!L21)","v":""},"\"","","\", ",null,null,null,null,null,null,null,null,null,null,null,null,null,null,null,null,null,null,null,null,null,null,null,null,167,20,{"$error":"#N/A"},{"$error":"#N/A"},{"$error":"#N/A"},0.13549574423999999,0.47250425575999999,-3.3008511520000006E-2,0.64100851151999994,-0.20151276727999995,0.80951276727999999,0.30399999999999999,null,0,0,null,null,null,null,null,null,null,null,null,null,167,{"$error":"#N/A"},"","","","","",{"$error":"#N/A"}]
[0,null,{"$f":"IF(input!L22=\"\",\"\",input!L22)","v":""},"\"","","\", ",null,null,null,null,null,null,null,null,null,null,null,null,null,null,null,null,null,null,null,null,null,null,null,null,168,20,{"$error":"#N/A"},{"$error":"#N/A"},{"$error":"#N/A"},0.13549574423999999,0.47250425575999999,-3.3008511520000006E-2,0.64100851151999994,-0.20151276727999995,0.80951276727999999,0.30399999999999999,null,0,0,null,null,null,null,null,null,null,null,null,null,168,{"$error":"#N/A"},"","","","","",{"$error":"#N/A"}]
[0,null,{"$f":"IF(input!L23=\"\",\"\",input!L23)","v":""},"\"","","\", ",null,null,null,null,null,null,null,null,null,null,null,null,null,null,null,null,null,null,null,null,null,null,null,null,169,20,{"$error":"#N/A"},{"$error":"#N/A"},{"$error":"#N/A"},0.13549574423999999,0.47250425575999999,-3.3008511520000006E-2,0.64100851151999994,-0.20151276727999995,0.80951276727999999,0.30399999999999999,null,0,0,null,null,null,null,null,null,null,null,null,null,169,{"$error":"#N/A"},"","","","","",{"$error":"#N/A"}]
[0,null,{"$f":"IF(input!L24=\"\",\"\",input!L24)","v":""},"\"","","\", ",null,null,null,null,null,null,null,null,null,null,null,null,null,null,null,null,null,null,null,null,null,null,null,null,170,20,{"$error":"#N/A"},{"$error":"#N/A"},{"$error":"#N/A"},0.13549574423999999,0.47250425575999999,-3.3008511520000006E-2,0.64100851151999994,-0.20151276727999995,0.80951276727999999,0.30399999999999999,null,0,0,null,null,null,null,null,null,null,null,null,null,170,{"$error":"#N/A"},"","","","","",{"$error":"#N/A"}]
[0,null,{"$f":"IF(input!L25=\"\",\"\",input!L25)","v":""},"\"","","\", ",null,null,null,null,null,null,null,null,null,null,null,null,null,null,null,null,null,null,null,null,null,null,null,null,171,20,{"$error":"#N/A"},{"$error":"#N/A"},{"$error":"#N/A"},0.13549574423999999,0.47250425575999999,-3.3008511520000006E-2,0.64100851151999994,-0.20151276727999995,0.80951276727999999,0.30399999999999999,null,0,0,null,null,null,null,null,null,null,null,null,null,171,{"$error":"#N/A"},"","","","","",{"$error":"#N/A"}]
[0,null,{"$f":"IF(input!L26=\"\",\"\",input!L26)","v":""},"\"","","\", ",null,null,null,null,null,null,null,null,null,null,null,null,null,null,null,null,null,null,null,null,null,null,null,null,172,20,{"$error":"#N/A"},{"$error":"#N/A"},{"$error":"#N/A"},0.13549574423999999,0.47250425575999999,-3.3008511520000006E-2,0.64100851151999994,-0.20151276727999995,0.80951276727999999,0.30399999999999999,null,0,0,null,null,null,null,null,null,null,null,null,null,172,{"$error":"#N/A"},"","","","","",{"$error":"#N/A"}]
[0,null,{"$f":"IF(input!L27=\"\",\"\",input!L27)","v":""},"\"","","\", ",null,null,null,null,null,null,null,null,null,null,null,null,null,null,null,null,null,null,null,null,null,null,null,null,173,20,{"$error":"#N/A"},{"$error":"#N/A"},{"$error":"#N/A"},0.13549574423999999,0.47250425575999999,-3.3008511520000006E-2,0.64100851151999994,-0.20151276727999995,0.80951276727999999,0.30399999999999999,null,0,0,null,null,null,null,null,null,null,null,null,null,173,{"$error":"#N/A"},"","","","","",{"$error":"#N/A"}]
[0,null,{"$f":"IF(input!L28=\"\",\"\",input!L28)","v":""},"\"","","\", ",null,null,null,null,null,null,null,null,null,null,null,null,null,null,null,null,null,null,null,null,null,null,null,null,174,20,{"$error":"#N/A"},{"$error":"#N/A"},{"$error":"#N/A"},0.13549574423999999,0.47250425575999999,-3.3008511520000006E-2,0.64100851151999994,-0.20151276727999995,0.80951276727999999,0.30399999999999999,null,0,0,null,null,null,null,null,null,null,null,null,null,174,{"$error":"#N/A"},"","","","","",{"$error":"#N/A"}]
[0,null,{"$f":"IF(input!L29=\"\",\"\",input!L29)","v":""},"\"","","\", ",null,null,null,null,null,null,null,null,null,null,null,null,null,null,null,null,null,null,null,null,null,null,null,null,175,20,{"$error":"#N/A"},{"$error":"#N/A"},{"$error":"#N/A"},0.13549574423999999,0.47250425575999999,-3.3008511520000006E-2,0.64100851151999994,-0.20151276727999995,0.80951276727999999,0.30399999999999999,null,0,0,null,null,null,null,null,null,null,null,null,null,175,{"$error":"#N/A"},"","","","","",{"$error":"#N/A"}]
[0,null,{"$f":"IF(input!L30=\"\",\"\",input!L30)","v":""},"\"","","\", ",null,null,null,null,null,null,null,null,null,null,null,null,null,null,null,null,null,null,null,null,null,null,null,null,176,20,{"$error":"#N/A"},{"$error":"#N/A"},{"$error":"#N/A"},0.13549574423999999,0.47250425575999999,-3.3008511520000006E-2,0.64100851151999994,-0.20151276727999995,0.80951276727999999,0.30399999999999999,null,0,0,null,null,null,null,null,null,null,null,null,null,176,{"$error":"#N/A"},"","","","","",{"$error":"#N/A"}]
[0,null,{"$f":"IF(input!L31=\"\",\"\",input!L31)","v":""},"\"","","\", ",null,null,null,null,null,null,null,null,null,null,null,null,null,null,null,null,null,null,null,null,null,null,null,null,177,20,{"$error":"#N/A"},{"$error":"#N/A"},{"$error":"#N/A"},0.13549574423999999,0.47250425575999999,-3.3008511520000006E-2,0.64100851151999994,-0.20151276727999995,0.80951276727999999,0.30399999999999999,null,0,0,null,null,null,null,null,null,null,null,null,null,177,{"$error":"#N/A"},"","","","","",{"$error":"#N/A"}]
[0,null,{"$f":"IF(input!L32=\"\",\"\",input!L32)","v":""},"\"","","\", ",null,null,null,null,null,null,null,null,null,null,null,null,null,null,null,null,null,null,null,null,null,null,null,null,178,20,{"$error":"#N/A"},{"$error":"#N/A"},{"$error":"#N/A"},{"$f":"AJ181","v":0.13549574423999999},0.47250425575999999,-3.3008511520000006E-2,0.64100851151999994,-0.20151276727999995,0.80951276727999999,0.30399999999999999,null,0,0,null,null,null,null,null,null,null,null,null,null,178,{"$error":"#N/A"},"","","","","",{"$error":"#N/A"}]
[0,null,{"$f":"IF(input!L33=\"\",\"\",input!L33)","v":""},"\"","","\", ",null,null,null,null,null,null,null,null,null,null,null,null,null,null,null,null,null,null,null,null,null,null,null,null,179,20,{"$error":"#N/A"},{"$error":"#N/A"},{"$error":"#N/A"},0.13549574423999999,0.47250425575999999,-3.3008511520000006E-2,0.64100851151999994,-0.20151276727999995,0.80951276727999999,0.30399999999999999,null,0,0,null,null,null,null,null,null,null,null,null,null,179,{"$error":"#N/A"},"","","","","",{"$error":"#N/A"}]
[0,null,{"$f":"IF(input!L34=\"\",\"\",input!L34)","v":""},"\"","","\", ",null,null,null,null,null,null,null,null,null,null,null,null,null,null,null,null,null,null,null,null,null,null,null,null,180,20,{"$error":"#N/A"},{"$error":"#N/A"},{"$error":"#N/A"},0.13549574423999999,0.47250425575999999,-3.3008511520000006E-2,0.64100851151999994,-0.20151276727999995,0.80951276727999999,0.30399999999999999,null,0,0,null,null,null,null,null,null,null,null,null,null,180,{"$error":"#N/A"},"","","","","",{"$error":"#N/A"}]
[0,null,{"$f":"IF(input!L35=\"\",\"\",input!L35)","v":""},"\"","","\", ",null,null,null,null,null,null,null,null,null,null,null,null,null,null,null,null,null,null,null,null,null,null,null,null,181,20,{"$error":"#N/A"},{"$error":"#N/A"},{"$error":"#N/A"},0.13549574423999999,0.47250425575999999,-3.3008511520000006E-2,0.64100851151999994,-0.20151276727999995,0.80951276727999999,0.30399999999999999,null,0,0,null,null,null,null,null,null,null,null,null,null,181,{"$error":"#N/A"},"","","","","",{"$error":"#N/A"}]
[0,null,{"$f":"IF(input!L36=\"\",\"\",input!L36)","v":""},"\"","","\", ",null,null,null,null,null,null,null,null,null,null,null,null,null,null,null,null,null,null,null,null,null,null,null,null,182,20,{"$error":"#N/A"},{"$error":"#N/A"},{"$error":"#N/A"},0.13549574423999999,0.47250425575999999,-3.3008511520000006E-2,0.64100851151999994,-0.20151276727999995,0.80951276727999999,0.30399999999999999,null,0,0,null,null,null,null,null,null,null,null,null,null,182,{"$error":"#N/A"},"","","","","",{"$error":"#N/A"}]
[0,null,{"$f":"IF(input!L37=\"\",\"\",input!L37)","v":""},"\"","","\", ",null,null,null,null,null,null,null,null,null,null,null,null,null,null,null,null,null,null,null,null,null,null,null,null,183,20,{"$error":"#N/A"},{"$error":"#N/A"},{"$error":"#N/A"},0.13549574423999999,0.47250425575999999,-3.3008511520000006E-2,0.64100851151999994,-0.20151276727999995,0.80951276727999999,0.30399999999999999,null,0,0,null,null,null,null,null,null,null,null,null,null,183,{"$error":"#N/A"},"","","","","",{"$error":"#N/A"}]
[0,null,{"$f":"IF(input!L38=\"\",\"\",input!L38)","v":""},"\"","","\", ",null,null,null,null,null,null,null,null,null,null,null,null,null,null,null,null,null,null,null,null,null,null,null,null,184,20,{"$error":"#N/A"},{"$error":"#N/A"},{"$error":"#N/A"},0.13549574423999999,0.47250425575999999,-3.3008511520000006E-2,0.64100851151999994,-0.20151276727999995,0.80951276727999999,0.30399999999999999,null,0,0,null,null,null,null,null,null,null,null,null,null,184,{"$error":"#N/A"},"","","","","",{"$error":"#N/A"}]
[0,null,{"$f":"IF(input!L39=\"\",\"\",input!L39)","v":""},"\"","","\", ",null,null,null,null,null,null,null,null,null,null,null,null,null,null,null,null,null,null,null,null,null,null,null,null,185,20,{"$error":"#N/A"},{"$error":"#N/A"},{"$error":"#N/A"},0.13549574423999999,0.47250425575999999,-3.3008511520000006E-2,0.64100851151999994,-0.20151276727999995,0.80951276727999999,0.30399999999999999,null,0,0,null,null,null,null,null,null,null,null,null,null,185,{"$error":"#N/A"},"","","","","",{"$error":"#N/A"}]
[0,null,{"$f":"IF(input!L40=\"\",\"\",input!L40)","v":""},"\"","","\", ",null,null,null,null,null,null,null,null,null,null,null,null,null,null,null,null,null,null,null,null,null,null,null,null,186,20,{"$error":"#N/A"},{"$error":"#N/A"},{"$error":"#N/A"},0.13549574423999999,0.47250425575999999,-3.3008511520000006E-2,0.64100851151999994,-0.20151276727999995,0.80951276727999999,0.30399999999999999,null,0,0,null,null,null,null,null,null,null,null,null,null,186,{"$error":"#N/A"},"","","","","",{"$error":"#N/A"}]
[0,null,{"$f":"IF(input!L41=\"\",\"\",input!L41)","v":""},"\"","","\", ",null,null,null,null,null,null,null,null,null,null,null,null,null,null,null,null,null,null,null,null,null,null,null,null,187,20,{"$error":"#N/A"},{"$error":"#N/A"},{"$error":"#N/A"},0.13549574423999999,0.47250425575999999,-3.3008511520000006E-2,0.64100851151999994,-0.20151276727999995,0.80951276727999999,0.30399999999999999,null,0,0,null,null,null,null,null,null,null,null,null,null,187,{"$error":"#N/A"},"","","","","",{"$error":"#N/A"}]
[0,null,{"$f":"IF(input!L42=\"\",\"\",input!L42)","v":""},"\"","","\", ",null,null,null,null,null,null,null,null,null,null,null,null,null,null,null,null,null,null,null,null,null,null,null,null,188,20,{"$error":"#N/A"},{"$error":"#N/A"},{"$error":"#N/A"},0.13549574423999999,0.47250425575999999,-3.3008511520000006E-2,0.64100851151999994,-0.20151276727999995,0.80951276727999999,0.30399999999999999,null,0,0,null,null,null,null,null,null,null,null,null,null,188,{"$error":"#N/A"},"","","","","",{"$error":"#N/A"}]
[0,null,{"$f":"IF(input!L43=\"\",\"\",input!L43)","v":""},"\"","","\", ",null,null,null,null,null,null,null,null,null,null,null,null,null,null,null,null,null,null,null,null,null,null,null,null,189,20,{"$error":"#N/A"},{"$error":"#N/A"},{"$error":"#N/A"},0.13549574423999999,0.47250425575999999,-3.3008511520000006E-2,0.64100851151999994,-0.20151276727999995,0.80951276727999999,0.30399999999999999,null,0,0,null,null,null,null,null,null,null,null,null,null,189,{"$error":"#N/A"},"","","","","",{"$error":"#N/A"}]
[0,null,{"$f":"IF(input!L44=\"\",\"\",input!L44)","v":""},"\"","","\", ",null,null,null,null,null,null,null,null,null,null,null,null,null,null,null,null,null,null,null,null,null,null,null,null,190,20,{"$error":"#N/A"},{"$error":"#N/A"},{"$error":"#N/A"},0.13549574423999999,0.47250425575999999,-3.3008511520000006E-2,0.64100851151999994,-0.20151276727999995,0.80951276727999999,0.30399999999999999,null,0,0,null,null,null,null,null,null,null,null,null,null,190,{"$error":"#N/A"},"","","","","",{"$error":"#N/A"}]
[0,null,{"$f":"IF(input!L45=\"\",\"\",input!L45)","v":""},"\"","","\", ",null,null,null,null,null,null,null,null,null,null,null,null,null,null,null,null,null,null,null,null,null,null,null,null,191,20,{"$error":"#N/A"},{"$error":"#N/A"},{"$error":"#N/A"},0.13549574423999999,0.47250425575999999,-3.3008511520000006E-2,0.64100851151999994,-0.20151276727999995,0.80951276727999999,0.30399999999999999,null,0,0,null,null,null,null,null,null,null,null,null,null,191,{"$error":"#N/A"},"","","","","",{"$error":"#N/A"}]
[0,null,{"$f":"IF(input!L46=\"\",\"\",input!L46)","v":""},"\"","","\", ",null,null,null,null,null,null,null,null,null,null,null,null,null,null,null,null,null,null,null,null,null,null,null,null,192,20,{"$error":"#N/A"},{"$error":"#N/A"},{"$error":"#N/A"},0.13549574423999999,0.47250425575999999,-3.3008511520000006E-2,0.64100851151999994,-0.20151276727999995,0.80951276727999999,0.30399999999999999,null,0,0,null,null,null,null,null,null,null,null,null,null,192,{"$error":"#N/A"},"","","","","",{"$error":"#N/A"}]
[0,null,{"$f":"IF(input!L47=\"\",\"\",input!L47)","v":""},"\"","","\", ",null,null,null,null,null,null,null,null,null,null,null,null,null,null,null,null,null,null,null,null,null,null,null,null,193,{"$f":"IF((Anzahl>AE197),AE197,Anzahl)","v":20},{"$error":"#N/A"},{"$f":"IF(OGW=\"\",#N/A,IF(B197<>\"\",OGW,#N/A))","v":{"$error":"#N/A"}},{"$f":"IF(UGW=\"\",#N/A,IF(B197<>\"\",UGW,#N/A))","v":{"$error":"#N/A"}},0.13549574423999999,0.47250425575999999,-3.3008511520000006E-2,0.64100851151999994,-0.20151276727999995,0.80951276727999999,0.30399999999999999,null,{"$f":"IF(AND(B197<>\"\",B197<UGW),1,0)","v":0},{"$f":"IF(AND(B197<>\"\",B197>OGW),1,0)","v":0},null,null,null,null,null,null,null,null,null,null,193,{"$f":"IF(B197=\"\",NA(),SMALL(xi,BF197))","v":{"$error":"#N/A"}},"",{"$f":"IF(B197=\"\",\"\",NORMSDIST((BE197-fxds)/Standardabweichung))","v":""},"",{"$f":"IF(IF(B197=\"\",\"\",SMALL(BG,BF197))=0,0.0001,IF(B197=\"\",\"\",SMALL(BG,BF197)))","v":""},"",{"$f":"IF(B197=\"\",NA(),NORMSINV((BF197-0.3)/(Anzahl+0.4)))","v":{"$error":"#N/A"}}]
[{"$f":"IF(B198=C198,0,1)","v":0},null,{"$f":"IF(input!L48=\"\",\"\",input!L48)","v":""},"\"",{"$f":"SUBSTITUTE(C198,\",\",\".\")","v":""},"\", ",null,null,null,null,null,null,null,null,null,null,null,null,null,null,null,null,null,null,null,null,null,null,null,null,194,20,{"$f":"IF(B198<>\"\",B198,#N/A)","v":{"$error":"#N/A"}},{"$error":"#N/A"},{"$error":"#N/A"},{"$f":"AJ197","v":0.13549574423999999},0.47250425575999999,-3.3008511520000006E-2,0.64100851151999994,-0.20151276727999995,0.80951276727999999,0.30399999999999999,null,0,0,null,null,null,null,null,null,null,null,null,null,194,{"$error":"#N/A"},"","",{"$f":"IF(B198=\"\",\"\",1-BG198)","v":""},"",{"$f":"IF(B198=\"\",\"\",(2*BF198-1)*(LN(BI198)+LN(BG198)))","v":""},{"$error":"#N/A"}]
[0,null,{"$f":"IF(input!L49=\"\",\"\",input!L49)","v":""},"\"","","\", ",null,null,null,null,null,null,null,null,null,null,null,null,null,null,null,null,null,null,null,null,null,null,null,null,195,20,{"$error":"#N/A"},{"$error":"#N/A"},{"$error":"#N/A"},0.13549574423999999,0.47250425575999999,-3.3008511520000006E-2,0.64100851151999994,-0.20151276727999995,0.80951276727999999,0.30399999999999999,null,0,0,null,null,null,null,null,null,null,null,null,null,195,{"$error":"#N/A"},{"$f":"IF(B199=\"\",\"\",1+BF198)","v":""},"","","","",{"$error":"#N/A"}]
[0,null,{"$f":"IF(input!L50=\"\",\"\",input!L50)","v":""},"\"","","\", ",null,null,null,null,null,null,null,null,null,null,null,null,null,null,null,null,null,null,null,null,null,null,null,null,196,20,{"$error":"#N/A"},{"$error":"#N/A"},{"$error":"#N/A"},0.13549574423999999,0.47250425575999999,-3.3008511520000006E-2,0.64100851151999994,-0.20151276727999995,0.80951276727999999,0.30399999999999999,null,0,0,null,null,null,null,null,null,null,null,null,null,196,{"$error":"#N/A"},"","","","","",{"$error":"#N/A"}]
[0,null,{"$f":"IF(input!L51=\"\",\"\",input!L51)","v":""},"\"","","\", ",null,null,null,null,null,null,null,null,null,null,null,null,null,null,null,null,null,null,null,null,null,null,null,null,197,20,{"$error":"#N/A"},{"$error":"#N/A"},{"$error":"#N/A"},0.13549574423999999,0.47250425575999999,-3.3008511520000006E-2,0.64100851151999994,-0.20151276727999995,0.80951276727999999,0.30399999999999999,null,0,0,null,null,null,null,null,null,null,null,null,null,197,{"$error":"#N/A"},"","","","","",{"$error":"#N/A"}]
[0,null,{"$f":"IF(input!L52=\"\",\"\",input!L52)","v":""},"\"","","\", ",null,null,null,null,null,null,null,null,null,null,null,null,null,null,null,null,null,null,null,null,null,null,null,null,198,20,{"$error":"#N/A"},{"$error":"#N/A"},{"$error":"#N/A"},0.13549574423999999,0.47250425575999999,-3.3008511520000006E-2,0.64100851151999994,-0.20151276727999995,0.80951276727999999,0.30399999999999999,null,0,0,null,null,null,null,null,null,null,null,null,null,198,{"$error":"#N/A"},"","","","","",{"$error":"#N/A"}]
[0,null,{"$f":"IF(input!L53=\"\",\"\",input!L53)","v":""},"\"","","\", ",null,null,null,null,null,null,null,null,null,null,null,null,null,null,null,null,null,null,null,null,null,null,null,null,199,20,{"$error":"#N/A"},{"$error":"#N/A"},{"$error":"#N/A"},0.13549574423999999,0.47250425575999999,-3.3008511520000006E-2,0.64100851151999994,-0.20151276727999995,0.80951276727999999,0.30399999999999999,null,0,0,null,null,null,null,null,null,null,null,null,null,199,{"$error":"#N/A"},"","","","","",{"$error":"#N/A"}]
[0,null,{"$f":"IF(input!L54=\"\",\"\",input!L54)","v":""},"\"","","\"",null,null,null,null,null,null,null,null,null,null,null,null,null,null,null,null,null,null,null,null,null,null,null,null,200,20,{"$error":"#N/A"},{"$error":"#N/A"},{"$error":"#N/A"},0.13549574423999999,0.47250425575999999,-3.3008511520000006E-2,0.64100851151999994,-0.20151276727999995,0.80951276727999999,0.30399999999999999,null,0,0,null,null,null,null,null,null,null,null,null,null,200,{"$error":"#N/A"},"","","","","",{"$error":"#N/A"}]
[null,null,null,null,null,null,null,null,null,null,null,null,null,null,null,null,null,null,null,null,null,null,null,null,null,null,null,null,null,null,null,null,null,null,null,null,null,null,null,null,null,null,"Summe",{"$f":"SUM(AR5:AR204)","v":0},{"$f":"SUM(AS5:AS204)","v":0}]
[]
[]
[]
[]
[{"$f":"SUM(A2:A208)","v":0}]

{"sheet":"info_setup","index":3,"n_rows":16,"n_cols":3,"rows_kept":16,"cut":false,"hidden":false,"merged":[]}
[]
[null,{"$f":"language!BX1","v":"Gültige Lizenz erwerben"},"Schreiben Sie eine Mail an roland.schnurr@sixsigmablackbelt.de"]
[]
[null,{"$f":"language!BC1","v":"Sprache"}]
[null,{"$f":"language!BD1","v":"User -  Email"}]
[null,{"$f":"language!BE1","v":"User - key"}]
[]
[null,{"$f":"language!BF1","v":"Gültig bis"},{"$f":"calculation!I28","v":"00:00:00"}]
[null,{"$f":"language!BG1","v":"Notizen"},{"$f":"calculation!I29","v":" "}]
[null,{"$f":"language!BH1","v":""}]
[null,{"$f":"language!BI1","v":"Bemerkung"},{"$f":"calculation!H20","v":"ergebnisuservalidieren:user 0 mit cmk in datensatz nicht vorhanden"}]
[]
[null,{"$f":"language!BQ1","v":"Hilfe"},"https://www.sixsigmablackbelt.de/help-hilfe-cmk-excel/"]
[]
[null,{"$f":"language!BT1","v":"Kontakt"},"roland.schnurr@sixsigmablackbelt.de"]
[null,{"$f":"language!BU1","v":"homepage"},"www.sixsigmablackbelt.de"]

{"sheet":"language","index":4,"n_rows":15,"n_cols":76,"rows_kept":15,"cut":false,"hidden":false,"merged":[]}
[null,1,{"$f":"VLOOKUP($B$1,$B$4:$CL$15,2,FALSE)","v":"Prozess- und Maschinenfähigkeit"},{"$f":"VLOOKUP($B$1,$B$4:$CL$15,3,FALSE)","v":"Werte können geändert werden"},{"$f":"VLOOKUP($B$1,$B$4:$CL$15,4,FALSE)","v":"Werte werden berechnet (Blatt Berechnung)"},{"$f":"VLOOKUP($B$1,$B$4:$CL$15,5,FALSE)","v":"Artikel:"},{"$f":"VLOOKUP($B$1,$B$4:$CL$15,6,FALSE)","v":"Nummer:"},{"$f":"VLOOKUP($B$1,$B$4:$CL$15,7,FALSE)","v":"Zeichnung:"},{"$f":"VLOOKUP($B$1,$B$4:$CL$15,8,FALSE)","v":"Prüfer:"},{"$f":"VLOOKUP($B$1,$B$4:$CL$15,9,FALSE)","v":"Messmittel:"},{"$f":"VLOOKUP($B$1,$B$4:$CL$15,10,FALSE)","v":"Datum:"},{"$f":"VLOOKUP($B$1,$B$4:$CL$15,11,FALSE)","v":"Merkmal:"},{"$f":"VLOOKUP($B$1,$B$4:$CL$15,12,FALSE)","v":"Maßeinheit:"},{"$f":"VLOOKUP($B$1,$B$4:$CL$15,13,FALSE)","v":"Sollwert msoll ="},{"$f":"VLOOKUP($B$1,$B$4:$CL$15,14,FALSE)","v":"UGW"},{"$f":"VLOOKUP($B$1,$B$4:$CL$15,15,FALSE)","v":"OGW"},{"$f":"VLOOKUP($B$1,$B$4:$CL$15,16,FALSE)","v":"Anzahl Klassen Histogramm"},{"$f":"VLOOKUP($B$1,$B$4:$CL$15,17,FALSE)","v":"Cpk<"},{"$f":"VLOOKUP($B$1,$B$4:$CL$15,18,FALSE)","v":"Cpk"},{"$f":"VLOOKUP($B$1,$B$4:$CL$15,19,FALSE)","v":"Cpk>"},{"$f":"VLOOKUP($B$1,$B$4:$CL$15,20,FALSE)","v":"dazwischen"},{"$f":"VLOOKUP($B$1,$B$4:$CL$15,21,FALSE)","v":"Prozess nicht fähig"},{"$f":"VLOOKUP($B$1,$B$4:$CL$15,22,FALSE)","v":"Prozess bedingt fähig"},{"$f":"VLOOKUP($B$1,$B$4:$CL$15,23,FALSE)","v":"Prozess fähig"},{"$f":"VLOOKUP($B$1,$B$4:$CL$15,24,FALSE)","v":"Stichprobenumfang"},{"$f":"VLOOKUP($B$1,$B$4:$CL$15,25,FALSE)","v":"Mittelwert"},{"$f":"VLOOKUP($B$1,$B$4:$CL$15,26,FALSE)","v":"Standardabweichung"},{"$f":"VLOOKUP($B$1,$B$4:$CL$15,27,FALSE)","v":"Die Werte sind nach Andersson Darling Test"},{"$f":"VLOOKUP($B$1,$B$4:$CL$15,28,FALSE)","v":"normalverteilt"},{"$f":"VLOOKUP($B$1,$B$4:$CL$15,29,FALSE)","v":"nicht normalverteilt"},{"$f":"VLOOKUP($B$1,$B$4:$CL$15,30,FALSE)","v":0},{"$f":"VLOOKUP($B$1,$B$4:$CL$15,31,FALSE)","v":"OGW"},{"$f":"VLOOKUP($B$1,$B$4:$CL$15,32,FALSE)","v":"UGW"},{"$f":"VLOOKUP($B$1,$B$4:$CL$15,33,FALSE)","v":"Stichprobe chronologisch"},{"$f":"VLOOKUP($B$1,$B$4:$CL$15,34,FALSE)","v":"Histogramm"},{"$f":"VLOOKUP($B$1,$B$4:$CL$15,35,FALSE)","v":"Wahrscheinlichkeitsnetz"},{"$f":"VLOOKUP($B$1,$B$4:$CL$15,36,FALSE)","v":0},{"$f":"VLOOKUP($B$1,$B$4:$CL$15,37,FALSE)","v":"Cmu"},{"$f":"VLOOKUP($B$1,$B$4:$CL$15,38,FALSE)","v":"Cmo"},{"$f":"VLOOKUP($B$1,$B$4:$CL$15,39,FALSE)","v":"Cm"},{"$f":"VLOOKUP($B$1,$B$4:$CL$15,40,FALSE)","v":"Cmk"},{"$f":"VLOOKUP($B$1,$B$4:$CL$15,41,FALSE)","v":"Fähigkeits- kennwerte"},{"$f":"VLOOKUP($B$1,$B$4:$CL$15,42,FALSE)","v":"Bewertung cmk =>"},{"$f":"VLOOKUP($B$1,$B$4:$CL$15,43,FALSE)","v":"Median z"},{"$f":"VLOOKUP($B$1,$B$4:$CL$15,44,FALSE)","v":"Spannweite R"},{"$f":"VLOOKUP($B$1,$B$4:$CL$15,45,FALSE)","v":"Minimum"},{"$f":"VLOOKUP($B$1,$B$4:$CL$15,46,FALSE)","v":"Maximum"},{"$f":"VLOOKUP($B$1,$B$4:$CL$15,47,FALSE)","v":"Berechnete Leistung in ppm"},{"$f":"VLOOKUP($B$1,$B$4:$CL$15,48,FALSE)","v":"Über- schreitungs- anteil"},{"$f":"VLOOKUP($B$1,$B$4:$CL$15,49,FALSE)","v":"pUGW"},{"$f":"VLOOKUP($B$1,$B$4:$CL$15,50,FALSE)","v":"pOGW"},{"$f":"VLOOKUP($B$1,$B$4:$CL$15,51,FALSE)","v":"p"},{"$f":"VLOOKUP($B$1,$B$4:$CL$15,52,FALSE)","v":"Beobachtete Leistung in ppm"},{"$f":"VLOOKUP($B$1,$B$4:$CL$15,53,FALSE)","v":0},{"$f":"VLOOKUP($B$1,$B$4:$CL$15,54,FALSE)","v":"Sprache"},{"$f":"VLOOKUP($B$1,$B$4:$CL$15,55,FALSE)","v":"User -  Email"},{"$f":"VLOOKUP($B$1,$B$4:$CL$15,56,FALSE)","v":"User - key"},{"$f":"VLOOKUP($B$1,$B$4:$CL$15,57,FALSE)","v":"Gültig bis"},{"$f":"VLOOKUP($B$1,$B$4:$CL$15,58,FALSE)","v":"Notizen"},{"$f":"VLOOKUP($B$1,$B$4:$CL$15,59,FALSE)","v":""},{"$f":"VLOOKUP($B$1,$B$4:$CL$15,60,FALSE)","v":"Bemerkung"},{"$f":"VLOOKUP($B$1,$B$4:$CL$15,61,FALSE)","v":"Status: Die Werte im Arbeitsblatt sind kalkuliert"},{"$f":"VLOOKUP($B$1,$B$4:$CL$15,62,FALSE)","v":"Status: Sie haben Werte verändert. Zum Kalkulieren den untenstehenden Button drücken."},{"$f":"VLOOKUP($B$1,$B$4:$CL$15,63,FALSE)","v":"Ist Ihr Messwert einseitig begrenzt, so geben Sie nur den entsprechenden oberen oder unteren Grenzwert an. Bei einer einseitigen Grenze wird im industriellen Umfeld nur der Cmk berechnet."},{"$f":"VLOOKUP($B$1,$B$4:$CL$15,64,FALSE)","v":"u-Wert"},{"$f":"VLOOKUP($B$1,$B$4:$CL$15,65,FALSE)","v":"+ 3 Sigma"},{"$f":"VLOOKUP($B$1,$B$4:$CL$15,66,FALSE)","v":"- 3 Sigma"},{"$f":"VLOOKUP($B$1,$B$4:$CL$15,67,FALSE)","v":"Verteilung"},{"$f":"VLOOKUP($B$1,$B$4:$CL$15,68,FALSE)","v":"Hilfe"},{"$f":"VLOOKUP($B$1,$B$4:$CL$15,69,FALSE)","v":"Normalverteilung"},{"$f":"VLOOKUP($B$1,$B$4:$CL$15,70,FALSE)","v":"Betragsverteilung 1. Art"},{"$f":"VLOOKUP($B$1,$B$4:$CL$15,71,FALSE)","v":"Kontakt"},{"$f":"VLOOKUP($B$1,$B$4:$CL$15,72,FALSE)","v":"homepage"},{"$f":"VLOOKUP($B$1,$B$4:$CL$15,73,FALSE)","v":"Ohne valide Lizenz ist die Berechnung auf 20 Werte beschränkt - Mehr Info (z. Bsp. wie Sie eine Volllizenz erhalten können) unter dem Tabellenblatt 'info_setup' "},{"$f":"VLOOKUP($B$1,$B$4:$CL$15,74,FALSE)","v":"Lizenz nicht gültig - es werden maximal 20 Werte berechnet -Mehr Info (z. Bsp. wie Sie eine Volllizenz erhalten können) unter dem Tabellenblatt 'info_setup' "},{"$f":"VLOOKUP($B$1,$B$4:$CL$15,75,FALSE)","v":"Gültige Lizenz erwerben"}]
["Sprache","Beschreibung",1,2,3,4,5,6,7,8,9,10,11,12,13,14,15,16,17,18,19,20,21,22,23,24,25,26,27,28,29,30,31,32,33,34,35,36,37,38,39,40,41,42,43,44,45,46,47,48,49,50,51,52,53,54,55,56,57,58,59,61,62,63,63,64,65,66,67,68,69,70,71,72,73,74]
["Tabelle",null,"input","input","input","input","input","input","input","input","input","input","input","input","input","input","input","input","input","input","input","input","input","input","input","input","input","input","input","input","input","input","input","input","input","input","input","input","input","input","input","input","input","input","input","input","input","input","input","input","input","input","input",null,"language","language","language","language","language","language","language","input","input","input","input","input","input","input","info_setup","input","input","info_setup","info_setup","input","licence","licence"]
[null,"Zelle","O2","O4","O5","N7","N8","N9","N10","N11","N12","N13","N14","N15","N16","N17","N18","N19","N20","N21","O20","P19","P20","P21","N23","N24","N25","N26","P26","P26",null,"Diagramm","Diagramm","Diagramm","Diagramm","Diagramm",null,"O30","O31","O32","O33","N30","N34","N36","N37","N38","N39","N41","N42","O42","O43","O44","N46",null,"B4","B5","B6","B7","B8","B9","B10","AB2","AB2","R48","Diagramm","Diagramm","Diagramm","N22","Verteilung","Verteilung","Verteilung","B19","B20","msgbox","msgbox","msgbox"]
["deutsch",1,"Prozess- und Maschinenfähigkeit","Werte können geändert werden","Werte werden berechnet (Blatt Berechnung)","Artikel:","Nummer:","Zeichnung:","Prüfer:","Messmittel:","Datum:","Merkmal:","Maßeinheit:","Sollwert msoll =","UGW","OGW","Anzahl Klassen Histogramm","Cpk<","Cpk","Cpk>","dazwischen","Prozess nicht fähig","Prozess bedingt fähig","Prozess fähig","Stichprobenumfang","Mittelwert","Standardabweichung","Die Werte sind nach Andersson Darling Test","normalverteilt","nicht normalverteilt",null,"OGW","UGW","Stichprobe chronologisch","Histogramm","Wahrscheinlichkeitsnetz",null,"Cmu","Cmo","Cm","Cmk","Fähigkeits- kennwerte",{"$f":"\"Bewertung cmk =>\"","v":"Bewertung cmk =>"},"Median z","Spannweite R","Minimum","Maximum","Berechnete Leistung in ppm","Über- schreitungs- anteil","pUGW","pOGW","p","Beobachtete Leistung in ppm",null,"Sprache","User -  Email","User - key","Gültig bis","Notizen",{"$f":"\"\"","v":""},"Bemerkung","Status: Die Werte im Arbeitsblatt sind kalkuliert","Status: Sie haben Werte verändert. Zum Kalkulieren den untenstehenden Button drücken.","Ist Ihr Messwert einseitig begrenzt, so geben Sie nur den entsprechenden oberen oder unteren Grenzwert an. Bei einer einseitigen Grenze wird im industriellen Umfeld nur der Cmk berechnet.","u-Wert",{"$f":"\"+ 3 Sigma\"","v":"+ 3 Sigma"},{"$f":"\"- 3 Sigma\"","v":"- 3 Sigma"},"Verteilung","Hilfe","Normalverteilung","Betragsverteilung 1. Art","Kontakt","homepage","Ohne valide Lizenz ist die Berechnung auf 20 Werte beschränkt - Mehr Info (z. Bsp. wie Sie eine Volllizenz erhalten können) unter dem Tabellenblatt 'info_setup' ","Lizenz nicht gültig - es werden maximal 20 Werte berechnet -Mehr Info (z. Bsp. wie Sie eine Volllizenz erhalten können) unter dem Tabellenblatt 'info_setup' ","Gültige Lizenz erwerben"]
["english",2,"process and machine capability","value could be changed","value is calculated","part:","part number:","drawing:","inspector:","measuring dev:","date:","attribute:","measuring unit:","nominal value =","lower spec. limit LSL","upper spec. limit USL","number of classes histogram","Cpk<","Cpk","Cpk>","between","process not capable","process limited capable","process capable","sample size","mid","standard deviation s","values are according Andersson Darling test","normal distributed","not normal distributed",null,"USL","LSL","random sample chronological","histogram","probability plot",null,"Cpkl","Cpku","Cp","Cpk","probability values","evaluation Cpk =>","median","range","minimum","maximum","calculated performance","exceedance","pLSL","pUSL","p","observed performance in ppm",null,"language","user -  email","user - key","valid until","note",{"$f":"\"\"","v":""},"note","The values are calculated","Sie haben Werte verändert. Bitte kalkulieren","If your measured value is one-sided limited, enter only the corresponding upper or lower limit value. With a one-sided limit, in the industrial environment only the Cpk is calclulated","u-value",{"$f":"\"+ 3 sigma\"","v":"+ 3 sigma"},{"$f":"\"- 3 sigma\"","v":"- 3 sigma"},"distribution","help","normal distribution","truncated normal distribution","contact","homepage","Without a valid licence, the calculation is limited to 20 values - More information (e.g. how to get a full licence) in the spreadsheet 'info_setup'. ","Licence not valid, the calculation is limited to 20 values - More information (e.g. how to get a full licence) in the spreadsheet 'info_setup'. ","buy the full licence"]
["italiano",3,"Capacità di processo e macchina","Valore modificabile","Valore calcolato","Articolo:","Codice:","Disegno","Ispettore","Strumento","Data","Attributo:","Unità di misura","Valore nominale =","Limite inferiore di specifica LSM","Limite superiore di specifica LSS","Numero di classi dell'istogramma","Cpk<","Cpk","Cpk>","tra","Processo non capace","Processo capace in modo limitatato","Processo capace","Dimensione del campione","media","Deviazione standard s","Valori in accorso al test Andersson Darling ","Distribuzione normale","Distribuzione non normale",null,"USL","LSL","Campione casuale cronologico","Istogramma","Grafico delle probabilità",null,"Cpkl","Cpku","Cp","Cpk","Valori di probabilità","Vautazione Cpk =>","Media","Range","Minimo","Massimo","Performance calcolata","Eccedenza","pLSL","pUSL","p","Prestazione osservata in ppm",null,"d","user -  Email","user - key","valid until","note",{"$f":"\"\"","v":""},"note","Ihre aktuellen Werte sind kalkuliert","Sie haben Werte verändert. Bitte kalkulieren","Se il valore misurato è limitato da un lato, inserire solo il valore limite superiore o inferiore corrispondente. Se il limite è unilaterale, nell'ambiente industriale viene calcolato solo il Cpk.",null,{"$f":"\"+ 3 sigma\"","v":"+ 3 sigma"},{"$f":"\"- 3 sigma\"","v":"- 3 sigma"},"distribuzione","distribuzione","distribuzione normale","distribuzione normale troncata","NN","NN","Senza una licenza valida, il calcolo è limitato a 20 valori - Ulteriori informazioni (ad esempio su come ottenere una licenza completa) nel foglio di calcolo \"info_setup\". ","licenz non valida, il calcolo è limitato a 20 valori - Ulteriori informazioni (ad esempio su come ottenere una licenza completa) nel foglio di calcolo \"info_setup\". ","Acquistare la licenza completa"]
["espanol",4,"NN2","NN2","NN2","NN2","NN2","NN2","NN2","NN2","NN2","NN2","NN2","NN2","NN2","NN2","NN2","NN2","NN2","NN2","NN2","NN2","NN2","NN2","NN2","NN2","NN2","NN2","NN2","NN2","NN2","NN2","NN2","NN2","NN2","NN2","NN2","NN2","NN2","NN2","NN2","NN2","NN2","NN2","NN2","NN2","NN2","NN2","NN2","NN2","NN2","NN2","NN2","NN2","NN2","NN2","NN2","NN2","NN2","NN2","NN2","NN2","NN2","NN2","NN2","NN2","NN2","NN2","NN2","NN2","NN2","NN2","NN2","NN2","NN2","NN2"]
["francais",5,"NN3","NN3","NN3","NN3","NN3","NN3","NN3","NN3","NN3","NN3","NN3","NN3","NN3","NN3","NN3","NN3","NN3","NN3","NN3","NN3","NN3","NN3","NN3","NN3","NN3","NN3","NN3","NN3","NN3","NN3","NN3","NN3","NN3","NN3","NN3","NN3","NN3","NN3","NN3","NN3","NN3","NN3","NN3","NN3","NN3","NN3","NN3","NN3","NN3","NN3","NN3","NN3","NN3","NN3","NN3","NN3","NN3","NN3","NN3","NN3","NN3","NN3","NN3","NN3","NN3","NN3","NN3","NN3","NN3","NN3","NN3","NN3","NN3","NN3"]
["portugues",6,"NN4","NN4","NN4","NN4","NN4","NN4","NN4","NN4","NN4","NN4","NN4","NN4","NN4","NN4","NN4","NN4","NN4","NN4","NN4","NN4","NN4","NN4","NN4","NN4","NN4","NN4","NN4","NN4","NN4","NN4","NN4","NN4","NN4","NN4","NN4","NN4","NN4","NN4","NN4","NN4","NN4","NN4","NN4","NN4","NN4","NN4","NN4","NN4","NN4","NN4","NN4","NN4","NN4","NN4","NN4","NN4","NN4","NN4","NN4","NN4","NN4","NN4","NN4","NN4","NN4","NN4","NN4","NN4","NN4","NN4","NN4","NN4","NN4","NN4"]
["mandarin",7,"NN5","NN5","NN5","NN5","NN5","NN5","NN5","NN5","NN5","NN5","NN5","NN5","NN5","NN5","NN5","NN5","NN5","NN5","NN5","NN5","NN5","NN5","NN5","NN5","NN5","NN5","NN5","NN5","NN5","NN5","NN5","NN5","NN5","NN5","NN5","NN5","NN5","NN5","NN5","NN5","NN5","NN5","NN5","NN5","NN5","NN5","NN5","NN5","NN5","NN5","NN5","NN5","NN5","NN5","NN5","NN5","NN5","NN5","NN5","NN5","NN5","NN5","NN5","NN5","NN5","NN5","NN5","NN5","NN5","NN5","NN5","NN5","NN5","NN5"]
["hindi",8,"NN6","NN6","NN6","NN6","NN6","NN6","NN6","NN6","NN6","NN6","NN6","NN6","NN6","NN6","NN6","NN6","NN6","NN6","NN6","NN6","NN6","NN6","NN6","NN6","NN6","NN6","NN6","NN6","NN6","NN6","NN6","NN6","NN6","NN6","NN6","NN6","NN6","NN6","NN6","NN6","NN6","NN6","NN6","NN6","NN6","NN6","NN6","NN6","NN6","NN6","NN6","NN6","NN6","NN6","NN6","NN6","NN6","NN6","NN6","NN6","NN6","NN6","NN6","NN6","NN6","NN6","NN6","NN6","NN6","NN6","NN6","NN6","NN6","NN6"]
["arabe",9,"NN7","NN7","NN7","NN7","NN7","NN7","NN7","NN7","NN7","NN7","NN7","NN7","NN7","NN7","NN7","NN7","NN7","NN7","NN7","NN7","NN7","NN7","NN7","NN7","NN7","NN7","NN7","NN7","NN7","NN7","NN7","NN7","NN7","NN7","NN7","NN7","NN7","NN7","NN7","NN7","NN7","NN7","NN7","NN7","NN7","NN7","NN7","NN7","NN7","NN7","NN7","NN7","NN7","NN7","NN7","NN7","NN7","NN7","NN7","NN7","NN7","NN7","NN7","NN7","NN7","NN7","NN7","NN7","NN7","NN7","NN7","NN7","NN7","NN7"]
["NN8",10,"NN8","NN8","NN8","NN8","NN8","NN8","NN8","NN8","NN8","NN8","NN8","NN8","NN8","NN8","NN8","NN8","NN8","NN8","NN8","NN8","NN8","NN8","NN8","NN8","NN8","NN8","NN8","NN8","NN8","NN8","NN8","NN8","NN8","NN8","NN8","NN8","NN8","NN8","NN8","NN8","NN8","NN8","NN8","NN8","NN8","NN8","NN8","NN8","NN8","NN8","NN8","NN8","NN8","NN8","NN8","NN8","NN8","NN8","NN8","NN8","NN8","NN8","NN8","NN8","NN8","NN8","NN8","NN8","NN8","NN8","NN8","NN8","NN8","NN8"]
["NN9",11,"NN9","NN9","NN9","NN9","NN9","NN9","NN9","NN9","NN9","NN9","NN9","NN9","NN9","NN9","NN9","NN9","NN9","NN9","NN9","NN9","NN9","NN9","NN9","NN9","NN9","NN9","NN9","NN9","NN9","NN9","NN9","NN9","NN9","NN9","NN9","NN9","NN9","NN9","NN9","NN9","NN9","NN9","NN9","NN9","NN9","NN9","NN9","NN9","NN9","NN9","NN9","NN9","NN9","NN9","NN9","NN9","NN9","NN9","NN9","NN9","NN9","NN9","NN9","NN9","NN9","NN9","NN9","NN9","NN9","NN9","NN9","NN9","NN9","NN9"]