{"text_format":"1","workbook":"xlsx","n_sheets":6,"sheets":["input","calculation","image","info_setup","Minitab","Muster example"],"not_rendered":{"charts":3,"images":5,"macros":1,"external_links":0,"defined_names":38,"comments":0,"pivot_tables":0},"unopened":[],"bounds":{"document_bytes":16777216,"sheet_cells":100000,"rows_first":2000,"rows_last":500,"rows_between":2000,"halvings":0,"cell_chars":16384,"cell_head_chars":4096},"cells_cut":0,"cells_raw":0,"read":"whole","date_system":"1900"}

{"sheet":"input","index":0,"n_rows":54,"n_cols":14,"rows_kept":54,"cut":false,"hidden":false,"merged":[[42,1,42,8],[41,1,41,8],[43,1,43,8],[44,1,44,8],[45,1,45,8],[37,1,37,4],[34,1,34,4],[35,1,35,4],[36,1,36,4],[38,1,38,4],[13,8,13,9],[14,8,14,9],[14,1,14,2],[13,1,13,2],[16,6,16,7],[16,9,16,10],[33,1,33,4],[13,4,13,6],[12,4,12,6],[11,4,11,6],[14,4,14,6],[11,1,11,3],[31,1,31,4],[16,3,16,4],[32,1,32,4],[3,9,3,10],[4,9,4,10],[12,8,12,9],[8,2,8,3],[3,5,3,6],[4,5,4,6],[5,5,5,6],[6,5,6,6],[3,2,3,3],[4,2,4,3],[5,2,5,3],[6,2,6,3],[7,2,7,3],[11,8,11,10],[1,1,1,3],[1,8,1,10],[2,1,2,3],[2,4,2,7],[2,8,2,10],[1,4,1,7]]}
[]
[null,null,null,null,"Messprozessanaylse \nVerfahren 2 Anova (Basis Bosch Heft 10)",null,null,null,null,null,null,null,null,{"$f":"IF(calculation!AF29=1,\"Werte wurden geändert, bitte neu berechnen über blauen Button\",\"Werte sind aktuell\")","v":"Werte sind aktuell"}]
[null,"Messmittel",null,null,"Merkmal",null,null,null,"Normal"]
[null,"Bez.:",null,null,"Objekt:",null,null,null,"Be.:"]
[null,"Nummer:",null,null,"Nummer:",null,null,null,"Nummer"]
[null,"Auflösung:",null,null,"Zeichnungsnr.",null,null,null,"Nennmaß:"]
[null,"Auflösung:",null,null,"Einheit:",null,null,null,"Einheit:"]
[null,"Akt. Dat.: ","2015-01-04",null,"OGW",4]
[null,"Bearbeiter:",null,null,"UGW",-4,"Toleranz:",{"$f":"F8-F9","v":8}]
[null,"Prüferverfahren Beschreibung:"]
[]
[null,"Ergebnis aus MSA Verfahren 1",null,null,"Anzahl der Teile n",null,null,{"$f":"COUNT(C19:C28)","v":10},"Messsystem ist "]
[null,null,null,null,"Anzahl der Prüfer k",null,null,{"$f":"COUNT(C19)+COUNT(F19)+COUNT(I19)","v":3},"fähig bis",null,0.1]
[null,"Protokoll Nr.",null,null,"Anz. Prüfungen je Prüfer / Objekt r",null,null,{"$f":"COUNT(C19:E19)","v":3},"akzeptabel bis",null,0.3]
[null,"Das Prüfmittel ",null,"ist fähig","Bedingung k*n*r > 30",null,null,{"$f":"IF((AnzahlTeile*AnzahlPruefer*AnzahlMessungen)>=30,\"erfüllt\",\"nicht erfüllt\")","v":"erfüllt"},"nicht akzeptabel ab",null,{"$f":"K14","v":0.3}]
[]
[null,null,"Prüfer j=1","Maier",null,"Prüfer j=2","Müller",null," Prüfer j=3","Schulze"]
[null,"Teil Nr.","m1","m2","m3","m1","m2","m3","m1","m2","m3"]
[null,"i1",0.28999999999999998,0.41,0.64,0.08,0.25,7.0000000000000007E-2,0.04,-0.11,-0.15]
[null,"i2",-0.56000000000000005,-0.68,-0.57999999999999996,-0.47,-1.22,-0.68,-1.38,-1.1299999999999999,-0.96]
[null,"i3",1.34,1.17,1.27,1.19,0.94,1.34,0.88,1.0900000000000001,0.67]
[null,"i4",0.47,0.5,0.64,0.01,1.03,0.2,0.14000000000000001,0.2,0.11]
[null,"i5",-0.8,-0.92,-0.84,-0.56000000000000005,-1.2,-1.28,-1.46,-1.07,-1.45]
[null,"i6",0.02,-0.11,-0.21,-0.2,0.22,0.06,-0.28999999999999998,-0.67,-0.49]
[null,"i7",0.59,0.75,0.66,0.47,0.55000000000000004,0.83,0.02,0.01,0.21]
[null,"i8",-0.31,-0.2,-0.17,-0.63,0.08,-0.34,-0.46,-0.56000000000000005,-0.49]
[null,"i9",2.2599999999999998,1.99,2.0099999999999998,1.8,2.12,2.19,1.77,1.45,1.87]
[null,"i10",-1.36,-1.25,-1.31,-1.68,-1.62,-1.5,-1.49,-1.77,-2.16]
[]
[]
[null,null,null,null,null,null,"Standard- abweichung","Streubreite",null,"Anteil an \nGesamt-\nstreubreite","Anteil  der Toleranz"]
[null,"Einflussgrößen",null,null,null,null,"SD","SV",null,"%SV","%T"]
[null,"Teile (Part Variation) Teilestreuung",null,null,null,"PV",{"$f":"calculation!H33","v":1.0423274938},{"$f":"IF(G33=0,0,6*G33)","v":6.2539649627999996},"%PV",{"$f":"IF(H33=0,0,H33/$H$38)","v":0.96040533797572247},{"$f":"IF(H33=0,0,H33/$H$9)","v":0.78174562034999995}]
[null,"Prüfer (Appraiser Variation) Vergleichspräzision",null,null,null,"AV",{"$f":"calculation!H34","v":0.2268375215},{"$f":"IF(G34=0,0,6*G34)","v":1.3610251289999999},"%AV",{"$f":"IF(H34=0,0,H34/$H$38)","v":0.20900913369131999},{"$f":"IF(H34=0,0,H34/$H$9)","v":0.17012814112499999}]
[null,"Wechselwirkung (Interaction)",null,null,null,"INT",{"$f":"calculation!H35","v":0},0,"%IA",0,0]
[null,"Messeinrichtung (Equipment Variation)\nWiederholpräzision",null,null,null,"EV",{"$f":"calculation!H36","v":0.19993317971999999},1.1995990783199999,"%EV",0.18421934966093423,0.14994988478999999]
[null,"Prüfsystemstreuung",null,null,null,"GRR",{"$f":"calculation!H37","v":0.30237152231999997},1.8142291339199998,"%GRR",0.278606508813529,0.22677864173999998]
[null,"Gesamtstreuung (Total Variation)",null,null,null,"TV",{"$f":"calculation!H38","v":1.0852995632},6.5117973791999999,"%TV",1,0.81397467239999999]
[null,"Anzahl unterscheidbarer Klassen (min 5)",null,null,null,"ndc",{"$f":"calculation!H39","v":4}]
[]
[]
[null,{"$f":"IF(K37<K13,\"Das Messsystem ist fähig\",IF(K37>K14,\"Das Messsystem ist nicht fähig\",\"Das Messsystem ist bedingt fähig\"))","v":"Das Messsystem ist bedingt fähig"}]
[null,{"$f":"IF(G39<5,\"(ndc) Der Messprozess ist nicht in der Lage genügend viele Teile unterscheidbar zu messen\",\"(ndc) Der Messprozess ist  in der Lage genügend viele Teile unterscheidbar zu messen\")","v":"(ndc) Der Messprozess ist nicht in der Lage genügend viele Teile unterscheidbar zu messen"}]
[null,{"$f":"IF(G34=0,\"Der Einfluss durch den Prüfer ist nicht signifikant\",\"Der Einfluss durch den Prüfer ist  signifikant\")","v":"Der Einfluss durch den Prüfer ist  signifikant"}]
[null,{"$f":"IF(G33=0,\"Der Einfluss durch die einzelnen Teile ist nicht signifikant\",\"Der Einfluss durch die einzelnen Teile ist signifikant\")","v":"Der Einfluss durch die einzelnen Teile ist signifikant"}]
[null,{"$f":"IF(G35=0,\"Der Einfluss durch die Wechselwirkung Prüfer und Teil ist nicht signifikant\",\"Der Einfluss durch die Wechselwirkung Prüfer und Teil ist  signifikant\")","v":"Der Einfluss durch die Wechselwirkung Prüfer und Teil ist nicht signifikant"}]
[]
[]
[]
[]
[null,null,null,null,null,null,null,null,null,null,{"$f":"0","v":0}]
[null,null,null,null,null,null,null,null,null,null,{"$f":"K51+K13","v":0.1}]
[null,null,null,null,null,null,null,null,null,null,{"$f":"K14-K13","v":0.19999999999999998}]
[null,null,null,null,null,null,null,null,null,null,100]

{"sheet":"calculation","index":1,"n_rows":139,"n_cols":32,"rows_kept":139,"cut":false,"hidden":true,"merged":[[51,16,51,23],[16,3,16,4],[16,6,16,7],[16,9,16,10],[34,1,34,4],[35,1,35,4],[36,1,36,4],[37,1,37,4],[31,1,31,4],[32,1,32,4],[33,1,33,4],[38,1,38,4]]}
[]
[]
[]
[]
[]
[]
[]
[null,null,null,null,"OGW",{"$f":"input!F8","v":4},null,null,null,null,null,null,null,null,null,4,null,null,null,null,null,null,null,null,null,{"$f":"IF(P8=F8,0,1)","v":0}]
[null,null,null,null,"UGW",{"$f":"input!F9","v":-4},null,null,null,null,null,null,null,null,null,-4,null,null,null,null,null,null,null,null,null,0]
[]
[]
[]
[]
[]
[]
[]
[null,null,"Prüfer j=1",{"$f":"input!D17","v":"Maier"},null,"Prüfer j=2",{"$f":"input!G17","v":"Müller"},null," Prüfer j=3",{"$f":"IF(input!J17=\"\",\"\",input!J17)","v":"Schulze"}]
[null,"Teil Nr.",{"$f":"input!C18","v":"m1"},{"$f":"input!D18","v":"m2"},{"$f":"input!E18","v":"m3"},{"$f":"input!F18","v":"m1"},{"$f":"input!G18","v":"m2"},{"$f":"input!H18","v":"m3"},{"$f":"input!I18","v":"m1"},{"$f":"input!J18","v":"m2"},{"$f":"input!K18","v":"m3"}]
[null,{"$f":"input!B19","v":"i1"},{"$f":"IF(input!C19=\"\",\"\",input!C19)","v":0.28999999999999998},{"$f":"IF(input!D19=\"\",\"\",input!D19)","v":0.41},{"$f":"IF(input!E19=\"\",\"\",input!E19)","v":0.64},{"$f":"IF(input!F19=\"\",\"\",input!F19)","v":0.08},{"$f":"IF(input!G19=\"\",\"\",input!G19)","v":0.25},{"$f":"IF(input!H19=\"\",\"\",input!H19)","v":7.0000000000000007E-2},{"$f":"IF(input!I19=\"\",\"\",input!I19)","v":0.04},{"$f":"IF(input!J19=\"\",\"\",input!J19)","v":-0.11},{"$f":"IF(input!K19=\"\",\"\",input!K19)","v":-0.15},null,0.28999999999999998,0.41,0.64,0.08,0.25,7.0000000000000007E-2,0.04,-0.11,-0.15,null,{"$f":"IF(M19=C19,0,1)","v":0},{"$f":"IF(N19=D19,0,1)","v":0},0,0,0,0,0,0,0]
[null,{"$f":"input!B20","v":"i2"},{"$f":"IF(input!C20=\"\",\"\",input!C20)","v":-0.56000000000000005},{"$f":"IF(input!D20=\"\",\"\",input!D20)","v":-0.68},{"$f":"IF(input!E20=\"\",\"\",input!E20)","v":-0.57999999999999996},{"$f":"IF(input!F20=\"\",\"\",input!F20)","v":-0.47},{"$f":"IF(input!G20=\"\",\"\",input!G20)","v":-1.22},{"$f":"IF(input!H20=\"\",\"\",input!H20)","v":-0.68},{"$f":"IF(input!I20=\"\",\"\",input!I20)","v":-1.38},{"$f":"IF(input!J20=\"\",\"\",input!J20)","v":-1.1299999999999999},{"$f":"IF(input!K20=\"\",\"\",input!K20)","v":-0.96},null,-0.56000000000000005,-0.68,-0.57999999999999996,-0.47,-1.22,-0.68,-1.38,-1.1299999999999999,-0.96,null,{"$f":"IF(M20=C20,0,1)","v":0},{"$f":"IF(N20=D20,0,1)","v":0},{"$f":"IF(O20=E20,0,1)","v":0},{"$f":"IF(P20=F20,0,1)","v":0},{"$f":"IF(Q20=G20,0,1)","v":0},{"$f":"IF(R20=H20,0,1)","v":0},{"$f":"IF(S20=I20,0,1)","v":0},{"$f":"IF(T20=J20,0,1)","v":0},{"$f":"IF(U20=K20,0,1)","v":0}]
[null,{"$f":"input!B21","v":"i3"},{"$f":"IF(input!C21=\"\",\"\",input!C21)","v":1.34},{"$f":"IF(input!D21=\"\",\"\",input!D21)","v":1.17},{"$f":"IF(input!E21=\"\",\"\",input!E21)","v":1.27},{"$f":"IF(input!F21=\"\",\"\",input!F21)","v":1.19},{"$f":"IF(input!G21=\"\",\"\",input!G21)","v":0.94},{"$f":"IF(input!H21=\"\",\"\",input!H21)","v":1.34},{"$f":"IF(input!I21=\"\",\"\",input!I21)","v":0.88},{"$f":"IF(input!J21=\"\",\"\",input!J21)","v":1.0900000000000001},{"$f":"IF(input!K21=\"\",\"\",input!K21)","v":0.67},null,1.34,1.17,1.27,1.19,0.94,1.34,0.88,1.0900000000000001,0.67,null,0,0,0,0,0,0,0,0,0]
[null,{"$f":"input!B22","v":"i4"},{"$f":"IF(input!C22=\"\",\"\",input!C22)","v":0.47},{"$f":"IF(input!D22=\"\",\"\",input!D22)","v":0.5},{"$f":"IF(input!E22=\"\",\"\",input!E22)","v":0.64},{"$f":"IF(input!F22=\"\",\"\",input!F22)","v":0.01},{"$f":"IF(input!G22=\"\",\"\",input!G22)","v":1.03},{"$f":"IF(input!H22=\"\",\"\",input!H22)","v":0.2},{"$f":"IF(input!I22=\"\",\"\",input!I22)","v":0.14000000000000001},{"$f":"IF(input!J22=\"\",\"\",input!J22)","v":0.2},{"$f":"IF(input!K22=\"\",\"\",input!K22)","v":0.11},null,0.47,0.5,0.64,0.01,1.03,0.2,0.14000000000000001,0.2,0.11,null,0,0,0,0,0,0,0,0,0]
[null,{"$f":"input!B23","v":"i5"},{"$f":"IF(input!C23=\"\",\"\",input!C23)","v":-0.8},{"$f":"IF(input!D23=\"\",\"\",input!D23)","v":-0.92},{"$f":"IF(input!E23=\"\",\"\",input!E23)","v":-0.84},{"$f":"IF(input!F23=\"\",\"\",input!F23)","v":-0.56000000000000005},{"$f":"IF(input!G23=\"\",\"\",input!G23)","v":-1.2},{"$f":"IF(input!H23=\"\",\"\",input!H23)","v":-1.28},{"$f":"IF(input!I23=\"\",\"\",input!I23)","v":-1.46},{"$f":"IF(input!J23=\"\",\"\",input!J23)","v":-1.07},{"$f":"IF(input!K23=\"\",\"\",input!K23)","v":-1.45},null,-0.8,-0.92,-0.84,-0.56000000000000005,-1.2,-1.28,-1.46,-1.07,-1.45,null,0,0,0,0,0,0,0,0,0]
[null,{"$f":"input!B24","v":"i6"},{"$f":"IF(input!C24=\"\",\"\",input!C24)","v":0.02},{"$f":"IF(input!D24=\"\",\"\",input!D24)","v":-0.11},{"$f":"IF(input!E24=\"\",\"\",input!E24)","v":-0.21},{"$f":"IF(input!F24=\"\",\"\",input!F24)","v":-0.2},{"$f":"IF(input!G24=\"\",\"\",input!G24)","v":0.22},{"$f":"IF(input!H24=\"\",\"\",input!H24)","v":0.06},{"$f":"IF(input!I24=\"\",\"\",input!I24)","v":-0.28999999999999998},{"$f":"IF(input!J24=\"\",\"\",input!J24)","v":-0.67},{"$f":"IF(input!K24=\"\",\"\",input!K24)","v":-0.49},null,0.02,-0.11,-0.21,-0.2,0.22,0.06,-0.28999999999999998,-0.67,-0.49,null,0,0,0,0,0,0,0,0,0]
[null,{"$f":"input!B25","v":"i7"},{"$f":"IF(input!C25=\"\",\"\",input!C25)","v":0.59},{"$f":"IF(input!D25=\"\",\"\",input!D25)","v":0.75},{"$f":"IF(input!E25=\"\",\"\",input!E25)","v":0.66},{"$f":"IF(input!F25=\"\",\"\",input!F25)","v":0.47},{"$f":"IF(input!G25=\"\",\"\",input!G25)","v":0.55000000000000004},{"$f":"IF(input!H25=\"\",\"\",input!H25)","v":0.83},{"$f":"IF(input!I25=\"\",\"\",input!I25)","v":0.02},{"$f":"IF(input!J25=\"\",\"\",input!J25)","v":0.01},{"$f":"IF(input!K25=\"\",\"\",input!K25)","v":0.21},null,0.59,0.75,0.66,0.47,0.55000000000000004,0.83,0.02,0.01,0.21,null,0,0,0,0,0,0,0,0,0]
[null,{"$f":"input!B26","v":"i8"},{"$f":"IF(input!C26=\"\",\"\",input!C26)","v":-0.31},{"$f":"IF(input!D26=\"\",\"\",input!D26)","v":-0.2},{"$f":"IF(input!E26=\"\",\"\",input!E26)","v":-0.17},{"$f":"IF(input!F26=\"\",\"\",input!F26)","v":-0.63},{"$f":"IF(input!G26=\"\",\"\",input!G26)","v":0.08},{"$f":"IF(input!H26=\"\",\"\",input!H26)","v":-0.34},{"$f":"IF(input!I26=\"\",\"\",input!I26)","v":-0.46},{"$f":"IF(input!J26=\"\",\"\",input!J26)","v":-0.56000000000000005},{"$f":"IF(input!K26=\"\",\"\",input!K26)","v":-0.49},null,-0.31,-0.2,-0.17,-0.63,0.08,-0.34,-0.46,-0.56000000000000005,-0.49,null,0,0,0,0,0,0,0,0,0]
[null,{"$f":"input!B27","v":"i9"},{"$f":"IF(input!C27=\"\",\"\",input!C27)","v":2.2599999999999998},{"$f":"IF(input!D27=\"\",\"\",input!D27)","v":1.99},{"$f":"IF(input!E27=\"\",\"\",input!E27)","v":2.0099999999999998},{"$f":"IF(input!F27=\"\",\"\",input!F27)","v":1.8},{"$f":"IF(input!G27=\"\",\"\",input!G27)","v":2.12},{"$f":"IF(input!H27=\"\",\"\",input!H27)","v":2.19},{"$f":"IF(input!I27=\"\",\"\",input!I27)","v":1.77},{"$f":"IF(input!J27=\"\",\"\",input!J27)","v":1.45},{"$f":"IF(input!K27=\"\",\"\",input!K27)","v":1.87},null,2.2599999999999998,1.99,2.0099999999999998,1.8,2.12,2.19,1.77,1.45,1.87,null,0,0,0,0,0,0,0,0,0]
[null,{"$f":"input!B28","v":"i10"},{"$f":"IF(input!C28=\"\",\"\",input!C28)","v":-1.36},{"$f":"IF(input!D28=\"\",\"\",input!D28)","v":-1.25},{"$f":"IF(input!E28=\"\",\"\",input!E28)","v":-1.31},{"$f":"IF(input!F28=\"\",\"\",input!F28)","v":-1.68},{"$f":"IF(input!G28=\"\",\"\",input!G28)","v":-1.62},{"$f":"IF(input!H28=\"\",\"\",input!H28)","v":-1.5},{"$f":"IF(input!I28=\"\",\"\",input!I28)","v":-1.49},{"$f":"IF(input!J28=\"\",\"\",input!J28)","v":-1.77},{"$f":"IF(input!K28=\"\",\"\",input!K28)","v":-2.16},null,-1.36,-1.25,-1.31,-1.68,-1.62,-1.5,-1.49,-1.77,-2.16,null,0,0,0,0,0,0,0,0,0]
[null,null,null,null,null,null,null,null,null,null,null,null,null,null,null,null,null,null,null,null,null,null,null,null,null,null,null,null,null,null,"Summe",{"$f":"SUM(W8:AE28)","v":0}]
[]
[null,null,null,null,null,null,"Standard- abweichung"]
[null,"Einflussgrößen",null,null,null,null,"SD"]
[null,"Teile (Part Variation) Teilestreuung",null,null,null,"PV",{"$f":"IF($Z$41=0,AD48,AD39)","v":0},1.0423274938,null,{"$f":"Q61","v":0}]
[null,"Prüfer (Appraiser Variation) Vergleichspräzision",null,null,null,"AV",{"$f":"IF($Z$41=0,AD49,AD40)","v":0},0.2268375215,null,{"$f":"Q59","v":0}]
[null,"Wechselwirkung (Interaction)",null,null,null,"INT",{"$f":"IF($Z$41=0,0,AD41)","v":0},0,null,{"$f":"IF(Q59=Q60,0,Q60)","v":0}]
[null,"Messeinrichtung (Equipment Variation)\nWiederholpräzision",null,null,null,"EV",{"$f":"IF($Z$41=0,AD51,AD42)","v":0},0.19993317971999999,null,{"$f":"Q58","v":0}]
[null,"Prüfsystemstreuung",null,null,null,"GRR",{"$f":"IF($Z$41=0,AD52,AD43)","v":0},0.30237152231999997,null,{"$f":"Q57","v":0}]
[null,"Gesamtstreuung (Total Variation)",null,null,null,"TV",{"$f":"IF($Z$41=0,AD53,AD44)","v":0},1.0852995632,null,{"$f":"Q62","v":0}]
[null,"Anzahl unterscheidbarer Klassen (min 5)",null,null,null,"ndc",null,4,null,{"$f":"Q63","v":0}]
[]
[]
[]
[]
[null,null,null,null,null,null,null,null,null,null,null,null,null,null,"[\"{\\\"ergebnisuservalidieren\\\":[\\\"user xx@sixsigmablackbelt.de mit msa2 in datensatz nicht vorhanden\\\"],\\\"ergebnisuservalidieren_status\\\":[\\\"nein\\\"],\\\"Lizenzdatum\\\":[\\\"\\\"],\\\"Notiz\\\":[\\\" \\\"],\\\"MSA2_1\\\":[0],\\\"MSA2_2\\\":[0],\\\"MSA2_3\\\":[0],\\\"MSA2_4\\\":[0],\\\"MSA2_5\\\":[0],\\\"MSA2_6\\\":[0],\\\"MSA2_7\\\":[0]}\"]"]
[null,null,null,null,null,null,null,null,null,"userapiname",null,"userapikey",null,"verteilung",null,"\"OGW:",null,"\"UGW:"]
[null,null,null,null,null,null,null,null,"\"a\":[\"",{"$f":"info_setup!C5","v":"xx@sixsigmablackbelt.de"},"\",\"",{"$f":"info_setup!C6","v":"GFRDESX"},"\",\"","hans","\",\"",{"$f":"SUBSTITUTE(F8,\",\",\".\")","v":"4"},"\",\"",{"$f":"SUBSTITUTE(F9,\",\",\".\")","v":"-4"},"\",\"",{"$f":"input!D17","v":"Maier"},"\",\"",{"$f":"input!G17","v":"Müller"},"\",\"",{"$f":"input!J17","v":"Schulze"},"\",\""]
[null,null,null,null,null,null,null,null,{"$f":"I46&J46&K46&L46&M46&N46&O46&P46&Q46&R46&S46&T46&U46&V46&W46&X46&Y46","v":"\"a\":[\"xx@sixsigmablackbelt.de\",\"GFRDESX\",\"hans\",\"4\",\"-4\",\"Maier\",\"Müller\",\"Schulze\",\""},null,null,null,null,null,null,null,null,null,null,null,null,null,null,null,null,null,null,"]"]
[]
[null,null,null,null,null,null,"Teile",null,"Prüfer",null,"Durchgang",null,"Werte"]
[null,null,null,null,null,1,{"$f":"B19","v":"i1"},"\",\"",{"$f":"D17","v":"Maier"},"\",\"",{"$f":"C18","v":"m1"},"\",\"",{"$f":"C19","v":0.28999999999999998},null,{"$f":"SUBSTITUTE(M50,\",\",\".\")","v":"0.29"},"\",\"",{"$f":"I47&T53&T83&T113","v":"\"a\":[\"xx@sixsigmablackbelt.de\",\"GFRDESX\",\"hans\",\"4\",\"-4\",\"Maier\",\"Müller\",\"Schulze\",\"0.29\",\"-0.56\",\"1.34\",\"0.47\",\"-0.8\",\"0.02\",\"0.59\",\"-0.31\",\"2.26\",\"-1.36\",\"0.41\",\"-0.68\",\"1.17\",\"0.5\",\"-0.92\",\"-0.11\",\"0.75\",\"-0.2\",\"1.99\",\"-1.25\",\"0.64\",\"-0.58\",\"1.27\",\"0.64\",\"-0.84\",\"-0.21\",\"0.66\",\"-0.17\",\"2.01\",\"-1.31\",\"0.08\",\"-0.47\",\"1.19\",\"0.01\",\"-0.56\",\"-0.2\",\"0.47\",\"-0.63\",\"1.8\",\"-1.68\",\"0.25\",\"-1.22\",\"0.94\",\"1.03\",\"-1.2\",\"0.22\",\"0.55\",\"0.08\",\"2.12\",\"-1.62\",\"0.07\",\"-0.68\",\"1.34\",\"0.2\",\"-1.28\",\"0.06\",\"0.83\",\"-0.34\",\"2.19\",\"-1.5\",\"0.04\",\"-1.38\",\"0.88\",\"0.14\",\"-1.46\",\"-0.29\",\"0.02\",\"-0.46\",\"1.77\",\"-1.49\",\"-0.11\",\"-1.13\",\"1.09\",\"0.2\",\"-1.07\",\"-0.67\",\"0.01\",\"-0.56\",\"1.45\",\"-1.77\",\"-0.15\",\"-0.96\",\"0.67\",\"0.11\",\"-1.45\",\"-0.49\",\"0.21\",\"-0.49\",\"1.87\",\"-2.16\"]"}]
[null,null,null,null,null,2,"i2","\",\"",{"$f":"I50","v":"Maier"},"\",\"",{"$f":"K50","v":"m1"},"\",\"",-0.56000000000000005,null,{"$f":"SUBSTITUTE(M51,\",\",\".\")","v":"-0.56"},"\",\""]
[null,null,null,null,null,3,"i3","\",\"",{"$f":"I51","v":"Maier"},"\",\"",{"$f":"K51","v":"m1"},"\",\"",1.34,null,"1.34","\",\""]
[null,null,null,null,null,4,"i4","\",\"","Maier","\",\"",{"$f":"K52","v":"m1"},"\",\"",0.47,null,"0.47","\",\"","ergebnisuservalidieren:user xx@sixsigmablackbelt.de mit msa2 in datensatz nicht vorhanden",null,null,{"$f":"O50&P50&O51&P51&O52&P52&O53&P53&O54&P54&O55&P55&O56&P56&O57&P57&O58&P58&O59&P59&O60&P60&O61&P61&O62&P62&O63&P63&O64&P64&O65&P65&O66&P66&O67&P67&O68&P68&O69&P69&O70&P70&O71&P71&O72&P72&O73&P73&O74&P74&O75&P75&O76&P76&O77&P77&O78&P78&O79&P79","v":"0.29\",\"-0.56\",\"1.34\",\"0.47\",\"-0.8\",\"0.02\",\"0.59\",\"-0.31\",\"2.26\",\"-1.36\",\"0.41\",\"-0.68\",\"1.17\",\"0.5\",\"-0.92\",\"-0.11\",\"0.75\",\"-0.2\",\"1.99\",\"-1.25\",\"0.64\",\"-0.58\",\"1.27\",\"0.64\",\"-0.84\",\"-0.21\",\"0.66\",\"-0.17\",\"2.01\",\"-1.31\",\""}]
[null,null,null,null,null,5,"i5","\",\"","Maier","\",\"","m1","\",\"",-0.8,null,"-0.8","\",\"","nein"]
[null,null,null,null,null,6,"i6","\",\"","Maier","\",\"","m1","\",\"",0.02,null,"0.02","\",\""]
[null,null,null,null,null,7,"i7","\",\"","Maier","\",\"","m1","\",\"",0.59,null,"0.59","\",\""," "]
[null,null,null,null,null,8,"i8","\",\"","Maier","\",\"","m1","\",\"",-0.31,null,"-0.31","\",\"",0]
[null,null,null,null,null,9,"i9","\",\"","Maier","\",\"","m1","\",\"",2.2599999999999998,null,"2.26","\",\"",0]
[null,null,null,null,null,10,"i10","\",\"","Maier","\",\"","m1","\",\"",-1.36,null,"-1.36","\",\"",0]
[null,null,null,null,null,11,{"$f":"G50","v":"i1"},"\",\"","Maier","\",\"",{"$f":"D18","v":"m2"},"\",\"",{"$f":"D19","v":0.41},null,"0.41","\",\"",0]
[null,null,null,null,null,12,{"$f":"G51","v":"i2"},"\",\"","Maier","\",\"",{"$f":"K60","v":"m2"},"\",\"",-0.68,null,"-0.68","\",\"",0]
[null,null,null,null,null,13,"i3","\",\"","Maier","\",\"",{"$f":"K61","v":"m2"},"\",\"",1.17,null,"1.17","\",\"",0]
[null,null,null,null,null,14,"i4","\",\"","Maier","\",\"","m2","\",\"",0.5,null,"0.5","\",\"",0]
[null,null,null,null,null,15,"i5","\",\"","Maier","\",\"","m2","\",\"",-0.92,null,"-0.92","\",\"",20]
[null,null,null,null,null,16,"i6","\",\"","Maier","\",\"","m2","\",\"",-0.11,null,"-0.11","\",\""]
[null,null,null,null,null,17,"i7","\",\"","Maier","\",\"","m2","\",\"",0.75,null,"0.75","\",\""]
[null,null,null,null,null,18,"i8","\",\"","Maier","\",\"","m2","\",\"",-0.2,null,"-0.2","\",\""]
[null,null,null,null,null,19,"i9","\",\"","Maier","\",\"","m2","\",\"",1.99,null,"1.99","\",\""]
[null,null,null,null,null,20,"i10","\",\"","Maier","\",\"","m2","\",\"",-1.25,null,"-1.25","\",\""]
[null,null,null,null,null,21,"i1","\",\"","Maier","\",\"",{"$f":"E18","v":"m3"},"\",\"",{"$f":"E19","v":0.64},null,"0.64","\",\""]
[null,null,null,null,null,22,"i2","\",\"","Maier","\",\"",{"$f":"K70","v":"m3"},"\",\"",-0.57999999999999996,null,"-0.58","\",\""]
[null,null,null,null,null,23,"i3","\",\"","Maier","\",\"",{"$f":"K71","v":"m3"},"\",\"",1.27,null,"1.27","\",\""]
[null,null,null,null,null,24,"i4","\",\"","Maier","\",\"","m3","\",\"",0.64,null,"0.64","\",\""]
[null,null,null,null,null,25,"i5","\",\"","Maier","\",\"","m3","\",\"",-0.84,null,"-0.84","\",\""]
[null,null,null,null,null,26,"i6","\",\"","Maier","\",\"","m3","\",\"",-0.21,null,"-0.21","\",\""]
[null,null,null,null,null,27,"i7","\",\"","Maier","\",\"","m3","\",\"",0.66,null,"0.66","\",\""]
[null,null,null,null,null,28,"i8","\",\"","Maier","\",\"","m3","\",\"",-0.17,null,"-0.17","\",\""]
[null,null,null,null,null,29,"i9","\",\"","Maier","\",\"","m3","\",\"",2.0099999999999998,null,"2.01","\",\""]
[null,null,null,null,null,30,"i10","\",\"","Maier","\",\"","m3","\",\"",-1.31,null,"-1.31","\",\""]
[null,null,null,null,null,31,"i1","\",\"",{"$f":"G17","v":"Müller"},"\",\"",{"$f":"F18","v":"m1"},"\",\"",{"$f":"F19","v":0.08},null,"0.08","\",\""]
[null,null,null,null,null,32,"i2","\",\"",{"$f":"I80","v":"Müller"},"\",\"",{"$f":"K80","v":"m1"},"\",\"",-0.47,null,"-0.47","\",\""]
[null,null,null,null,null,33,"i3","\",\"",{"$f":"I81","v":"Müller"},"\",\"",{"$f":"K81","v":"m1"},"\",\"",1.19,null,"1.19","\",\""]
[null,null,null,null,null,34,"i4","\",\"","Müller","\",\"","m1","\",\"",0.01,null,"0.01","\",\"",null,null,null,{"$f":"O80&P80&O81&P81&O82&P82&O83&P83&O84&P84&O85&P85&O86&P86&O87&P87&O88&P88&O89&P89&O90&P90&O91&P91&O92&P92&O93&P93&O94&P94&O95&P95&O96&P96&O97&P97&O98&P98&O99&P99&O100&P100&O101&P101&O102&P102&O103&P103&O104&P104&O105&P105&O106&P106&O107&P107&O108&P108&O109&P109","v":"0.08\",\"-0.47\",\"1.19\",\"0.01\",\"-0.56\",\"-0.2\",\"0.47\",\"-0.63\",\"1.8\",\"-1.68\",\"0.25\",\"-1.22\",\"0.94\",\"1.03\",\"-1.2\",\"0.22\",\"0.55\",\"0.08\",\"2.12\",\"-1.62\",\"0.07\",\"-0.68\",\"1.34\",\"0.2\",\"-1.28\",\"0.06\",\"0.83\",\"-0.34\",\"2.19\",\"-1.5\",\""}]
[null,null,null,null,null,35,"i5","\",\"","Müller","\",\"","m1","\",\"",-0.56000000000000005,null,"-0.56","\",\""]
[null,null,null,null,null,36,"i6","\",\"","Müller","\",\"","m1","\",\"",-0.2,null,"-0.2","\",\""]
[null,null,null,null,null,37,"i7","\",\"","Müller","\",\"","m1","\",\"",0.47,null,"0.47","\",\""]
[null,null,null,null,null,38,"i8","\",\"","Müller","\",\"","m1","\",\"",-0.63,null,"-0.63","\",\""]
[null,null,null,null,null,39,"i9","\",\"","Müller","\",\"","m1","\",\"",1.8,null,"1.8","\",\""]
[null,null,null,null,null,40,"i10","\",\"","Müller","\",\"","m1","\",\"",-1.68,null,"-1.68","\",\""]
[null,null,null,null,null,41,"i1","\",\"","Müller","\",\"",{"$f":"G18","v":"m2"},"\",\"",{"$f":"G19","v":0.25},null,"0.25","\",\""]
[null,null,null,null,null,42,"i2","\",\"","Müller","\",\"",{"$f":"K90","v":"m2"},"\",\"",-1.22,null,"-1.22","\",\""]
[null,null,null,null,null,43,"i3","\",\"","Müller","\",\"",{"$f":"K91","v":"m2"},"\",\"",0.94,null,"0.94","\",\""]
[null,null,null,null,null,44,"i4","\",\"","Müller","\",\"","m2","\",\"",1.03,null,"1.03","\",\""]
[null,null,null,null,null,45,"i5","\",\"","Müller","\",\"","m2","\",\"",-1.2,null,"-1.2","\",\""]
[null,null,null,null,null,46,"i6","\",\"","Müller","\",\"","m2","\",\"",0.22,null,"0.22","\",\""]
[null,null,null,null,null,47,"i7","\",\"","Müller","\",\"","m2","\",\"",0.55000000000000004,null,"0.55","\",\""]
[null,null,null,null,null,48,"i8","\",\"","Müller","\",\"","m2","\",\"",0.08,null,"0.08","\",\""]
[null,null,null,null,null,49,"i9","\",\"","Müller","\",\"","m2","\",\"",2.12,null,"2.12","\",\""]
[null,null,null,null,null,50,"i10","\",\"","Müller","\",\"","m2","\",\"",-1.62,null,"-1.62","\",\""]
[null,null,null,null,null,51,"i1","\",\"","Müller","\",\"",{"$f":"H18","v":"m3"},"\",\"",{"$f":"H19","v":7.0000000000000007E-2},null,"0.07","\",\""]
[null,null,null,null,null,52,"i2","\",\"","Müller","\",\"",{"$f":"K100","v":"m3"},"\",\"",-0.68,null,"-0.68","\",\""]
[null,null,null,null,null,53,"i3","\",\"","Müller","\",\"",{"$f":"K101","v":"m3"},"\",\"",1.34,null,"1.34","\",\""]
[null,null,null,null,null,54,"i4","\",\"","Müller","\",\"","m3","\",\"",0.2,null,"0.2","\",\""]
[null,null,null,null,null,55,"i5","\",\"","Müller","\",\"","m3","\",\"",-1.28,null,"-1.28","\",\""]
[null,null,null,null,null,56,"i6","\",\"","Müller","\",\"","m3","\",\"",0.06,null,"0.06","\",\""]
[null,null,null,null,null,57,"i7","\",\"","Müller","\",\"","m3","\",\"",0.83,null,"0.83","\",\""]
[null,null,null,null,null,58,"i8","\",\"","Müller","\",\"","m3","\",\"",-0.34,null,"-0.34","\",\""]
[null,null,null,null,null,59,"i9","\",\"","Müller","\",\"","m3","\",\"",2.19,null,"2.19","\",\""]
[null,null,null,null,null,60,"i10","\",\"","Müller","\",\"","m3","\",\"",-1.5,null,"-1.5","\",\""]
[null,null,null,null,null,61,"i1","\",\"",{"$f":"J17","v":"Schulze"},"\",\"",{"$f":"I18","v":"m1"},"\",\"",{"$f":"I19","v":0.04},null,"0.04","\",\""]
[null,null,null,null,null,62,"i2","\",\"",{"$f":"I110","v":"Schulze"},"\",\"",{"$f":"K110","v":"m1"},"\",\"",-1.38,null,"-1.38","\",\""]
[null,null,null,null,null,63,"i3","\",\"",{"$f":"I111","v":"Schulze"},"\",\"",{"$f":"K111","v":"m1"},"\",\"",0.88,null,"0.88","\",\""]
[null,null,null,null,null,64,"i4","\",\"","Schulze","\",\"","m1","\",\"",0.14000000000000001,null,"0.14","\",\"",null,null,null,{"$f":"O110&P110&O111&P111&O112&P112&O113&P113&O114&P114&O115&P115&O116&P116&O117&P117&O118&P118&O119&P119&O120&P120&O121&P121&O122&P122&O123&P123&O124&P124&O125&P125&O126&P126&O127&P127&O128&P128&O129&P129&O130&P130&O131&P131&O132&P132&O133&P133&O134&P134&O135&P135&O136&P136&O137&P137&O138&P138&O139&P139","v":"0.04\",\"-1.38\",\"0.88\",\"0.14\",\"-1.46\",\"-0.29\",\"0.02\",\"-0.46\",\"1.77\",\"-1.49\",\"-0.11\",\"-1.13\",\"1.09\",\"0.2\",\"-1.07\",\"-0.67\",\"0.01\",\"-0.56\",\"1.45\",\"-1.77\",\"-0.15\",\"-0.96\",\"0.67\",\"0.11\",\"-1.45\",\"-0.49\",\"0.21\",\"-0.49\",\"1.87\",\"-2.16\"]"}]
[null,null,null,null,null,65,"i5","\",\"","Schulze","\",\"","m1","\",\"",-1.46,null,"-1.46","\",\""]
[null,null,null,null,null,66,"i6","\",\"","Schulze","\",\"","m1","\",\"",-0.28999999999999998,null,{"$f":"SUBSTITUTE(M115,\",\",\".\")","v":"-0.29"},"\",\""]
[null,null,null,null,null,67,"i7","\",\"","Schulze","\",\"","m1","\",\"",0.02,null,"0.02","\",\""]
[null,null,null,null,null,68,"i8","\",\"","Schulze","\",\"","m1","\",\"",-0.46,null,"-0.46","\",\""]
[null,null,null,null,null,69,"i9","\",\"","Schulze","\",\"","m1","\",\"",1.77,null,"1.77","\",\""]
[null,null,null,null,null,70,"i10","\",\"","Schulze","\",\"","m1","\",\"",-1.49,null,"-1.49","\",\""]
[null,null,null,null,null,71,"i1","\",\"","Schulze","\",\"",{"$f":"J18","v":"m2"},"\",\"",{"$f":"J19","v":-0.11},null,"-0.11","\",\""]
[null,null,null,null,null,72,"i2","\",\"","Schulze","\",\"",{"$f":"K120","v":"m2"},"\",\"",-1.1299999999999999,null,"-1.13","\",\""]
[null,null,null,null,null,73,"i3","\",\"","Schulze","\",\"",{"$f":"K121","v":"m2"},"\",\"",1.0900000000000001,null,"1.09","\",\""]
[null,null,null,null,null,74,"i4","\",\"","Schulze","\",\"","m2","\",\"",0.2,null,"0.2","\",\""]
[null,null,null,null,null,75,"i5","\",\"","Schulze","\",\"","m2","\",\"",-1.07,null,"-1.07","\",\""]
[null,null,null,null,null,76,{"$f":"G115","v":"i6"},"\",\"","Schulze","\",\"","m2","\",\"",-0.67,null,"-0.67","\",\""]
[null,null,null,null,null,77,"i7","\",\"","Schulze","\",\"","m2","\",\"",0.01,null,"0.01","\",\""]
[null,null,null,null,null,78,"i8","\",\"","Schulze","\",\"","m2","\",\"",-0.56000000000000005,null,"-0.56","\",\""]
[null,null,null,null,null,79,"i9","\",\"","Schulze","\",\"","m2","\",\"",1.45,null,"1.45","\",\""]
[null,null,null,null,null,80,"i10","\",\"","Schulze","\",\"","m2","\",\"",-1.77,null,"-1.77","\",\""]
[null,null,null,null,null,81,"i1","\",\"","Schulze","\",\"",{"$f":"K18","v":"m3"},"\",\"",{"$f":"K19","v":-0.15},null,"-0.15","\",\""]
[null,null,null,null,null,82,"i2","\",\"","Schulze","\",\"",{"$f":"K130","v":"m3"},"\",\"",-0.96,null,"-0.96","\",\""]
[null,null,null,null,null,83,"i3","\",\"","Schulze","\",\"",{"$f":"K131","v":"m3"},"\",\"",0.67,null,"0.67","\",\""]
[null,null,null,null,null,84,"i4","\",\"","Schulze","\",\"","m3","\",\"",0.11,null,"0.11","\",\""]
[null,null,null,null,null,85,"i5","\",\"","Schulze","\",\"","m3","\",\"",-1.45,null,"-1.45","\",\""]
[null,null,null,null,null,86,"i6","\",\"","Schulze","\",\"","m3","\",\"",-0.49,null,"-0.49","\",\""]
[null,null,null,null,null,87,"i7","\",\"","Schulze","\",\"","m3","\",\"",0.21,null,"0.21","\",\""]
[null,null,null,null,null,88,"i8","\",\"","Schulze","\",\"","m3","\",\"",-0.49,null,"-0.49","\",\""]
[null,null,null,null,null,89,"i9","\",\"","Schulze","\",\"","m3","\",\"",1.87,null,"1.87","\",\""]
[null,null,null,null,null,90,"i10","\",\"","Schulze","\",\"","m3","\",\"",-2.16,null,"-2.16","\"]"]

{"sheet":"image","index":2,"n_rows":4,"n_cols":13,"rows_kept":4,"cut":false,"hidden":false,"merged":[[3,12,6,13]]}
[]
[]
[]
[null,null,null,null,null,null,null,null,null,null,null,null,"Diagramm aktualisieren über untenstehenden Button"]

{"sheet":"info_setup","index":3,"n_rows":16,"n_cols":6,"rows_kept":16,"cut":false,"hidden":false,"merged":[[4,5,5,5]]}
[]
[null,"Gültige Lizenz erwerben","Schreiben Sie eine Mail an roland.schnurr@sixsigmablackbelt.de"]
[]
[null,"Sprache"]
[null,"User -  Email","xx@sixsigmablackbelt.de",null,null,"Email und key validieren über linken Button"]
[null,"User - key","GFRDESX"]
[]
[null,"Gültig bis",{"$f":"calculation!Q55","v":"00:00:00"}]
[null,"Notizen",{"$f":"calculation!Q56","v":" "}]
[null,""]
[null,"Bemerkung",{"$f":"calculation!Q53","v":"ergebnisuservalidieren:user xx@sixsigmablackbelt.de mit msa2 in datensatz nicht vorhanden"}]
[]
[]
[]
[null,"Kontakt","roland.schnurr@sixsigmablackbelt.de"]
[null,"homepage","www.sixsigmablackbelt.de"]

{"sheet":"Minitab","index":4,"n_rows":0,"n_cols":0,"rows_kept":0,"cut":false,"hidden":false,"merged":[]}

{"sheet":"Muster example","index":5,"n_rows":117,"n_cols":10,"rows_kept":117,"cut":false,"hidden":false,"merged":[[79,2,79,3],[79,5,79,6],[79,8,79,9],[27,8,27,9],[40,5,40,6],[66,5,66,6],[66,8,66,9],[53,2,53,3],[53,5,53,6],[53,8,53,9],[66,2,66,3],[40,8,40,9],[40,2,40,3],[105,5,105,6],[105,8,105,9],[105,2,105,3],[92,2,92,3],[92,5,92,6],[92,8,92,9],[1,2,1,3],[1,5,1,6],[1,8,1,9],[27,2,27,3],[27,5,27,6],[14,5,14,6],[14,8,14,9],[14,2,14,3]]}
[]
["Fall 1","Prüfer j=1","Gerber",null,"Prüfer j=2","Bohnert",null," Prüfer j=3","Schmitz"]
["Teil Nr.","m=1","m=2","m=3","m=1","m=2","m=3","m=1","m=2","m=3"]
["i=1",0.28999999999999998,0.41,0.64,0.08,0.25,7.0000000000000007E-2,0.04,-0.11,-0.15]
["i=2",-0.56000000000000005,-0.68,-0.57999999999999996,-0.47,-1.22,-0.68,-1.38,-1.1299999999999999,-0.96]
["i=3",1.34,1.17,1.27,1.19,0.94,1.34,0.88,1.0900000000000001,0.67]
["i=4",0.47,0.5,0.64,0.01,1.03,0.2,0.14000000000000001,0.2,0.11]
["i=5",-0.8,-0.92,-0.84,-0.56000000000000005,-1.2,-1.28,-1.46,-1.07,-1.45]
["i=6",0.02,-0.11,-0.21,-0.2,0.22,0.06,-0.28999999999999998,-0.67,-0.49]
["i=7",0.59,0.75,0.66,0.47,0.55000000000000004,0.83,0.02,0.01,0.21]
["i=8",-0.31,-0.2,-0.17,-0.63,0.08,-0.34,-0.46,-0.56000000000000005,-0.49]
["i=9",2.2599999999999998,1.99,2.0099999999999998,1.8,2.12,2.19,1.77,1.45,1.87]
["i=10",-1.36,-1.25,-1.31,-1.68,-1.62,-1.5,-1.49,-1.77,-2.16]
[]
["Fall 2 (GM)","Prüfer j=1","Gerber",null,"Prüfer j=2","Bohnert",null," Prüfer j=3","Schmitz"]
["Teil Nr.","m=1","m=2","m=3","m=1","m=2","m=3","m=1","m=2","m=3"]
["i=1",56.833599999999997,56.834299999999999,56.834400000000002,56.834000000000003,56.834200000000003,56.834099999999999,56.834499999999998,56.834299999999999,56.834099999999999]
["i=2",56.832099999999997,56.8307,56.8322,56.832000000000001,56.831600000000002,56.831499999999998,56.832299999999996,56.831899999999997,56.831299999999999]
["i=3",56.837699999999998,56.837800000000001,56.836799999999997,56.837499999999999,56.8367,56.836599999999997,56.837400000000002,56.8371,56.8367]
["i=4",56.8292,56.828800000000001,56.829700000000003,56.829099999999997,56.829300000000003,56.829300000000003,56.8292,56.8292,56.829000000000001]
["i=5",56.828200000000002,56.828000000000003,56.828400000000002,56.827300000000001,56.828099999999999,56.828000000000003,56.828400000000002,56.828299999999999,56.8279]
["i=6",56.821899999999999,56.820999999999998,56.821300000000001,56.820700000000002,56.821300000000001,56.820700000000002,56.821399999999997,56.820799999999998,56.821300000000001]
["i=7",56.839300000000001,56.839100000000002,56.839500000000001,56.839700000000001,56.8401,56.840899999999998,56.839700000000001,56.84,56.840400000000002]
["i=8",56.830500000000001,56.829500000000003,56.830100000000002,56.830100000000002,56.829599999999999,56.83,56.830199999999998,56.83,56.830500000000001]
["i=9",56.826599999999999,56.826900000000002,56.827800000000003,56.826700000000002,56.827300000000001,56.826999999999998,56.826799999999999,56.827100000000002,56.826900000000002]
["i=10",56.837499999999999,56.838000000000001,56.838000000000001,56.838200000000001,56.838000000000001,56.838099999999997,56.838200000000001,56.837699999999998,56.837699999999998]
[]
["Fall 3","Prüfer j=1","Gerber",null,"Prüfer j=2","Bohnert",null," Prüfer j=3","Schmitz"]
["Teil Nr.","m=1","m=2","m=3","m=1","m=2","m=3","m=1","m=2","m=3"]
["i=1",100.01,100,null,100,99.99,null,100.01,99.98]
["i=2",100.01,100.02,null,99.99,100,null,100,100]
["i=3",100.01,100,null,100.01,100,null,100.01,99.99]
["i=4",100.02,99.99,null,100.01,99.99,null,100.01,100]
["i=5",100,100.01,null,100,99.99,null,100,100.01]
["i=6",100.01,100,null,100,99.99,null,100,99.99]
["i=7",99.99,100,null,100,99.99,null,99.99,100]
["i=8",100.01,99.99,null,100.01,100,null,100,99.99]
["i=9",100.01,100.01,null,100,100,null,100,99.99]
["i=10",100.01,100,null,99.99,100.01,null,99.99,100]
[]
["Fall 4","Prüfer j=1","Gerber",null,"Prüfer j=2","Bohnert",null," Prüfer j=3","Schmitz"]
["Teil Nr.","m=1","m=2","m=3","m=1","m=2","m=3","m=1","m=2","m=3"]
["i=1",6.0289999999999999,6.03,null,6.0330000000000004,6.032,null,6.0309999999999997,6.03]
["i=2",6.0190000000000001,6.02,null,6.02,6.0190000000000001,null,6.02,6.02]
["i=3",6.0039999999999996,6.0030000000000001,null,6.0069999999999997,6.0069999999999997,null,6.01,6.0060000000000002]
["i=4",5.9820000000000002,5.9820000000000002,null,5.9850000000000003,5.9859999999999998,null,5.984,5.984]
["i=5",6.0090000000000003,6.0090000000000003,null,6.0140000000000002,6.0140000000000002,null,6.0149999999999997,6.0140000000000002]
["i=6",5.9710000000000001,5.9720000000000004,null,5.9729999999999999,5.9720000000000004,null,5.9749999999999996,5.9740000000000002]
["i=7",5.9950000000000001,5.9969999999999999,null,5.9969999999999999,5.9960000000000004,null,5.9950000000000001,5.9939999999999998]
["i=8",6.0140000000000002,6.0179999999999998,null,6.0190000000000001,6.0149999999999997,null,6.016,6.0149999999999997]
["i=9",5.9850000000000003,5.9870000000000001,null,5.9870000000000001,5.9859999999999998,null,5.9870000000000001,5.9859999999999998]
["i=10",6.024,6.0279999999999996,null,6.0289999999999999,6.0250000000000004,null,6.0259999999999998,6.0250000000000004]
[]
["Fall 5","Prüfer j=1","Gerber",null,"Prüfer j=2","Bohnert",null," Prüfer j=3","Schmitz"]
["Teil Nr.","m=1","m=2","m=3","m=1","m=2","m=3","m=1","m=2","m=3"]
["i=1",0.28999999999999998,0.41,null,0.08,0.25,null,0.04,-0.11]
["i=2",-0.56000000000000005,-0.68,null,-0.47,-1.22,null,-1.38,-1.1299999999999999]
["i=3",1.34,1.17,null,1.19,0.94,null,0.88,1.0900000000000001]
["i=4",0.47,0.5,null,0.01,1.03,null,0.14000000000000001,0.2]
["i=5",-0.8,-0.92,null,-0.56000000000000005,-1.2,null,-1.46,-1.07]
["i=6"]
["i=7"]
["i=8"]
["i=9"]
["i=10"]
[]
["Fall 6","Prüfer j=1","Gerber",null,"Prüfer j=2","Bohnert",null," Prüfer j=3","Schmitz"]
["Teil Nr.","m=1","m=2","m=3","m=1","m=2","m=3","m=1","m=2","m=3"]
["i=1",0.28999999999999998,0.41,null,0.08,0.25]
["i=2",-0.56000000000000005,-0.68,null,-0.47,-1.22]
["i=3",1.34,1.17,null,1.19,0.94]
["i=4",0.47,0.5,null,0.01,1.03]
["i=5",-0.8,-0.92,null,-0.56000000000000005,-1.2]
["i=6",0.02,-0.11,null,-0.2,0.22]
["i=7",0.59,0.75,null,0.47,0.55000000000000004]
["i=8",-0.31,-0.2,null,-0.63,0.08]
["i=9"]
["i=10"]
[]
["Fall 7","Prüfer j=1","Gerber",null,"Prüfer j=2","Bohnert",null," Prüfer j=3","Schmitz"]
["Teil Nr.","m=1","m=2","m=3","m=1","m=2","m=3","m=1","m=2","m=3"]
["i=1",0.28999999999999998,0.41,null,0.08,0.25,null,0.04,-0.11]
["i=2",-0.56000000000000005,-0.68,null,-0.47,-1.22,null,-1.38,-1.1299999999999999]
["i=3",1.34,1.17,null,1.19,0.94,null,0.88,1.0900000000000001]
["i=4",0.47,0.5,null,0.01,1.03,null,0.14000000000000001,0.2]
["i=5",-0.8,-0.92,null,-0.56000000000000005,-1.2,null,-1.46,-1.07]
["i=6",0.02,-0.11,null,-0.2,0.22,null,-0.28999999999999998,-0.67]
["i=7",0.59,0.75,null,0.47,0.55000000000000004,null,0.02,0.01]
["i=8",-0.31,-0.2,null,-0.63,0.08,null,-0.46,-0.56000000000000005]
["i=9",2.2599999999999998,1.99,null,1.8,2.12,null,1.77,1.45]
["i=10",-1.36,-1.25,null,-1.68,-1.62,null,-1.49,-1.77]
[]
["Fall 8","Prüfer j=1","Gerber",null,"Prüfer j=2","Bohnert",null," Prüfer j=3","Schmitz"]
["Teil Nr.","m=1","m=2","m=3","m=1","m=2","m=3","m=1","m=2","m=3"]
["i=1",0.28999999999999998,0.41,0.64,0.08,0.25,7.0000000000000007E-2,0.04,-0.11,-0.15]
["i=2",-0.56000000000000005,-0.68,-0.57999999999999996,-0.47,-1.22,-0.68,-1.38,-1.1299999999999999,-0.96]
["i=3",1.34,1.17,1.27,1.19,0.94,1.34,0.88,1.0900000000000001,0.67]
["i=4",0.47,0.5,0.64,0.01,1.03,0.2,0.14000000000000001,0.2,0.11]
["i=5",-0.8,-0.92,-0.84,-0.56000000000000005,-1.2,-1.28,-1.46,-1.07,-1.45]
["i=6",0.02,-0.11,-0.21,-0.2,0.22,0.06,-0.28999999999999998,-0.67,-0.49]
["i=7",0.59,0.75,0.66,0.47,0.55000000000000004,0.83,0.02,0.01,0.21]
["i=8",-0.31,-0.2,-0.17,-0.63,0.08,-0.34,-0.46,-0.56000000000000005,-0.49]
["i=9"]
["i=10"]
[]
[null,"Prüfer j=1","D. Wirlitsch",null,"Prüfer j=2","S. Dobosi",null," Prüfer j=3","M. Dogan"]
["Teil Nr.","m=1","m=2","m=3","m=1","m=2","m=3","m=1","m=2","m=3"]
["i=1",19.48,19.47,19.48,19.45,19.46,19.43,19.440000000000001,19.440000000000001,19.43]
["i=2",19.440000000000001,19.420000000000002,19.420000000000002,19.47,19.440000000000001,19.440000000000001,19.45,19.47,19.47]
["i=3",19.45,19.47,19.46,19.46,19.43,19.43,19.45,19.45,19.45]
["i=4",19.45,19.45,19.45,19.510000000000002,19.5,19.46,19.52,19.440000000000001,19.5]
["i=5",19.46,19.46,19.46,19.43,19.420000000000002,19.440000000000001,19.510000000000002,19.510000000000002,19.48]
["i=6",19.43,19.45,19.43,19.45,19.440000000000001,19.45,19.45,19.46,19.45]
["i=7",19.489999999999998,19.489999999999998,19.5,19.45,19.420000000000002,19.43,19.440000000000001,19.440000000000001,19.43]
["i=8",19.45,19.46,19.45,19.46,19.43,19.45,19.45,19.45,19.47]
["i=9",19.440000000000001,19.45,19.45,19.41,19.440000000000001,19.46,19.46,19.45,19.45]
["i=10",19.440000000000001,19.440000000000001,19.45,19.440000000000001,19.489999999999998,19.48,19.46,19.45,19.45]