{"text_format":"1","workbook":"xlsx","n_sheets":6,"sheets":["input","output","calculation","info_setup","language","examples"],"not_rendered":{"charts":5,"images":8,"macros":1,"external_links":0,"defined_names":96,"comments":0,"pivot_tables":0},"unopened":[],"bounds":{"document_bytes":16777216,"sheet_cells":100000,"rows_first":2000,"rows_last":500,"rows_between":2000,"halvings":0,"cell_chars":16384,"cell_head_chars":4096},"cells_cut":0,"cells_raw":0,"read":"whole","date_system":"1900"}

{"sheet":"input","index":0,"n_rows":57,"n_cols":9,"rows_kept":57,"cut":false,"hidden":false,"merged":[[1,1,1,8]]}
[]
[null,{"$f":"language!BY1","v":"Dateneingabe"}]
[]
[null,null,null,"N","Y1","Y2","Y3","Y4","Y5"]
[null,null,null,1,74.03,74.001999999999995]
[null,null,null,2,73.995000000000005,73.992000000000004]
[null,null,null,3,73.988,74.024000000000001]
[null,null,null,4,74.001999999999995,73.995999999999995]
[null,null,null,5,73.992000000000004,74.007000000000005]
[null,null,null,6,74.009,73.994]
[null,null,null,7,73.995000000000005,74.006]
[null,null,null,8,73.984999999999999,74.003]
[null,null,null,9,74.007999999999996,73.995000000000005]
[null,null,null,10,73.998000000000005,74]
[null,null,null,11,73.994,73.998000000000005]
[null,null,null,12,74.004000000000005,74]
[null,null,null,13,73.983000000000004,74.001999999999995]
[null,null,null,14,74.006,73.966999999999999]
[null,null,null,15,74.012,74.013999999999996]
[null,null,null,16,74,73.983999999999995]
[null,null,null,17,73.994,74.012]
[null,null,null,18,74.006,74.010000000000005]
[null,null,null,19,73.983999999999995,74.001999999999995]
[null,null,null,20,74,74.010000000000005]
[null,null,null,21,73.981999999999999,74.001000000000005]
[null,null,null,22,74.004000000000005,73.998999999999995]
[null,null,null,23,74.010000000000005,73.989000000000004]
[null,null,null,24,74.015000000000001,74.007999999999996]
[null,null,null,25,73.981999999999999,73.983999999999995]
[null,null,null,26,74.03,74.001999999999995]
[null,null,null,27,73.995000000000005,73.992000000000004]
[null,null,null,28,73.988,74.024000000000001]
[null,null,null,29,74.001999999999995,73.995999999999995]
[null,null,null,30,73.992000000000004,74.007000000000005]
[null,null,null,31,74.009,73.994]
[null,null,null,32,73.995000000000005,74.006]
[null,null,null,33,73.984999999999999,74.003]
[null,null,null,34,74.007999999999996,73.995000000000005]
[null,null,null,35,73.998000000000005,74]
[null,null,null,36,73.994,73.998000000000005]
[null,null,null,37]
[null,null,null,38]
[null,null,null,39]
[null,null,null,40]
[null,null,null,41]
[null,null,null,42]
[null,null,null,43]
[null,null,null,44]
[null,null,null,45]
[null,null,null,46]
[null,null,null,47]
[null,null,null,48]
[null,null,null,49]
[null,null,null,50]
[]
[null,{"$f":"language!BZ1","v":"Bis zu 50 Stichproben á 2 - 5 Werte"}]
[null,{"$f":"language!CA1","v":"Bei jeder Stichprobe muss die gleiche Anzahl an Messerten aufgenommen werden"}]

{"sheet":"output","index":1,"n_rows":53,"n_cols":28,"rows_kept":53,"cut":false,"hidden":false,"merged":[[1,1,1,12],[7,17,7,18],[8,17,8,18],[1,13,1,19],[1,20,1,24],[6,17,6,18],[3,16,3,18],[4,16,4,18],[14,16,14,17],[15,16,15,17],[16,16,16,17],[12,17,12,18],[9,17,9,18],[11,17,11,18],[13,17,13,18],[47,16,47,17],[48,16,51,16],[43,20,53,24],[52,16,52,17],[10,17,10,18],[17,16,17,17],[27,16,30,16],[22,16,22,17],[23,16,23,17],[26,16,26,17],[24,16,24,17],[34,16,36,16],[39,16,41,16],[33,16,33,18],[38,16,38,18],[31,16,31,17]]}
[]
[null,null,null,null,null,null,null,null,null,null,null,null,null,"Prozessfähigkeit",null,null,null,null,null,null,null,null,null,null,null,null,null,{"$f":"IF(calculation!W57<>0,language!BK1,language!BJ1)","v":"Status: Die Werte im Arbeitsblatt sind kalkuliert"}]
[]
[null,null,null,null,null,null,null,null,null,null,null,null,null,null,null,null,"Werte können geändert werden"]
[null,null,null,null,null,null,null,null,null,null,null,null,null,null,null,null,"Werte werden berechnet (Blatt Berechnung)"]
[]
[null,null,null,null,null,null,null,null,null,null,null,null,null,null,null,null,"Artikel:","Halter"]
[null,null,null,null,null,null,null,null,null,null,null,null,null,null,null,null,"A-Nummer","C2G234824ß"]
[null,null,null,null,null,null,null,null,null,null,null,null,null,null,null,null,"Zeichnung:","UZT1340124357"]
[null,null,null,null,null,null,null,null,null,null,null,null,null,null,null,null,"Prüfer:","Maier"]
[null,null,null,null,null,null,null,null,null,null,null,null,null,null,null,null,"Messmittel:","Messschieber 47.22452"]
[null,null,null,null,null,null,null,null,null,null,null,null,null,null,null,null,"Datum:","2014-12-10"]
[null,null,null,null,null,null,null,null,null,null,null,null,null,null,null,null,"Merkmal:","Länge"]
[null,null,null,null,null,null,null,null,null,null,null,null,null,null,null,null,"Maßeinheit:","mm"]
[null,null,null,null,null,null,null,null,null,null,null,null,null,null,null,null,"Sollwert msoll =",null,74]
[null,null,null,null,null,null,null,null,null,null,null,null,null,null,null,null,"Unterer Grenzwert UGW =",null,73.95]
[null,null,null,null,null,null,null,null,null,null,null,null,null,null,null,null,"Oberer Grenzwert OGW =",null,74.05]
[null,null,null,null,null,null,null,null,null,null,null,null,null,null,null,null,"Anzahl Klassen Histogramm =",null,20]
[null,null,null,null,null,null,null,null,null,null,null,null,null,null,null,null,"Ppk <",1.33,"Prozess nicht fähig"]
[null,null,null,null,null,null,null,null,null,null,null,null,null,null,null,null,"Ppk ","zwischen","Prozess bedingt fähig"]
[null,null,null,null,null,null,null,null,null,null,null,null,null,null,null,null,"Ppk >",1.66,"Prozess fähig"]
[]
[null,null,null,null,null,null,null,null,null,null,null,null,null,null,null,null,"Umfang der Stichprobe",null,{"$f":"Anzahl","v":72}]
[null,null,null,null,null,null,null,null,null,null,null,null,null,null,null,null,"Mittelwert m",null,{"$f":"Mittelwert","v":73.999861111111102}]
[null,null,null,null,null,null,null,null,null,null,null,null,null,null,null,null,"Die Werte sind ",null,{"$f":"IF(calculation!DH22<0.05,\"nicht normalverteilt\",\"normalverteilt\")","v":"normalverteilt"}]
[]
[null,null,null,null,null,null,null,null,null,null,null,null,null,null,null,null,"Standardabweich. s (ges.)",null,{"$f":"Standardabweichung","v":1.1207775916816397E-2}]
[null,null,null,null,null,null,null,null,null,null,null,null,null,null,null,null,"Gesamtprozess-fähigkeit","Ppu ",{"$f":"CPU","v":1.4829320726718611}]
[null,null,null,null,null,null,null,null,null,null,null,null,null,null,null,null,null,"Ppo",{"$f":"CPO","v":1.491193532687304}]
[null,null,null,null,null,null,null,null,null,null,null,null,null,null,null,null,null,"Pp",{"$f":"CP","v":1.4870628026795827}]
[null,null,null,null,null,null,null,null,null,null,null,null,null,null,null,null,null,"Ppk",{"$f":"CPK","v":1.4829320726718611}]
[null,null,null,null,null,null,null,null,null,null,null,null,null,null,null,null,{"$f":"\"evaluation Ppk =>\"","v":"evaluation Ppk =>"},null,{"$f":"IF(R19=\"\",\"\",(IF(S31<R19,S19,IF(S31>R21,S21,S20))))","v":"Prozess bedingt fähig"}]
[]
[null,null,null,null,null,null,null,null,null,null,null,null,null,null,null,null,"Berechnete Leistung in ppm"]
[null,null,null,null,null,null,null,null,null,null,null,null,null,null,null,null,"Überschreitungs-anteil","pUGW",{"$f":"BERPUGW","v":4.317644802202623}]
[null,null,null,null,null,null,null,null,null,null,null,null,null,null,null,null,null,"pOGW",{"$f":"BERPOGW","v":3.8460272601126277}]
[null,null,null,null,null,null,null,null,null,null,null,null,null,null,null,null,null,"p",{"$f":"BERP","v":8.1636720623152499}]
[]
[null,null,null,null,null,null,null,null,null,null,null,null,null,null,null,null,"Beobachtete Leistung in ppm"]
[null,null,null,null,null,null,null,null,null,null,null,null,null,null,null,null,"Überschreitungs-anteil","pUGW",{"$f":"BEOBPUGW","v":0}]
[null,null,null,null,null,null,null,null,null,null,null,null,null,null,null,null,null,"pOGW",{"$f":"BEOBPOGW","v":0}]
[null,null,null,null,null,null,null,null,null,null,null,null,null,null,null,null,null,"p",{"$f":"BEOBPPM","v":0}]
[]
[null,null,null,null,null,null,null,null,null,null,null,null,null,null,null,null,"Cpk <",1.33,"Prozess nicht fähig",null,"Definition Ppk und Cpk nach nach ISO22514, Bosch; (package SixsSigma) und Minitab\nFür Cpk (Standardabweichung Rquer und Konstante für erwartungsgetreue Schätzung)\nFür Ppk (Standardabweichung über die gesamte Grundgesamtheit)\n\nsiehe auch:\nhttps://www.sixsigmablackbelt.de/definition-von-cpk-und-ppk-nach-iso-22514-und-aiag-spc/"]
[null,null,null,null,null,null,null,null,null,null,null,null,null,null,null,null,"Cpk ","zwischen","Prozess bedingt fähig"]
[null,null,null,null,null,null,null,null,null,null,null,null,null,null,null,null,"Cpk >",1.66,"Prozess fähig"]
[]
[null,null,null,null,null,null,null,null,null,null,null,null,null,null,null,null,"Standardabweich. s (innerhalb.)",null,{"$f":"calculation!BI46","v":1.1968085106383433E-2}]
[null,null,null,null,null,null,null,null,null,null,null,null,null,null,null,null,"Prozessfähigkeit (innerhalb, potentiell)","Cpu ",{"$f":"calculation!BI49","v":1.3887242798349988}]
[null,null,null,null,null,null,null,null,null,null,null,null,null,null,null,null,null,"Cpo",{"$f":"calculation!BI50","v":1.3964609053499224}]
[null,null,null,null,null,null,null,null,null,null,null,null,null,null,null,null,null,"Cp",{"$f":"calculation!BI48","v":1.3925925925924605}]
[null,null,null,null,null,null,null,null,null,null,null,null,null,null,null,null,null,"Cpk",{"$f":"calculation!BI51","v":1.3887242798349988}]
[null,null,null,null,null,null,null,null,null,null,null,null,null,null,null,null,{"$f":"\"Bewertung Cpk =>\"","v":"Bewertung Cpk =>"},null,{"$f":"IF(R44=\"\",\"\",(IF(S52<R44,S44,IF(S52>R46,S46,S45))))","v":"Prozess bedingt fähig"}]

{"sheet":"calculation","index":2,"n_rows":257,"n_cols":112,"rows_kept":257,"cut":false,"hidden":true,"merged":[[87,60,87,69],[59,60,59,69],[3,58,3,65],[3,93,3,99],[3,101,3,111],[3,74,3,90],[4,17,4,22],[4,31,4,34],[4,26,4,28],[4,35,4,37],[3,40,3,56]]}
[]
[null,null,null,null,null,"UGW",{"$f":"output!S16","v":73.95},null,null,null,null,null,null,null,null,"UGW",73.95,null,null,null,null,null,{"$f":"IF(Q2<>G2,1,0)","v":0}]
[null,null,null,null,null,"OGW",{"$f":"output!S17","v":74.05},null,null,null,null,null,null,null,null,"OGW",74.05,null,null,null,null,null,0]
[null,null,null,null,null,null,null,null,null,null,null,null,null,null,null,null,null,null,null,null,null,null,null,null,null,null,null,null,null,null,null,null,null,null,null,null,null,null,null,null,null,null,null,null,null,null,null,null,null,null,null,null,null,null,null,null,null,null,"Prozess- und Maschinenfähigkeit",null,null,null,null,null,null,null,null,null,null,null,null,null,null,null,"Stichprobe chronologisch",null,null,null,null,null,null,null,null,null,null,null,null,null,null,null,null,null,null,"Wahrscheinlichkeitsnetz",null,null,null,null,null,null,null,"Test auf Normalverteilung (Anderson Darling)"]
[null,"x",null,null,null,null,null,null,null,null,null,"x",null,null,null,null,null,null,null,null,null,null,null,null,null,null,null,null,null,null,null,"Xquer Karte",null,null,null,"Range Karte",null,null,null,null,null,"Stichprobe Berechnung"]
[null,null,"Y1","Y2","Y3","Y4","Y5",null,null,null,null,null,"Y1","Y2","Y3","Y4","Y5",null,null,null,null,null,null,null,null,null,"Mittelwert","Standardabweichung","Range",null,"Zähler","Mittelwert","X quer","OEG  X quer","UEG  X quer","Mittelwert","Range","OEG R",null,null,"i","Wert für Berechnung","<UGW",">OGW","i","Stichprobe 1","i","Stichprobe 2",null,"i","Stichprobe 3",null,"i","Stichprobe 4",null,"i","Stichprobe 5",null,null,null,null,null,null,null,null,null,null,null,null,null,null,null,null,null,"Zähler","X Wert","Y1 Wert","Y2 Wert","Y3 Wert","Y4 Wert","Y5 Wert",null,"OGW","UGW",{"$f":"\" - 1 Sigma\"","v":" - 1 Sigma"},{"$f":"\" + 1 Sigma\"","v":" + 1 Sigma"},{"$f":"\"-  2 Sigma\"","v":"-  2 Sigma"},{"$f":"\" + 2 Sigma\"","v":" + 2 Sigma"},{"$f":"\" - 3 Sigma\"","v":" - 3 Sigma"},{"$f":"\" + 3 Sigma\"","v":" + 3 Sigma"},"Mittelwert",null,null,null,"u","x-quer+u∙s","Helfer","Fehlerindikator",null,null,null,"i","xi sortiert","Zähler",null,"BG",null,"S","z",null,"Wert","z"]
[null,1,{"$f":"IF(input!E5=\"\",\"\",input!E5)","v":74.03},{"$f":"IF(input!F5=\"\",\"\",input!F5)","v":74.001999999999995},{"$f":"IF(input!G5=\"\",\"\",input!G5)","v":""},{"$f":"IF(input!H5=\"\",\"\",input!H5)","v":""},{"$f":"IF(input!I5=\"\",\"\",input!I5)","v":""},null,null,null,null,1,74.03,74.001999999999995,"","","",null,{"$f":"IF(M7<>C7,1,0)","v":0},{"$f":"IF(N7<>D7,1,0)","v":0},0,0,0,null,null,null,{"$f":"IF(M7<>\"\",AVERAGE(M7:Q7),\"\")","v":74.015999999999991},{"$f":"IF(M7<>\"\",_xlfn.STDEV.P(M7:Q7),\"\")","v":1.4000000000002899E-2},{"$f":"IF(M7<>\"\",MAX(M7:Q7)-MIN(M7:Q7),\"\")","v":2.8000000000005798E-2},null,1,{"$f":"IF(AA7=\"\",NA(),xquerquer)","v":73.999861111111102},{"$f":"IF(AA7=\"\",NA(),AA7)","v":74.015999999999991},{"$f":"IF(AA7=\"\",NA(),xquerquer+(Azwei*Rquer))","v":74.0252411111111},{"$f":"IF(AA7=\"\",NA(),xquerquer-(Azwei*Rquer))","v":73.974481111111103},{"$f":"IF(AA7=\"\",NA(),Rquer)","v":1.3500000000000512E-2},{"$f":"IF(AA7=\"\",NA(),AC7)","v":2.8000000000005798E-2},{"$f":"IF(AA7=\"\",NA(),Dvier*Rquer)","v":4.4145000000001676E-2},null,null,1,{"$f":"IF($BI$41=2,IF(AV7<>\"\",AV7,\"\"),(IF($BI$41=3,IF(AY7<>\"\",AY7,\"\"),(IF($BI$41=4,IF(BB7<>\"\",BB7,\"\"),IF(BE7<>\"\",BE7,\"\"))))))","v":74.03},{"$f":"IF(AP7<>\"\",IF(AP7<UGW,1,0),\"\")","v":0},{"$f":"IF(AP7<>\"\",IF(AP7>OGW,1,0),\"\")","v":0},null,null,"E5",{"$f":"IF($M$7=\"\",\"\",$M$7)","v":74.03},null,"E5",{"$f":"IF($M$7=\"\",\"\",$M$7)","v":74.03},null,"E5",{"$f":"IF($M$7=\"\",\"\",$M$7)","v":74.03},null,"E5",{"$f":"IF($M$7=\"\",\"\",$M$7)","v":74.03},null,null,"Datum:",{"$f":"Datum","v":"2014-12-10"},null,null,null,null,null,null,null,null,null,null,null,null,null,1,{"$f":"IF((AnzahlderStichproben>BW7),BW7,AnzahlderStichproben)","v":1},{"$f":"IF(input!E5<>\"\",input!E5,\"\")","v":74.03},{"$f":"IF(input!F5<>\"\",input!F5,NA())","v":74.001999999999995},{"$f":"IF(input!G5<>\"\",input!G5,NA())","v":{"$error":"#N/A"}},{"$f":"IF(input!H5<>\"\",input!H5,NA())","v":{"$error":"#N/A"}},{"$f":"IF(input!I5<>\"\",input!I5,NA())","v":{"$error":"#N/A"}},null,{"$f":"IF($BI$12=\"\",#N/A,IF(AP7<>\"\",OGW,CE6))","v":74.05},{"$f":"IF($BI$11=\"\",#N/A,(IF(AP7<>\"\",$BI$11,CF6)))","v":73.95},{"$f":"Mittelwert-Standardabweichung","v":73.988653335194286},{"$f":"Mittelwert+Standardabweichung","v":74.011068887027918},{"$f":"Mittelwert-2*Standardabweichung","v":73.97744555927747},{"$f":"Mittelwert+2*Standardabweichung","v":74.022276662944734},{"$f":"Mittelwert-3*Standardabweichung","v":73.966237783360654},{"$f":"Mittelwert+3*Standardabweichung","v":74.033484438861549},{"$f":"Mittelwert","v":73.999861111111102},null,null,null,-6,{"$f":"Mittelwert+CQ7*Standardabweichung","v":73.932614455610207},3,{"$f":"CS7*2","v":6},{"$f":"CR7","v":73.932614455610207},null,null,1,{"$f":"IF(AP7=\"\",NA(),SMALL(xi,CZ7))","v":73.966999999999999},{"$f":"IF(AP7=\"\",\"\",1)","v":1},{"$f":"IF(AP7=\"\",\"\",NORMSDIST((CY7-Mittelwert)/Standardabweichung)-0.00000001)","v":1.6839662492645823E-3},{"$f":"IF(AP7=\"\",\"\",1-DA7)","v":0.99831603375073541},{"$f":"IF(IF(AP7=\"\",\"\",SMALL(BG,CZ7))=0,0.0001,IF(AP7=\"\",\"\",SMALL(BG,CZ7)))","v":3.5822014839904659E-3},{"$f":"IF(AP7=\"\",\"\",(2*CZ7-1)*(LN(DC7)+LN(DA7)))","v":-12.018381133272555},{"$f":"IF(AP7=\"\",NA(),NORMSINV((CZ7-0.3)/(Anzahl+0.4)))","v":-2.3389694125229448},null,{"$f":"Standardabweichung*DH7+Mittelwert","v":74.033484438861549},3]
[null,2,{"$f":"IF(input!E6=\"\",\"\",input!E6)","v":73.995000000000005},{"$f":"IF(input!F6=\"\",\"\",input!F6)","v":73.992000000000004},{"$f":"IF(input!G6=\"\",\"\",input!G6)","v":""},{"$f":"IF(input!H6=\"\",\"\",input!H6)","v":""},{"$f":"IF(input!I6=\"\",\"\",input!I6)","v":""},null,null,null,null,2,73.995000000000005,73.992000000000004,"","","",null,{"$f":"IF(M8<>C8,1,0)","v":0},{"$f":"IF(N8<>D8,1,0)","v":0},{"$f":"IF(O8<>E8,1,0)","v":0},{"$f":"IF(P8<>F8,1,0)","v":0},{"$f":"IF(Q8<>G8,1,0)","v":0},null,null,null,{"$f":"IF(M8<>\"\",AVERAGE(M8:Q8),\"\")","v":73.993500000000012},{"$f":"IF(M8<>\"\",_xlfn.STDEV.P(M8:Q8),\"\")","v":1.5000000000000568E-3},{"$f":"IF(M8<>\"\",MAX(M8:Q8)-MIN(M8:Q8),\"\")","v":3.0000000000001137E-3},null,{"$f":"IF(AA8=\"\",AE7,L8)","v":2},73.999861111111102,73.993500000000012,74.0252411111111,73.974481111111103,1.3500000000000512E-2,{"$f":"IF(AA8=\"\",NA(),AC8)","v":3.0000000000001137E-3},4.4145000000001676E-2,null,null,2,{"$f":"IF($BI$41=2,IF(AV8<>\"\",AV8,\"\"),(IF($BI$41=3,IF(AY8<>\"\",AY8,\"\"),(IF($BI$41=4,IF(BB8<>\"\",BB8,\"\"),IF(BE8<>\"\",BE8,\"\"))))))","v":74.001999999999995},0,0,null,null,null,{"$f":"IF($N$7=\"\",\"\",$N$7)","v":74.001999999999995},null,null,{"$f":"IF($N$7=\"\",\"\",$N$7)","v":74.001999999999995},null,null,{"$f":"IF($N$7=\"\",\"\",$N$7)","v":74.001999999999995},null,null,{"$f":"IF($N$7=\"\",\"\",$N$7)","v":74.001999999999995},null,null,"Merkmal:",{"$f":"Merkmal","v":"Länge"},null,null,null,null,null,null,null,null,null,null,null,null,null,2,2,{"$f":"IF(input!E6<>\"\",input!E6,BY7)","v":73.995000000000005},{"$f":"IF(input!F6<>\"\",input!F6,BZ7)","v":73.992000000000004},{"$f":"IF(input!G6<>\"\",input!G6,CA7)","v":{"$error":"#N/A"}},{"$f":"IF(input!H6<>\"\",input!H6,CB7)","v":{"$error":"#N/A"}},{"$f":"IF(input!I6<>\"\",input!I6,CC7)","v":{"$error":"#N/A"}},null,74.05,{"$f":"IF($BI$11=\"\",#N/A,(IF(AP8<>\"\",$BI$11,CF7)))","v":73.95},{"$f":"CG7","v":73.988653335194286},74.011068887027918,73.97744555927747,74.022276662944734,73.966237783360654,74.033484438861549,73.999861111111102,null,null,null,-5,73.943822231527022,3,{"$f":"CS8*2","v":6},{"$f":"CU7","v":73.932614455610207},null,null,2,73.981999999999999,{"$f":"IF(AP8=\"\",\"\",1+CZ7)","v":2},5.5508823888336362E-2,0.94449117611166367,{"$f":"IF(AP8=\"\",\"\",SMALL(BG,CZ8))","v":3.5822014839904659E-3},-25.568973029380277,-1.9866488303120811,null,{"$f":"Standardabweichung*DH8+Mittelwert","v":73.999861111111102},0]
[null,3,{"$f":"IF(input!E7=\"\",\"\",input!E7)","v":73.988},{"$f":"IF(input!F7=\"\",\"\",input!F7)","v":74.024000000000001},{"$f":"IF(input!G7=\"\",\"\",input!G7)","v":""},{"$f":"IF(input!H7=\"\",\"\",input!H7)","v":""},{"$f":"IF(input!I7=\"\",\"\",input!I7)","v":""},null,null,null,null,3,73.988,74.024000000000001,"","","",null,0,0,0,0,0,null,null,null,74.006,1.8000000000000682E-2,3.6000000000001364E-2,null,{"$f":"IF(AA9=\"\",AE8,L9)","v":3},73.999861111111102,74.006,74.0252411111111,73.974481111111103,1.3500000000000512E-2,3.6000000000001364E-2,4.4145000000001676E-2,null,null,3,73.995000000000005,0,0,null,null,"E6",{"$f":"IF($M$8=\"\",\"\",$M$8)","v":73.995000000000005},null,null,{"$f":"IF($O$7=\"\",\"\",$O$7)","v":""},null,null,{"$f":"IF($O$7=\"\",\"\",$O$7)","v":""},null,null,{"$f":"IF($O$7=\"\",\"\",$O$7)","v":""},null,null,"Maßeinheit:",{"$f":"Maßeinheit","v":"mm"},null,null,null,null,null,null,null,null,null,null,null,null,null,3,3,{"$f":"IF(input!E7<>\"\",input!E7,BY8)","v":73.988},{"$f":"IF(input!F7<>\"\",input!F7,BZ8)","v":74.024000000000001},{"$f":"IF(input!G7<>\"\",input!G7,CA8)","v":{"$error":"#N/A"}},{"$f":"IF(input!H7<>\"\",input!H7,CB8)","v":{"$error":"#N/A"}},{"$f":"IF(input!I7<>\"\",input!I7,CC8)","v":{"$error":"#N/A"}},null,74.05,73.95,73.988653335194286,74.011068887027918,73.97744555927747,74.022276662944734,73.966237783360654,74.033484438861549,73.999861111111102,null,null,null,-4,73.955030007443838,3,6,{"$f":"CU8","v":73.932614455610207},null,null,3,73.981999999999999,3,5.5508823888336362E-2,0.94449117611166367,1.5629406028370485E-2,-35.249072095913057,-1.7830041034241493,null,{"$f":"Standardabweichung*DH9+Mittelwert","v":73.966237783360654},-3]
[null,4,{"$f":"IF(input!E8=\"\",\"\",input!E8)","v":74.001999999999995},{"$f":"IF(input!F8=\"\",\"\",input!F8)","v":73.995999999999995},{"$f":"IF(input!G8=\"\",\"\",input!G8)","v":""},{"$f":"IF(input!H8=\"\",\"\",input!H8)","v":""},{"$f":"IF(input!I8=\"\",\"\",input!I8)","v":""},null,null,null,null,4,74.001999999999995,73.995999999999995,"","","",null,0,0,0,0,0,null,null,null,73.998999999999995,3.0000000000001137E-3,6.0000000000002274E-3,null,4,73.999861111111102,73.998999999999995,74.0252411111111,73.974481111111103,1.3500000000000512E-2,6.0000000000002274E-3,4.4145000000001676E-2,null,null,4,73.992000000000004,0,0,null,null,null,{"$f":"IF($N$8=\"\",\"\",$N$8)","v":73.992000000000004},null,"E6",{"$f":"IF($M$8=\"\",\"\",$M$8)","v":73.995000000000005},null,null,{"$f":"IF($P$7=\"\",\"\",$P$7)","v":""},null,null,{"$f":"IF($P$7=\"\",\"\",$P$7)","v":""},null,null,"Sollwert msoll =",{"$f":"Sollwert","v":74},null,null,null,null,null,null,null,null,null,null,null,null,null,4,4,{"$f":"IF(input!E8<>\"\",input!E8,BY9)","v":74.001999999999995},{"$f":"IF(input!F8<>\"\",input!F8,BZ9)","v":73.995999999999995},{"$f":"IF(input!G8<>\"\",input!G8,CA9)","v":{"$error":"#N/A"}},{"$f":"IF(input!H8<>\"\",input!H8,CB9)","v":{"$error":"#N/A"}},{"$f":"IF(input!I8<>\"\",input!I8,CC9)","v":{"$error":"#N/A"}},null,74.05,73.95,73.988653335194286,74.011068887027918,73.97744555927747,74.022276662944734,73.966237783360654,74.033484438861549,73.999861111111102,null,null,null,-2,73.97744555927747,3,6,73.932614455610207,null,null,4,73.983000000000004,4,6.6237665076470872E-2,0.93376233492352911,1.5629406028370485E-2,-48.111750093892184,-1.634232957632384]
[null,5,{"$f":"IF(input!E9=\"\",\"\",input!E9)","v":73.992000000000004},{"$f":"IF(input!F9=\"\",\"\",input!F9)","v":74.007000000000005},{"$f":"IF(input!G9=\"\",\"\",input!G9)","v":""},{"$f":"IF(input!H9=\"\",\"\",input!H9)","v":""},{"$f":"IF(input!I9=\"\",\"\",input!I9)","v":""},null,null,null,null,5,73.992000000000004,74.007000000000005,"","","",null,0,0,0,0,0,null,null,null,73.999500000000012,7.5000000000002842E-3,1.5000000000000568E-2,null,5,73.999861111111102,73.999500000000012,74.0252411111111,73.974481111111103,1.3500000000000512E-2,1.5000000000000568E-2,4.4145000000001676E-2,null,null,5,73.988,0,0,null,null,"E7",{"$f":"IF($M$9=\"\",\"\",$M$9)","v":73.988},null,null,{"$f":"IF($N$8=\"\",\"\",$N$8)","v":73.992000000000004},null,"E6",{"$f":"IF($M$8=\"\",\"\",$M$8)","v":73.995000000000005},null,null,{"$f":"IF($Q$7=\"\",\"\",$Q$7)","v":""},null,null,"Unterer Grenzwert UGW =",{"$f":"IF(output!S16=\"\",\"\",output!S16)","v":73.95},null,null,null,null,null,null,null,null,null,null,null,null,null,5,5,{"$f":"IF(input!E9<>\"\",input!E9,BY10)","v":73.992000000000004},{"$f":"IF(input!F9<>\"\",input!F9,BZ10)","v":74.007000000000005},{"$f":"IF(input!G9<>\"\",input!G9,CA10)","v":{"$error":"#N/A"}},{"$f":"IF(input!H9<>\"\",input!H9,CB10)","v":{"$error":"#N/A"}},{"$f":"IF(input!I9<>\"\",input!I9,CC10)","v":{"$error":"#N/A"}},null,74.05,73.95,73.988653335194286,74.011068887027918,73.97744555927747,74.022276662944734,73.966237783360654,74.033484438861549,73.999861111111102,null,null,null,-1,73.988653335194286,3,6,73.932614455610207,null,null,5,73.983999999999995,5,7.8506666243775461E-2,0.92149333375622455,8.8387981123275838E-2,-44.735319146000904,-1.5147558137079753]
[null,6,{"$f":"IF(input!E10=\"\",\"\",input!E10)","v":74.009},{"$f":"IF(input!F10=\"\",\"\",input!F10)","v":73.994},{"$f":"IF(input!G10=\"\",\"\",input!G10)","v":""},{"$f":"IF(input!H10=\"\",\"\",input!H10)","v":""},{"$f":"IF(input!I10=\"\",\"\",input!I10)","v":""},null,null,null,null,6,74.009,73.994,"","","",null,0,0,0,0,0,null,null,null,74.001499999999993,7.5000000000002842E-3,1.5000000000000568E-2,null,6,73.999861111111102,74.001499999999993,74.0252411111111,73.974481111111103,1.3500000000000512E-2,1.5000000000000568E-2,4.4145000000001676E-2,null,null,6,74.024000000000001,0,0,null,null,null,{"$f":"IF($N$9=\"\",\"\",$N$9)","v":74.024000000000001},null,null,{"$f":"IF($O$8=\"\",\"\",$O$8)","v":""},null,null,{"$f":"IF($N$8=\"\",\"\",$N$8)","v":73.992000000000004},null,"E6",{"$f":"IF($M$8=\"\",\"\",$M$8)","v":73.995000000000005},null,null,"Oberer Grenzwert OGW =",{"$f":"IF(output!S17=\"\",\"\",output!S17)","v":74.05},null,null,null,null,null,null,null,null,null,null,null,null,null,6,6,{"$f":"IF(input!E10<>\"\",input!E10,BY11)","v":74.009},{"$f":"IF(input!F10<>\"\",input!F10,BZ11)","v":73.994},{"$f":"IF(input!G10<>\"\",input!G10,CA11)","v":{"$error":"#N/A"}},{"$f":"IF(input!H10<>\"\",input!H10,CB11)","v":{"$error":"#N/A"}},{"$f":"IF(input!I10<>\"\",input!I10,CC11)","v":{"$error":"#N/A"}},null,74.05,73.95,73.988653335194286,74.011068887027918,73.97744555927747,74.022276662944734,73.966237783360654,74.033484438861549,73.999861111111102,null,null,null,1,74.011068887027918,3,6,73.932614455610207,null,null,6,73.983999999999995,6,7.8506666243775461E-2,0.92149333375622455,0.1035598993364506,-52.933945169895722,-1.4136708652538128,null,"Summe S",{"$f":"SUM(Normalverteilung_S)","v":-5224.3506180732256}]
[null,7,{"$f":"IF(input!E11=\"\",\"\",input!E11)","v":73.995000000000005},{"$f":"IF(input!F11=\"\",\"\",input!F11)","v":74.006},{"$f":"IF(input!G11=\"\",\"\",input!G11)","v":""},{"$f":"IF(input!H11=\"\",\"\",input!H11)","v":""},{"$f":"IF(input!I11=\"\",\"\",input!I11)","v":""},null,null,null,null,7,73.995000000000005,74.006,"","","",null,0,0,0,0,0,null,null,null,74.000500000000002,5.49999999999784E-3,1.099999999999568E-2,null,7,73.999861111111102,74.000500000000002,74.0252411111111,73.974481111111103,1.3500000000000512E-2,1.099999999999568E-2,4.4145000000001676E-2,null,null,7,74.001999999999995,0,0,null,null,"E8",{"$f":"IF($M$10=\"\",\"\",$M$10)","v":74.001999999999995},null,"E7",{"$f":"IF($M$9=\"\",\"\",$M$9)","v":73.988},null,null,{"$f":"IF($O$8=\"\",\"\",$O$8)","v":""},null,null,{"$f":"IF($N$8=\"\",\"\",$N$8)","v":73.992000000000004},null,null,null,null,null,null,null,null,null,null,null,null,null,null,null,null,null,7,7,{"$f":"IF(input!E11<>\"\",input!E11,BY12)","v":73.995000000000005},{"$f":"IF(input!F11<>\"\",input!F11,BZ12)","v":74.006},{"$f":"IF(input!G11<>\"\",input!G11,CA12)","v":{"$error":"#N/A"}},{"$f":"IF(input!H11<>\"\",input!H11,CB12)","v":{"$error":"#N/A"}},{"$f":"IF(input!I11<>\"\",input!I11,CC12)","v":{"$error":"#N/A"}},null,74.05,73.95,73.988653335194286,74.011068887027918,73.97744555927747,74.022276662944734,73.966237783360654,74.033484438861549,73.999861111111102,null,null,null,2,74.022276662944734,3,6,73.932614455610207,null,null,7,73.983999999999995,7,7.8506666243775461E-2,0.92149333375622455,0.13938704291776216,-58.695942128358261,-1.3252662073492218,null,"AD",{"$f":"-DH12/Anzahl-Anzahl","v":0.56042525101702267}]
[null,8,{"$f":"IF(input!E12=\"\",\"\",input!E12)","v":73.984999999999999},{"$f":"IF(input!F12=\"\",\"\",input!F12)","v":74.003},{"$f":"IF(input!G12=\"\",\"\",input!G12)","v":""},{"$f":"IF(input!H12=\"\",\"\",input!H12)","v":""},{"$f":"IF(input!I12=\"\",\"\",input!I12)","v":""},null,null,null,null,8,73.984999999999999,74.003,"","","",null,0,0,0,0,0,null,null,null,{"$f":"IF(M14<>\"\",AVERAGE(M14:Q14),\"\")","v":73.994},9.0000000000003411E-3,{"$f":"IF(M14<>\"\",MAX(M14:Q14)-MIN(M14:Q14),\"\")","v":1.8000000000000682E-2},null,8,73.999861111111102,73.994,74.0252411111111,73.974481111111103,1.3500000000000512E-2,1.8000000000000682E-2,4.4145000000001676E-2,null,null,8,73.995999999999995,0,0,null,null,null,{"$f":"IF($N$10=\"\",\"\",$N$10)","v":73.995999999999995},null,null,{"$f":"IF($N$9=\"\",\"\",$N$9)","v":74.024000000000001},null,null,{"$f":"IF($P$8=\"\",\"\",$P$8)","v":""},null,null,{"$f":"IF($O$8=\"\",\"\",$O$8)","v":""},null,null,"Umfang der Stichprobe",{"$f":"COUNT(xi)","v":72},null,null,"Konstanten",null,null,null,null,null,null,null,null,null,null,8,8,{"$f":"IF(input!E12<>\"\",input!E12,BY13)","v":73.984999999999999},{"$f":"IF(input!F12<>\"\",input!F12,BZ13)","v":74.003},{"$f":"IF(input!G12<>\"\",input!G12,CA13)","v":{"$error":"#N/A"}},{"$f":"IF(input!H12<>\"\",input!H12,CB13)","v":{"$error":"#N/A"}},{"$f":"IF(input!I12<>\"\",input!I12,CC13)","v":{"$error":"#N/A"}},null,74.05,73.95,73.988653335194286,74.011068887027918,73.97744555927747,74.022276662944734,73.966237783360654,74.033484438861549,73.999861111111102,null,null,null,4,74.044692214778365,3,6,73.932614455610207,null,null,8,73.984999999999999,8,9.2425745998114761E-2,0.90757425400188518,0.13938704291776216,-65.277756550783636,-1.2461558548617906,null,"AD*",{"$f":"DH13*(1+0.75/Anzahl+2.25/Anzahl^2)","v":0.56650625417475942}]
[null,9,{"$f":"IF(input!E13=\"\",\"\",input!E13)","v":74.007999999999996},{"$f":"IF(input!F13=\"\",\"\",input!F13)","v":73.995000000000005},{"$f":"IF(input!G13=\"\",\"\",input!G13)","v":""},{"$f":"IF(input!H13=\"\",\"\",input!H13)","v":""},{"$f":"IF(input!I13=\"\",\"\",input!I13)","v":""},null,null,null,null,9,74.007999999999996,73.995000000000005,"","","",null,0,0,0,0,0,null,null,null,{"$f":"IF(M15<>\"\",AVERAGE(M15:Q15),\"\")","v":74.001499999999993},6.4999999999955094E-3,{"$f":"IF(M15<>\"\",MAX(M15:Q15)-MIN(M15:Q15),\"\")","v":1.2999999999991019E-2},null,9,73.999861111111102,74.001499999999993,74.0252411111111,73.974481111111103,1.3500000000000512E-2,1.2999999999991019E-2,4.4145000000001676E-2,null,null,9,73.992000000000004,0,0,null,null,"E9",{"$f":"IF($M$11=\"\",\"\",$M$11)","v":73.992000000000004},null,null,{"$f":"IF($O$9=\"\",\"\",$O$9)","v":""},null,"E7",{"$f":"IF($M$9=\"\",\"\",$M$9)","v":73.988},null,null,{"$f":"IF($P$8=\"\",\"\",$P$8)","v":""},null,null,"Mittelwert m",{"$f":"AVERAGE(xi)","v":73.999861111111102},null,null,"n","A2","D4","D3","d2",null,null,null,null,null,null,9,9,{"$f":"IF(input!E13<>\"\",input!E13,BY14)","v":74.007999999999996},{"$f":"IF(input!F13<>\"\",input!F13,BZ14)","v":73.995000000000005},{"$f":"IF(input!G13<>\"\",input!G13,CA14)","v":{"$error":"#N/A"}},{"$f":"IF(input!H13<>\"\",input!H13,CB14)","v":{"$error":"#N/A"}},{"$f":"IF(input!I13<>\"\",input!I13,CC14)","v":{"$error":"#N/A"}},null,74.05,73.95,73.988653335194286,74.011068887027918,73.97744555927747,74.022276662944734,73.966237783360654,74.033484438861549,73.999861111111102,null,null,null,5,74.055899990695181,3,6,73.932614455610207,null,null,9,73.984999999999999,9,9.2425745998114761E-2,0.90757425400188518,0.18283076229988848,-69.369248901121722,-1.1741586334672611]
[null,10,{"$f":"IF(input!E14=\"\",\"\",input!E14)","v":73.998000000000005},{"$f":"IF(input!F14=\"\",\"\",input!F14)","v":74},{"$f":"IF(input!G14=\"\",\"\",input!G14)","v":""},{"$f":"IF(input!H14=\"\",\"\",input!H14)","v":""},{"$f":"IF(input!I14=\"\",\"\",input!I14)","v":""},null,null,null,null,10,73.998000000000005,74,"","","",null,0,0,0,0,0,null,null,null,73.998999999999995,9.9999999999766942E-4,1.9999999999953388E-3,null,10,73.999861111111102,73.998999999999995,74.0252411111111,73.974481111111103,1.3500000000000512E-2,1.9999999999953388E-3,4.4145000000001676E-2,null,null,10,74.007000000000005,0,0,null,null,null,{"$f":"IF($N$11=\"\",\"\",$N$11)","v":74.007000000000005},null,"E8",{"$f":"IF($M$10=\"\",\"\",$M$10)","v":74.001999999999995},null,null,{"$f":"IF($N$9=\"\",\"\",$N$9)","v":74.024000000000001},null,null,{"$f":"IF($Q$8=\"\",\"\",$Q$8)","v":""},null,null,"Standardabweichung s gesamt",{"$f":"STDEV(xi)","v":1.1207775916816397E-2},null,null,1,2.66,3.27,0,1.1279999999999999,null,null,null,null,null,null,10,10,{"$f":"IF(input!E14<>\"\",input!E14,BY15)","v":73.998000000000005},{"$f":"IF(input!F14<>\"\",input!F14,BZ15)","v":74},{"$f":"IF(input!G14<>\"\",input!G14,CA15)","v":{"$error":"#N/A"}},{"$f":"IF(input!H14<>\"\",input!H14,CB15)","v":{"$error":"#N/A"}},{"$f":"IF(input!I14<>\"\",input!I14,CC15)","v":{"$error":"#N/A"}},null,74.05,73.95,73.988653335194286,74.011068887027918,73.97744555927747,74.022276662944734,73.966237783360654,74.033484438861549,73.999861111111102,null,null,null,6,74.067107766611997,3,6,73.932614455610207,null,null,10,73.988,10,0.1449609252807986,0.85503907471920138,0.18283076229988848,-68.979222674178303,-1.1077824039874553]
[null,11,{"$f":"IF(input!E15=\"\",\"\",input!E15)","v":73.994},{"$f":"IF(input!F15=\"\",\"\",input!F15)","v":73.998000000000005},{"$f":"IF(input!G15=\"\",\"\",input!G15)","v":""},{"$f":"IF(input!H15=\"\",\"\",input!H15)","v":""},{"$f":"IF(input!I15=\"\",\"\",input!I15)","v":""},null,null,null,null,11,73.994,73.998000000000005,"","","",null,0,0,0,0,0,null,null,null,73.996000000000009,2.0000000000024443E-3,4.0000000000048885E-3,null,11,73.999861111111102,73.996000000000009,74.0252411111111,73.974481111111103,1.3500000000000512E-2,4.0000000000048885E-3,4.4145000000001676E-2,null,null,11,74.009,0,0,null,null,"E10",{"$f":"IF($M$12=\"\",\"\",$M$12)","v":74.009},null,null,{"$f":"IF($N$10=\"\",\"\",$N$10)","v":73.995999999999995},null,null,{"$f":"IF($O$9=\"\",\"\",$O$9)","v":""},null,"E7",{"$f":"IF($M$9=\"\",\"\",$M$9)","v":73.988},null,null,null,null,null,null,2,1.88,3.27,0,1.1279999999999999,null,null,null,null,null,null,11,11,{"$f":"IF(input!E15<>\"\",input!E15,BY16)","v":73.994},{"$f":"IF(input!F15<>\"\",input!F15,BZ16)","v":73.998000000000005},{"$f":"IF(input!G15<>\"\",input!G15,CA16)","v":{"$error":"#N/A"}},{"$f":"IF(input!H15<>\"\",input!H15,CB16)","v":{"$error":"#N/A"}},{"$f":"IF(input!I15<>\"\",input!I15,CC16)","v":{"$error":"#N/A"}},null,74.05,73.95,73.988653335194286,74.011068887027918,73.97744555927747,74.022276662944734,73.966237783360654,74.033484438861549,73.999861111111102,null,null,null,-3,73.966237783360654,3,6,73.932614455610207,null,null,11,73.988,11,0.1449609252807986,0.85503907471920138,0.18283076229988848,-76.240193481986537,-1.0459586790681843,null,"p1",{"$f":"IF(AND(DH14<13, DH14>=0.6),EXP(1.2937-5.709*DH14+0.0186*DH14^ 2),0)","v":0}]
[null,12,{"$f":"IF(input!E16=\"\",\"\",input!E16)","v":74.004000000000005},{"$f":"IF(input!F16=\"\",\"\",input!F16)","v":74},{"$f":"IF(input!G16=\"\",\"\",input!G16)","v":""},{"$f":"IF(input!H16=\"\",\"\",input!H16)","v":""},{"$f":"IF(input!I16=\"\",\"\",input!I16)","v":""},null,null,null,null,12,74.004000000000005,74,"","","",null,0,0,0,0,0,null,null,null,74.00200000000001,2.0000000000024443E-3,4.0000000000048885E-3,null,12,73.999861111111102,74.00200000000001,74.0252411111111,73.974481111111103,1.3500000000000512E-2,4.0000000000048885E-3,4.4145000000001676E-2,null,null,12,73.994,0,0,null,null,null,{"$f":"IF($N$12=\"\",\"\",$N$12)","v":73.994},null,null,{"$f":"IF($O$10=\"\",\"\",$O$10)","v":""},null,null,{"$f":"IF($P$9=\"\",\"\",$P$9)","v":""},null,null,{"$f":"IF($N$9=\"\",\"\",$N$9)","v":74.024000000000001},null,null,null,"Fähigkeitskennwerte",null,null,3,1.0229999999999999,2.5750000000000002,0,1.6930000000000001,null,null,null,null,null,null,12,12,{"$f":"IF(input!E16<>\"\",input!E16,BY17)","v":74.004000000000005},{"$f":"IF(input!F16<>\"\",input!F16,BZ17)","v":74},{"$f":"IF(input!G16<>\"\",input!G16,CA17)","v":{"$error":"#N/A"}},{"$f":"IF(input!H16<>\"\",input!H16,CB17)","v":{"$error":"#N/A"}},{"$f":"IF(input!I16<>\"\",input!I16,CC17)","v":{"$error":"#N/A"}},null,74.05,73.95,73.988653335194286,74.011068887027918,73.97744555927747,74.022276662944734,73.966237783360654,74.033484438861549,73.999861111111102,null,null,null,3,74.033484438861549,3,6,73.932614455610207,null,null,12,73.989000000000004,12,0.16625530698199217,0.8337446930180078,0.20741995590861839,-77.446530272963315,-0.98789429474054891,null,"p2",{"$f":"IF(AND(DH14<0.6,DH14>=0.34),EXP(0.9177-4.279*DH14-1.38*DH14^2),0)","v":0.1423790024872541}]
[null,13,{"$f":"IF(input!E17=\"\",\"\",input!E17)","v":73.983000000000004},{"$f":"IF(input!F17=\"\",\"\",input!F17)","v":74.001999999999995},{"$f":"IF(input!G17=\"\",\"\",input!G17)","v":""},{"$f":"IF(input!H17=\"\",\"\",input!H17)","v":""},{"$f":"IF(input!I17=\"\",\"\",input!I17)","v":""},null,null,null,null,13,73.983000000000004,74.001999999999995,"","","",null,0,0,0,0,0,null,null,null,73.992500000000007,9.4999999999956231E-3,1.8999999999991246E-2,null,13,73.999861111111102,73.992500000000007,74.0252411111111,73.974481111111103,1.3500000000000512E-2,1.8999999999991246E-2,4.4145000000001676E-2,null,null,13,73.995000000000005,0,0,null,null,"E11",{"$f":"IF($M$13=\"\",\"\",$M$13)","v":73.995000000000005},null,"E9",{"$f":"IF($M$11=\"\",\"\",$M$11)","v":73.992000000000004},null,"E8",{"$f":"IF($M$10=\"\",\"\",$M$10)","v":74.001999999999995},null,null,{"$f":"IF($O$9=\"\",\"\",$O$9)","v":""},null,null,"Ppu",{"$f":"IF(BI11<>\"\",(BI15-BI11)/(3*BI16),\"\")","v":1.4829320726718611},null,null,4,0.72899999999999998,2.282,0,2.0590000000000002,null,null,null,null,null,null,13,13,{"$f":"IF(input!E17<>\"\",input!E17,BY18)","v":73.983000000000004},{"$f":"IF(input!F17<>\"\",input!F17,BZ18)","v":74.001999999999995},{"$f":"IF(input!G17<>\"\",input!G17,CA18)","v":{"$error":"#N/A"}},{"$f":"IF(input!H17<>\"\",input!H17,CB18)","v":{"$error":"#N/A"}},{"$f":"IF(input!I17<>\"\",input!I17,CC18)","v":{"$error":"#N/A"}},null,74.05,73.95,73.988653335194286,74.011068887027918,73.97744555927747,74.022276662944734,73.966237783360654,74.033484438861549,73.999861111111102,null,null,null,null,null,null,null,null,null,null,13,73.992000000000004,13,0.241527338847002,0.75847266115299794,0.20741995590861839,-74.844559408808436,-0.93298303198639865,null,"p3",{"$f":"IF(AND(DH14<0.34,DH14>=0.2),1-EXP(-8.318+42.796*DH14-59.938*DH14^2),0)","v":0}]
[null,14,{"$f":"IF(input!E18=\"\",\"\",input!E18)","v":74.006},{"$f":"IF(input!F18=\"\",\"\",input!F18)","v":73.966999999999999},{"$f":"IF(input!G18=\"\",\"\",input!G18)","v":""},{"$f":"IF(input!H18=\"\",\"\",input!H18)","v":""},{"$f":"IF(input!I18=\"\",\"\",input!I18)","v":""},null,null,null,null,14,74.006,73.966999999999999,"","","",null,0,0,0,0,0,null,null,null,73.986500000000007,1.9500000000000739E-2,3.9000000000001478E-2,null,14,73.999861111111102,73.986500000000007,74.0252411111111,73.974481111111103,1.3500000000000512E-2,3.9000000000001478E-2,4.4145000000001676E-2,null,null,14,74.006,0,0,null,null,null,{"$f":"IF($N$13=\"\",\"\",$N$13)","v":74.006},null,null,{"$f":"IF($N$11=\"\",\"\",$N$11)","v":74.007000000000005},null,null,{"$f":"IF($N$10=\"\",\"\",$N$10)","v":73.995999999999995},null,null,{"$f":"IF($P$9=\"\",\"\",$P$9)","v":""},null,null,"Ppo",{"$f":"IF(BI12<>\"\",(BI12-BI15)/(3*BI16),\"\")","v":1.491193532687304},null,null,5,0.57699999999999996,2.1150000000000002,0,2.3260000000000001,null,null,null,null,null,null,14,14,{"$f":"IF(input!E18<>\"\",input!E18,BY19)","v":74.006},{"$f":"IF(input!F18<>\"\",input!F18,BZ19)","v":73.966999999999999},{"$f":"IF(input!G18<>\"\",input!G18,CA19)","v":{"$error":"#N/A"}},{"$f":"IF(input!H18<>\"\",input!H18,CB19)","v":{"$error":"#N/A"}},{"$f":"IF(input!I18<>\"\",input!I18,CC19)","v":{"$error":"#N/A"}},null,74.05,73.95,73.988653335194286,74.011068887027918,73.97744555927747,74.022276662944734,73.966237783360654,74.033484438861549,73.999861111111102,null,null,null,"Mittelwert",{"$f":"Mittelwert","v":73.999861111111102},3,null,null,null,null,14,73.992000000000004,14,0.241527338847002,0.75847266115299794,0.23386350979497672,-77.592336297500808,-0.8807502013555859,null,"p4",{"$f":"IF(DH14<0.2,1-EXP(-13.436+101.14*DH14-223.73*DH14^2),0)","v":0}]
[null,15,{"$f":"IF(input!E19=\"\",\"\",input!E19)","v":74.012},{"$f":"IF(input!F19=\"\",\"\",input!F19)","v":74.013999999999996},{"$f":"IF(input!G19=\"\",\"\",input!G19)","v":""},{"$f":"IF(input!H19=\"\",\"\",input!H19)","v":""},{"$f":"IF(input!I19=\"\",\"\",input!I19)","v":""},null,null,null,null,15,74.012,74.013999999999996,"","","",null,0,0,0,0,0,null,null,null,74.013000000000005,9.9999999999766942E-4,1.9999999999953388E-3,null,15,73.999861111111102,74.013000000000005,74.0252411111111,73.974481111111103,1.3500000000000512E-2,1.9999999999953388E-3,4.4145000000001676E-2,null,null,15,73.984999999999999,0,0,null,null,"E12",{"$f":"IF($M$14=\"\",\"\",$M$14)","v":73.984999999999999},null,null,{"$f":"IF($O$11=\"\",\"\",$O$11)","v":""},null,null,{"$f":"IF($O$10=\"\",\"\",$O$10)","v":""},null,null,{"$f":"IF($Q$9=\"\",\"\",$Q$9)","v":""},null,null,"Pp",{"$f":"IF(OR(BI11=\"\",BI12=\"\"),\"\",(BI12-BI11)/(6*BI16))","v":1.4870628026795827},null,null,null,null,null,null,null,null,null,null,null,null,null,15,15,{"$f":"IF(input!E19<>\"\",input!E19,BY20)","v":74.012},{"$f":"IF(input!F19<>\"\",input!F19,BZ20)","v":74.013999999999996},{"$f":"IF(input!G19<>\"\",input!G19,CA20)","v":{"$error":"#N/A"}},{"$f":"IF(input!H19<>\"\",input!H19,CB20)","v":{"$error":"#N/A"}},{"$f":"IF(input!I19<>\"\",input!I19,CC20)","v":{"$error":"#N/A"}},null,74.05,73.95,73.988653335194286,74.011068887027918,73.97744555927747,74.022276662944734,73.966237783360654,74.033484438861549,73.999861111111102,null,null,null,"OGW",{"$f":"OGW","v":74.05},3,null,null,null,null,15,73.992000000000004,15,0.241527338847002,0.75847266115299794,0.23386350979497672,-83.339916763982359,-0.83081641494276337]
[null,16,{"$f":"IF(input!E20=\"\",\"\",input!E20)","v":74},{"$f":"IF(input!F20=\"\",\"\",input!F20)","v":73.983999999999995},{"$f":"IF(input!G20=\"\",\"\",input!G20)","v":""},{"$f":"IF(input!H20=\"\",\"\",input!H20)","v":""},{"$f":"IF(input!I20=\"\",\"\",input!I20)","v":""},null,null,null,null,16,74,73.983999999999995,"","","",null,0,0,0,0,0,null,null,null,73.99199999999999,8.0000000000026716E-3,1.6000000000005343E-2,null,16,73.999861111111102,73.99199999999999,74.0252411111111,73.974481111111103,1.3500000000000512E-2,1.6000000000005343E-2,4.4145000000001676E-2,null,null,16,74.003,0,0,null,null,null,{"$f":"IF($N$14=\"\",\"\",$N$14)","v":74.003},null,"E10",{"$f":"IF($M$12=\"\",\"\",$M$12)","v":74.009},null,null,{"$f":"IF($P$10=\"\",\"\",$P$10)","v":""},null,"E8",{"$f":"IF($M$10=\"\",\"\",$M$10)","v":74.001999999999995},null,null,"Ppk",{"$f":"IF(BI12=\"\",BI19,IF(BI11=\"\",BI20,MIN(BI19,BI20)))","v":1.4829320726718611},null,null,null,null,null,null,null,null,null,null,null,null,null,16,16,{"$f":"IF(input!E20<>\"\",input!E20,BY21)","v":74},{"$f":"IF(input!F20<>\"\",input!F20,BZ21)","v":73.983999999999995},{"$f":"IF(input!G20<>\"\",input!G20,CA21)","v":{"$error":"#N/A"}},{"$f":"IF(input!H20<>\"\",input!H20,CB21)","v":{"$error":"#N/A"}},{"$f":"IF(input!I20<>\"\",input!I20,CC21)","v":{"$error":"#N/A"}},null,74.05,73.95,73.988653335194286,74.011068887027918,73.97744555927747,74.022276662944734,73.966237783360654,74.033484438861549,73.999861111111102,null,null,null,"UGW",{"$f":"UGW","v":73.95},3,null,null,null,null,16,73.992000000000004,16,0.241527338847002,0.75847266115299794,0.23386350979497672,-89.087497230463896,-0.78287306252506605,null,"p Wert",{"$f":"MAX(DH17:DH20)","v":0.1423790024872541}]
[null,17,{"$f":"IF(input!E21=\"\",\"\",input!E21)","v":73.994},{"$f":"IF(input!F21=\"\",\"\",input!F21)","v":74.012},{"$f":"IF(input!G21=\"\",\"\",input!G21)","v":""},{"$f":"IF(input!H21=\"\",\"\",input!H21)","v":""},{"$f":"IF(input!I21=\"\",\"\",input!I21)","v":""},null,null,null,null,17,73.994,74.012,"","","",null,0,0,0,0,0,null,null,null,74.003,9.0000000000003411E-3,1.8000000000000682E-2,null,17,73.999861111111102,74.003,74.0252411111111,73.974481111111103,1.3500000000000512E-2,1.8000000000000682E-2,4.4145000000001676E-2,null,null,17,74.007999999999996,0,0,null,null,"E13",{"$f":"IF($M$15=\"\",\"\",$M$15)","v":74.007999999999996},null,null,{"$f":"IF($N$12=\"\",\"\",$N$12)","v":73.994},null,"E9",{"$f":"IF($M$11=\"\",\"\",$M$11)","v":73.992000000000004},null,null,{"$f":"IF($N$10=\"\",\"\",$N$10)","v":73.995999999999995},null,null,null,null,null,null,null,null,null,null,null,null,null,null,null,null,null,17,17,{"$f":"IF(input!E21<>\"\",input!E21,BY22)","v":73.994},{"$f":"IF(input!F21<>\"\",input!F21,BZ22)","v":74.012},{"$f":"IF(input!G21<>\"\",input!G21,CA22)","v":{"$error":"#N/A"}},{"$f":"IF(input!H21<>\"\",input!H21,CB22)","v":{"$error":"#N/A"}},{"$f":"IF(input!I21<>\"\",input!I21,CC22)","v":{"$error":"#N/A"}},null,74.05,73.95,73.988653335194286,74.011068887027918,73.97744555927747,74.022276662944734,73.966237783360654,74.033484438861549,73.999861111111102,null,null,null,"Sollwert",{"$f":"Sollwert","v":74},3,null,null,null,null,17,73.994,17,0.30050436846371059,0.69949563153628946,0.26207592605656072,-83.866662359367766,-0.73666521261450413]
[null,18,{"$f":"IF(input!E22=\"\",\"\",input!E22)","v":74.006},{"$f":"IF(input!F22=\"\",\"\",input!F22)","v":74.010000000000005},{"$f":"IF(input!G22=\"\",\"\",input!G22)","v":""},{"$f":"IF(input!H22=\"\",\"\",input!H22)","v":""},{"$f":"IF(input!I22=\"\",\"\",input!I22)","v":""},null,null,null,null,18,74.006,74.010000000000005,"","","",null,0,0,0,0,0,null,null,null,74.00800000000001,2.0000000000024443E-3,4.0000000000048885E-3,null,18,73.999861111111102,74.00800000000001,74.0252411111111,73.974481111111103,1.3500000000000512E-2,4.0000000000048885E-3,4.4145000000001676E-2,null,null,18,73.995000000000005,0,0,null,null,null,{"$f":"IF($N$15=\"\",\"\",$N$15)","v":73.995000000000005},null,null,{"$f":"IF($O$12=\"\",\"\",$O$12)","v":""},null,null,{"$f":"IF($N$11=\"\",\"\",$N$11)","v":74.007000000000005},null,null,{"$f":"IF($O$10=\"\",\"\",$O$10)","v":""},null,null,"Median z",{"$f":"MEDIAN(xi)","v":74},null,null,null,null,null,null,null,null,null,null,null,null,null,18,18,{"$f":"IF(input!E22<>\"\",input!E22,BY23)","v":74.006},{"$f":"IF(input!F22<>\"\",input!F22,BZ23)","v":74.010000000000005},{"$f":"IF(input!G22<>\"\",input!G22,CA23)","v":{"$error":"#N/A"}},{"$f":"IF(input!H22<>\"\",input!H22,CB23)","v":{"$error":"#N/A"}},{"$f":"IF(input!I22<>\"\",input!I22,CC23)","v":{"$error":"#N/A"}},null,74.05,73.95,{"$f":"CG23","v":73.988653335194286},74.011068887027918,73.97744555927747,74.022276662944734,73.966237783360654,74.033484438861549,73.999861111111102,null,null,null,null,null,null,null,null,null,null,18,73.994,18,0.30050436846371059,0.69949563153628946,0.26207592605656072,-88.949490381147626,-0.69197938333281805]
[null,19,{"$f":"IF(input!E23=\"\",\"\",input!E23)","v":73.983999999999995},{"$f":"IF(input!F23=\"\",\"\",input!F23)","v":74.001999999999995},{"$f":"IF(input!G23=\"\",\"\",input!G23)","v":""},{"$f":"IF(input!H23=\"\",\"\",input!H23)","v":""},{"$f":"IF(input!I23=\"\",\"\",input!I23)","v":""},null,null,null,null,19,73.983999999999995,74.001999999999995,"","","",null,0,0,0,0,0,null,null,null,73.992999999999995,9.0000000000003411E-3,1.8000000000000682E-2,null,19,73.999861111111102,73.992999999999995,74.0252411111111,73.974481111111103,1.3500000000000512E-2,1.8000000000000682E-2,4.4145000000001676E-2,null,null,19,73.998000000000005,0,0,null,null,"E14",{"$f":"IF($M$16=\"\",\"\",$M$16)","v":73.998000000000005},null,"E11",{"$f":"IF($M$13=\"\",\"\",$M$13)","v":73.995000000000005},null,null,{"$f":"IF($O$11=\"\",\"\",$O$11)","v":""},null,null,{"$f":"IF($P$10=\"\",\"\",$P$10)","v":""},null,null,"Spannweite R",{"$f":"Maximum-Minimum","v":6.3000000000002387E-2},null,null,null,null,null,null,null,null,null,null,null,null,null,19,19,{"$f":"IF(input!E23<>\"\",input!E23,BY24)","v":73.983999999999995},{"$f":"IF(input!F23<>\"\",input!F23,BZ24)","v":74.001999999999995},{"$f":"IF(input!G23<>\"\",input!G23,CA24)","v":{"$error":"#N/A"}},{"$f":"IF(input!H23<>\"\",input!H23,CB24)","v":{"$error":"#N/A"}},{"$f":"IF(input!I23<>\"\",input!I23,CC24)","v":{"$error":"#N/A"}},null,74.05,73.95,73.988653335194286,74.011068887027918,73.97744555927747,74.022276662944734,73.966237783360654,74.033484438861549,73.999861111111102,null,null,null,null,null,null,null,null,null,null,19,73.994,19,0.30050436846371059,0.69949563153628946,0.29193701700704877,-90.039876769388513,-0.64863460018193808]
[null,20,{"$f":"IF(input!E24=\"\",\"\",input!E24)","v":74},{"$f":"IF(input!F24=\"\",\"\",input!F24)","v":74.010000000000005},{"$f":"IF(input!G24=\"\",\"\",input!G24)","v":""},{"$f":"IF(input!H24=\"\",\"\",input!H24)","v":""},{"$f":"IF(input!I24=\"\",\"\",input!I24)","v":""},null,null,null,null,20,74,74.010000000000005,"","","",null,0,0,0,0,0,null,null,null,74.004999999999995,5.000000000002558E-3,1.0000000000005116E-2,null,20,73.999861111111102,74.004999999999995,74.0252411111111,73.974481111111103,1.3500000000000512E-2,1.0000000000005116E-2,4.4145000000001676E-2,null,null,20,74,0,0,null,null,null,{"$f":"IF($N$16=\"\",\"\",$N$16)","v":74},null,null,{"$f":"IF($N$13=\"\",\"\",$N$13)","v":74.006},null,null,{"$f":"IF($P$11=\"\",\"\",$P$11)","v":""},null,null,{"$f":"IF($Q$10=\"\",\"\",$Q$10)","v":""},null,null,"Minimum",{"$f":"MIN(xi)","v":73.966999999999999},null,null,null,null,null,null,null,null,null,null,null,null,null,20,20,{"$f":"IF(input!E24<>\"\",input!E24,BY25)","v":74},{"$f":"IF(input!F24<>\"\",input!F24,BZ25)","v":74.010000000000005},{"$f":"IF(input!G24<>\"\",input!G24,CA25)","v":{"$error":"#N/A"}},{"$f":"IF(input!H24<>\"\",input!H24,CB25)","v":{"$error":"#N/A"}},{"$f":"IF(input!I24<>\"\",input!I24,CC25)","v":{"$error":"#N/A"}},null,74.05,73.95,73.988653335194286,74.011068887027918,73.97744555927747,74.022276662944734,73.966237783360654,74.033484438861549,73.999861111111102,null,null,null,null,null,null,null,null,null,null,20,73.994,20,0.30050436846371059,0.69949563153628946,0.29193701700704877,-94.906897135301421,-0.60647572828941831]
[null,21,{"$f":"IF(input!E25=\"\",\"\",input!E25)","v":73.981999999999999},{"$f":"IF(input!F25=\"\",\"\",input!F25)","v":74.001000000000005},{"$f":"IF(input!G25=\"\",\"\",input!G25)","v":""},{"$f":"IF(input!H25=\"\",\"\",input!H25)","v":""},{"$f":"IF(input!I25=\"\",\"\",input!I25)","v":""},null,null,null,null,21,73.981999999999999,74.001000000000005,"","","",null,0,0,0,0,0,null,null,null,73.991500000000002,9.5000000000027285E-3,1.9000000000005457E-2,null,21,73.999861111111102,73.991500000000002,74.0252411111111,73.974481111111103,1.3500000000000512E-2,1.9000000000005457E-2,4.4145000000001676E-2,null,null,21,73.994,0,0,null,null,"E15",{"$f":"IF($M$17=\"\",\"\",$M$17)","v":73.994},null,null,{"$f":"IF($O$13=\"\",\"\",$O$13)","v":""},null,"E10",{"$f":"IF($M$12=\"\",\"\",$M$12)","v":74.009},null,"E9",{"$f":"IF($M$11=\"\",\"\",$M$11)","v":73.992000000000004},null,null,"Maximum",{"$f":"MAX(xi)","v":74.03},null,null,null,null,null,null,null,null,null,null,null,null,null,21,21,{"$f":"IF(input!E25<>\"\",input!E25,BY26)","v":73.981999999999999},{"$f":"IF(input!F25<>\"\",input!F25,BZ26)","v":74.001000000000005},{"$f":"IF(input!G25<>\"\",input!G25,CA26)","v":{"$error":"#N/A"}},{"$f":"IF(input!H25<>\"\",input!H25,CB26)","v":{"$error":"#N/A"}},{"$f":"IF(input!I25<>\"\",input!I25,CC26)","v":{"$error":"#N/A"}},null,74.05,73.95,73.988653335194286,74.011068887027918,73.97744555927747,74.022276662944734,73.966237783360654,74.033484438861549,73.999861111111102,null,null,null,null,null,null,null,null,null,null,21,73.994,21,0.30050436846371059,0.69949563153628946,0.29193701700704877,-99.773917501214299,-0.56536841329986853]
[null,22,{"$f":"IF(input!E26=\"\",\"\",input!E26)","v":74.004000000000005},{"$f":"IF(input!F26=\"\",\"\",input!F26)","v":73.998999999999995},{"$f":"IF(input!G26=\"\",\"\",input!G26)","v":""},{"$f":"IF(input!H26=\"\",\"\",input!H26)","v":""},{"$f":"IF(input!I26=\"\",\"\",input!I26)","v":""},null,null,null,null,22,74.004000000000005,73.998999999999995,"","","",null,0,0,0,0,0,null,null,null,74.001499999999993,2.5000000000048317E-3,5.0000000000096634E-3,null,22,73.999861111111102,74.001499999999993,74.0252411111111,73.974481111111103,1.3500000000000512E-2,5.0000000000096634E-3,4.4145000000001676E-2,null,null,22,73.998000000000005,0,0,null,null,null,{"$f":"IF($N$17=\"\",\"\",$N$17)","v":73.998000000000005},null,"E12",{"$f":"IF($M$14=\"\",\"\",$M$14)","v":73.984999999999999},null,null,{"$f":"IF($N$12=\"\",\"\",$N$12)","v":73.994},null,null,{"$f":"IF($N$11=\"\",\"\",$N$11)","v":74.007000000000005},null,null,null,null,null,null,null,null,null,null,null,null,null,null,null,null,null,22,22,{"$f":"IF(input!E26<>\"\",input!E26,BY27)","v":74.004000000000005},{"$f":"IF(input!F26<>\"\",input!F26,BZ27)","v":73.998999999999995},{"$f":"IF(input!G26<>\"\",input!G26,CA27)","v":{"$error":"#N/A"}},{"$f":"IF(input!H26<>\"\",input!H26,CB27)","v":{"$error":"#N/A"}},{"$f":"IF(input!I26<>\"\",input!I26,CC27)","v":{"$error":"#N/A"}},null,74.05,73.95,73.988653335194286,74.011068887027918,73.97744555927747,74.022276662944734,73.966237783360654,74.033484438861549,73.999861111111102,null,null,null,null,null,null,null,null,null,null,22,73.995000000000005,22,0.3322434655904582,0.66775653440954175,0.29193701700704877,-100.32349108726063,-0.5251951821212576]
[null,23,{"$f":"IF(input!E27=\"\",\"\",input!E27)","v":74.010000000000005},{"$f":"IF(input!F27=\"\",\"\",input!F27)","v":73.989000000000004},{"$f":"IF(input!G27=\"\",\"\",input!G27)","v":""},{"$f":"IF(input!H27=\"\",\"\",input!H27)","v":""},{"$f":"IF(input!I27=\"\",\"\",input!I27)","v":""},null,null,null,null,23,74.010000000000005,73.989000000000004,"","","",null,0,0,0,0,0,null,null,null,73.999500000000012,1.0500000000000398E-2,2.1000000000000796E-2,null,23,73.999861111111102,73.999500000000012,74.0252411111111,73.974481111111103,1.3500000000000512E-2,2.1000000000000796E-2,4.4145000000001676E-2,null,null,23,74.004000000000005,0,0,null,null,"E16",{"$f":"IF($M$18=\"\",\"\",$M$18)","v":74.004000000000005},null,null,{"$f":"IF($N$14=\"\",\"\",$N$14)","v":74.003},null,null,{"$f":"IF($O$12=\"\",\"\",$O$12)","v":""},null,null,{"$f":"IF($O$11=\"\",\"\",$O$11)","v":""},null,null,null,"Berechnete Leistung in ppm",null,null,null,null,null,null,null,null,null,null,null,null,null,23,23,{"$f":"IF(input!E27<>\"\",input!E27,BY28)","v":74.010000000000005},{"$f":"IF(input!F27<>\"\",input!F27,BZ28)","v":73.989000000000004},{"$f":"IF(input!G27<>\"\",input!G27,CA28)","v":{"$error":"#N/A"}},{"$f":"IF(input!H27<>\"\",input!H27,CB28)","v":{"$error":"#N/A"}},{"$f":"IF(input!I27<>\"\",input!I27,CC28)","v":{"$error":"#N/A"}},null,74.05,73.95,73.988653335194286,74.011068887027918,73.97744555927747,74.022276662944734,73.966237783360654,74.033484438861549,73.999861111111102,null,null,null,null,null,null,null,null,null,null,23,73.995000000000005,23,0.3322434655904582,0.66775653440954175,0.35595681928740752,-96.067489425856508,-0.4858523943289399]
[null,24,{"$f":"IF(input!E28=\"\",\"\",input!E28)","v":74.015000000000001},{"$f":"IF(input!F28=\"\",\"\",input!F28)","v":74.007999999999996},{"$f":"IF(input!G28=\"\",\"\",input!G28)","v":""},{"$f":"IF(input!H28=\"\",\"\",input!H28)","v":""},{"$f":"IF(input!I28=\"\",\"\",input!I28)","v":""},null,null,null,null,24,74.015000000000001,74.007999999999996,"","","",null,0,0,0,0,0,null,null,null,74.011499999999998,3.5000000000025011E-3,7.0000000000050022E-3,null,24,73.999861111111102,74.011499999999998,74.0252411111111,73.974481111111103,1.3500000000000512E-2,7.0000000000050022E-3,4.4145000000001676E-2,null,null,24,74,0,0,null,null,null,{"$f":"IF($N$18=\"\",\"\",$N$18)","v":74},null,null,{"$f":"IF($O$14=\"\",\"\",$O$14)","v":""},null,null,{"$f":"IF($P$12=\"\",\"\",$P$12)","v":""},null,null,{"$f":"IF($P$11=\"\",\"\",$P$11)","v":""},null,null,"Überschreitungsanteil pUGW",{"$f":"IF(BI11=\"\",0,NORMDIST(UGW,Mittelwert,Standardabweichung,1)*1000000)","v":4.317644802202623},null,null,null,null,null,null,null,null,null,null,null,null,null,24,24,{"$f":"IF(input!E28<>\"\",input!E28,BY29)","v":74.015000000000001},{"$f":"IF(input!F28<>\"\",input!F28,BZ29)","v":74.007999999999996},{"$f":"IF(input!G28<>\"\",input!G28,CA29)","v":{"$error":"#N/A"}},{"$f":"IF(input!H28<>\"\",input!H28,CB29)","v":{"$error":"#N/A"}},{"$f":"IF(input!I28<>\"\",input!I28,CC29)","v":{"$error":"#N/A"}},null,74.05,73.95,73.988653335194286,74.011068887027918,73.97744555927747,74.022276662944734,73.966237783360654,74.033484438861549,73.999861111111102,null,null,null,null,null,null,null,null,null,null,24,73.995000000000005,24,0.3322434655904582,0.66775653440954175,0.35595681928740752,-100.33715562256123,-0.44724782697349413]
[null,25,{"$f":"IF(input!E29=\"\",\"\",input!E29)","v":73.981999999999999},{"$f":"IF(input!F29=\"\",\"\",input!F29)","v":73.983999999999995},{"$f":"IF(input!G29=\"\",\"\",input!G29)","v":""},{"$f":"IF(input!H29=\"\",\"\",input!H29)","v":""},{"$f":"IF(input!I29=\"\",\"\",input!I29)","v":""},null,null,null,null,25,73.981999999999999,73.983999999999995,"","","",null,0,0,0,0,0,null,null,null,73.983000000000004,9.9999999999766942E-4,1.9999999999953388E-3,null,25,73.999861111111102,73.983000000000004,74.0252411111111,73.974481111111103,1.3500000000000512E-2,1.9999999999953388E-3,4.4145000000001676E-2,null,null,25,73.983000000000004,0,0,null,null,"E17",{"$f":"IF($M$19=\"\",\"\",$M$19)","v":73.983000000000004},null,"E13",{"$f":"IF($M$15=\"\",\"\",$M$15)","v":74.007999999999996},null,"E11",{"$f":"IF($M$13=\"\",\"\",$M$13)","v":73.995000000000005},null,null,{"$f":"IF($Q$11=\"\",\"\",$Q$11)","v":""},null,null,"Überschreitungsanteil pOGW",{"$f":"IF(BI12=\"\",0,(1-NORMDIST(OGW,Mittelwert,Standardabweichung,1))*1000000)","v":3.8460272601126277},null,null,null,null,null,null,null,null,null,null,null,null,null,25,25,{"$f":"IF(input!E29<>\"\",input!E29,BY30)","v":73.981999999999999},{"$f":"IF(input!F29<>\"\",input!F29,BZ30)","v":73.983999999999995},{"$f":"IF(input!G29<>\"\",input!G29,CA30)","v":{"$error":"#N/A"}},{"$f":"IF(input!H29<>\"\",input!H29,CB30)","v":{"$error":"#N/A"}},{"$f":"IF(input!I29<>\"\",input!I29,CC30)","v":{"$error":"#N/A"}},null,74.05,73.95,73.988653335194286,74.011068887027918,73.97744555927747,74.022276662944734,73.966237783360654,74.033484438861549,73.999861111111102,null,null,null,null,null,null,null,null,null,null,25,73.995000000000005,25,0.3322434655904582,0.66775653440954175,0.38971440576889926,-100.16718913751259,-0.40929873739669081]
[null,26,{"$f":"IF(input!E30=\"\",\"\",input!E30)","v":74.03},{"$f":"IF(input!F30=\"\",\"\",input!F30)","v":74.001999999999995},{"$f":"IF(input!G30=\"\",\"\",input!G30)","v":""},{"$f":"IF(input!H30=\"\",\"\",input!H30)","v":""},{"$f":"IF(input!I30=\"\",\"\",input!I30)","v":""},null,null,null,null,26,74.03,74.001999999999995,"","","",null,0,0,0,0,0,null,null,null,74.015999999999991,1.4000000000002899E-2,2.8000000000005798E-2,null,26,73.999861111111102,74.015999999999991,74.0252411111111,73.974481111111103,1.3500000000000512E-2,2.8000000000005798E-2,4.4145000000001676E-2,null,null,26,74.001999999999995,0,0,null,null,null,{"$f":"IF($N$19=\"\",\"\",$N$19)","v":74.001999999999995},null,null,{"$f":"IF($N$15=\"\",\"\",$N$15)","v":73.995000000000005},null,null,{"$f":"IF($N$13=\"\",\"\",$N$13)","v":74.006},null,"E10",{"$f":"IF($M$12=\"\",\"\",$M$12)","v":74.009},null,null,"Überschreitungsanteil p",{"$f":"BERPOGW+BERPUGW","v":8.1636720623152499},null,null,null,null,null,null,null,null,null,null,null,null,null,26,26,{"$f":"IF(input!E30<>\"\",input!E30,BY31)","v":74.03},{"$f":"IF(input!F30<>\"\",input!F30,BZ31)","v":74.001999999999995},{"$f":"IF(input!G30<>\"\",input!G30,CA31)","v":{"$error":"#N/A"}},{"$f":"IF(input!H30<>\"\",input!H30,CB31)","v":{"$error":"#N/A"}},{"$f":"IF(input!I30<>\"\",input!I30,CC31)","v":{"$error":"#N/A"}},null,74.05,73.95,73.988653335194286,74.011068887027918,73.97744555927747,74.022276662944734,73.966237783360654,74.033484438861549,73.999861111111102,null,null,null,null,null,null,null,null,null,null,26,73.995000000000005,26,0.3322434655904582,0.66775653440954175,0.38971440576889926,-104.2556458370029,-0.37193029107803022]
[null,27,{"$f":"IF(input!E31=\"\",\"\",input!E31)","v":73.995000000000005},{"$f":"IF(input!F31=\"\",\"\",input!F31)","v":73.992000000000004},{"$f":"IF(input!G31=\"\",\"\",input!G31)","v":""},{"$f":"IF(input!H31=\"\",\"\",input!H31)","v":""},{"$f":"IF(input!I31=\"\",\"\",input!I31)","v":""},null,null,null,null,27,73.995000000000005,73.992000000000004,"","","",null,0,0,0,0,0,null,null,null,73.993500000000012,1.5000000000000568E-3,3.0000000000001137E-3,null,27,73.999861111111102,73.993500000000012,74.0252411111111,73.974481111111103,1.3500000000000512E-2,3.0000000000001137E-3,4.4145000000001676E-2,null,null,27,74.006,0,0,null,null,"E18",{"$f":"IF($M$20=\"\",\"\",$M$20)","v":74.006},null,null,{"$f":"IF($O$15=\"\",\"\",$O$15)","v":""},null,null,{"$f":"IF($O$13=\"\",\"\",$O$13)","v":""},null,null,{"$f":"IF($N$12=\"\",\"\",$N$12)","v":73.994},null,null,null,null,null,null,null,null,null,null,null,null,null,null,null,null,null,27,27,{"$f":"IF(input!E31<>\"\",input!E31,BY32)","v":73.995000000000005},{"$f":"IF(input!F31<>\"\",input!F31,BZ32)","v":73.992000000000004},{"$f":"IF(input!G31<>\"\",input!G31,CA32)","v":{"$error":"#N/A"}},{"$f":"IF(input!H31<>\"\",input!H31,CB32)","v":{"$error":"#N/A"}},{"$f":"IF(input!I31<>\"\",input!I31,CC32)","v":{"$error":"#N/A"}},null,74.05,73.95,73.988653335194286,74.011068887027918,73.97744555927747,74.022276662944734,73.966237783360654,74.033484438861549,73.999861111111102,null,null,null,null,null,null,null,null,null,null,27,73.995000000000005,27,0.3322434655904582,0.66775653440954175,0.42432559175303974,-103.8344974907458,-0.33507427112434957]
[null,28,{"$f":"IF(input!E32=\"\",\"\",input!E32)","v":73.988},{"$f":"IF(input!F32=\"\",\"\",input!F32)","v":74.024000000000001},{"$f":"IF(input!G32=\"\",\"\",input!G32)","v":""},{"$f":"IF(input!H32=\"\",\"\",input!H32)","v":""},{"$f":"IF(input!I32=\"\",\"\",input!I32)","v":""},null,null,null,null,28,73.988,74.024000000000001,"","","",null,0,0,0,0,0,null,null,null,74.006,1.8000000000000682E-2,3.6000000000001364E-2,null,28,73.999861111111102,74.006,74.0252411111111,73.974481111111103,1.3500000000000512E-2,3.6000000000001364E-2,4.4145000000001676E-2,null,null,28,73.966999999999999,0,0,null,null,null,{"$f":"IF($N$20=\"\",\"\",$N$20)","v":73.966999999999999},null,"E14",{"$f":"IF($M$16=\"\",\"\",$M$16)","v":73.998000000000005},null,null,{"$f":"IF($P$13=\"\",\"\",$P$13)","v":""},null,null,{"$f":"IF($O$12=\"\",\"\",$O$12)","v":""},null,null,null,"Beobachtete Leistung in ppm",null,null,null,null,null,null,null,null,null,null,null,null,null,28,28,{"$f":"IF(input!E32<>\"\",input!E32,BY33)","v":73.988},{"$f":"IF(input!F32<>\"\",input!F32,BZ33)","v":74.024000000000001},{"$f":"IF(input!G32<>\"\",input!G32,CA33)","v":{"$error":"#N/A"}},{"$f":"IF(input!H32<>\"\",input!H32,CB33)","v":{"$error":"#N/A"}},{"$f":"IF(input!I32<>\"\",input!I32,CC33)","v":{"$error":"#N/A"}},null,74.05,73.95,73.988653335194286,74.011068887027918,73.97744555927747,74.022276662944734,73.966237783360654,74.033484438861549,73.999861111111102,null,null,null,null,null,null,null,null,null,null,28,73.995999999999995,28,0.36523405427338379,0.63476594572661615,0.42432559175303974,-102.54591048267494,-0.29866800697629842]
[null,29,{"$f":"IF(input!E33=\"\",\"\",input!E33)","v":74.001999999999995},{"$f":"IF(input!F33=\"\",\"\",input!F33)","v":73.995999999999995},{"$f":"IF(input!G33=\"\",\"\",input!G33)","v":""},{"$f":"IF(input!H33=\"\",\"\",input!H33)","v":""},{"$f":"IF(input!I33=\"\",\"\",input!I33)","v":""},null,null,null,null,29,74.001999999999995,73.995999999999995,"","","",null,0,0,0,0,0,null,null,null,73.998999999999995,3.0000000000001137E-3,6.0000000000002274E-3,null,29,73.999861111111102,73.998999999999995,74.0252411111111,73.974481111111103,1.3500000000000512E-2,6.0000000000002274E-3,4.4145000000001676E-2,null,null,29,74.012,0,0,null,null,"E19",{"$f":"IF($M$21=\"\",\"\",$M$21)","v":74.012},null,null,{"$f":"IF($N$16=\"\",\"\",$N$16)","v":74},null,"E12",{"$f":"IF($M$14=\"\",\"\",$M$14)","v":73.984999999999999},null,null,{"$f":"IF($P$12=\"\",\"\",$P$12)","v":""},null,null,"Überschreitungsanteil pUGW",{"$f":"IF(BI11=\"\",0,AnzahlWertekleinerUGW/BI14*1000000)","v":0},null,null,null,null,null,null,null,null,null,null,null,null,null,29,29,{"$f":"IF(input!E33<>\"\",input!E33,BY34)","v":74.001999999999995},{"$f":"IF(input!F33<>\"\",input!F33,BZ34)","v":73.995999999999995},{"$f":"IF(input!G33<>\"\",input!G33,CA34)","v":{"$error":"#N/A"}},{"$f":"IF(input!H33<>\"\",input!H33,CB34)","v":{"$error":"#N/A"}},{"$f":"IF(input!I33<>\"\",input!I33,CC34)","v":{"$error":"#N/A"}},null,74.05,73.95,73.988653335194286,74.011068887027918,73.97744555927747,74.022276662944734,73.966237783360654,74.033484438861549,73.999861111111102,null,null,null,null,null,null,null,null,null,null,29,73.995999999999995,29,0.36523405427338379,0.63476594572661615,0.42432559175303974,-106.27485268204494,-0.26265347495939895]
[null,30,{"$f":"IF(input!E34=\"\",\"\",input!E34)","v":73.992000000000004},{"$f":"IF(input!F34=\"\",\"\",input!F34)","v":74.007000000000005},{"$f":"IF(input!G34=\"\",\"\",input!G34)","v":""},{"$f":"IF(input!H34=\"\",\"\",input!H34)","v":""},{"$f":"IF(input!I34=\"\",\"\",input!I34)","v":""},null,null,null,null,30,73.992000000000004,74.007000000000005,"","","",null,0,0,0,0,0,null,null,null,73.999500000000012,7.5000000000002842E-3,1.5000000000000568E-2,null,30,73.999861111111102,73.999500000000012,74.0252411111111,73.974481111111103,1.3500000000000512E-2,1.5000000000000568E-2,4.4145000000001676E-2,null,null,30,74.013999999999996,0,0,null,null,null,{"$f":"IF($N$21=\"\",\"\",$N$21)","v":74.013999999999996},null,null,{"$f":"IF($O$16=\"\",\"\",$O$16)","v":""},null,null,{"$f":"IF($N$14=\"\",\"\",$N$14)","v":74.003},null,null,{"$f":"IF($Q$12=\"\",\"\",$Q$12)","v":""},null,null,"Überschreitungsanteil pOGW",{"$f":"IF(BI12=\"\",0,AnzahlWertegroesserOGW/BI14*1000000)","v":0},null,null,null,null,null,null,null,null,null,null,null,null,null,30,30,{"$f":"IF(input!E34<>\"\",input!E34,BY35)","v":73.992000000000004},{"$f":"IF(input!F34<>\"\",input!F34,BZ35)","v":74.007000000000005},{"$f":"IF(input!G34<>\"\",input!G34,CA35)","v":{"$error":"#N/A"}},{"$f":"IF(input!H34<>\"\",input!H34,CB35)","v":{"$error":"#N/A"}},{"$f":"IF(input!I34<>\"\",input!I34,CC35)","v":{"$error":"#N/A"}},null,74.05,73.95,73.988653335194286,74.011068887027918,73.97744555927747,74.022276662944734,73.966237783360654,74.033484438861549,73.999861111111102,null,null,null,null,null,null,null,null,null,null,30,73.998000000000005,30,0.43405668733961555,0.56594331266038445,0.42432559175303974,-99.81822669613021,-0.22697653424996614]
[null,31,{"$f":"IF(input!E35=\"\",\"\",input!E35)","v":74.009},{"$f":"IF(input!F35=\"\",\"\",input!F35)","v":73.994},{"$f":"IF(input!G35=\"\",\"\",input!G35)","v":""},{"$f":"IF(input!H35=\"\",\"\",input!H35)","v":""},{"$f":"IF(input!I35=\"\",\"\",input!I35)","v":""},null,null,null,null,31,74.009,73.994,"","","",null,0,0,0,0,0,null,null,null,74.001499999999993,7.5000000000002842E-3,1.5000000000000568E-2,null,31,73.999861111111102,74.001499999999993,74.0252411111111,73.974481111111103,1.3500000000000512E-2,1.5000000000000568E-2,4.4145000000001676E-2,null,null,31,74,0,0,null,null,"E20",{"$f":"IF($M$22=\"\",\"\",$M$22)","v":74},null,"E15",{"$f":"IF($M$17=\"\",\"\",$M$17)","v":73.994},null,null,{"$f":"IF($O$14=\"\",\"\",$O$14)","v":""},null,"E11",{"$f":"IF($M$13=\"\",\"\",$M$13)","v":73.995000000000005},null,null,"Überschreitungsanteil p",{"$f":"BI36+BI35","v":0},null,null,null,null,null,null,null,null,null,null,null,null,null,31,31,{"$f":"IF(input!E35<>\"\",input!E35,BY36)","v":74.009},{"$f":"IF(input!F35<>\"\",input!F35,BZ36)","v":73.994},{"$f":"IF(input!G35<>\"\",input!G35,CA36)","v":{"$error":"#N/A"}},{"$f":"IF(input!H35<>\"\",input!H35,CB36)","v":{"$error":"#N/A"}},{"$f":"IF(input!I35<>\"\",input!I35,CC36)","v":{"$error":"#N/A"}},null,74.05,73.95,73.988653335194286,74.011068887027918,73.97744555927747,74.022276662944734,73.966237783360654,74.033484438861549,73.999861111111102,null,null,null,null,null,null,null,null,null,null,31,73.998000000000005,31,0.43405668733961555,0.56594331266038445,0.42432559175303974,-103.20189539769395,-0.19158626986230706]
[null,32,{"$f":"IF(input!E36=\"\",\"\",input!E36)","v":73.995000000000005},{"$f":"IF(input!F36=\"\",\"\",input!F36)","v":74.006},{"$f":"IF(input!G36=\"\",\"\",input!G36)","v":""},{"$f":"IF(input!H36=\"\",\"\",input!H36)","v":""},{"$f":"IF(input!I36=\"\",\"\",input!I36)","v":""},null,null,null,null,32,73.995000000000005,74.006,"","","",null,0,0,0,0,0,null,null,null,74.000500000000002,5.49999999999784E-3,1.099999999999568E-2,null,32,73.999861111111102,74.000500000000002,74.0252411111111,73.974481111111103,1.3500000000000512E-2,1.099999999999568E-2,4.4145000000001676E-2,null,null,32,73.983999999999995,0,0,null,null,null,{"$f":"IF($N$22=\"\",\"\",$N$22)","v":73.983999999999995},null,null,{"$f":"IF($N$17=\"\",\"\",$N$17)","v":73.998000000000005},null,null,{"$f":"IF($P$14=\"\",\"\",$P$14)","v":""},null,null,{"$f":"IF($N$13=\"\",\"\",$N$13)","v":74.006},null,null,null,null,null,null,null,null,null,null,null,null,null,null,null,null,null,32,32,{"$f":"IF(input!E36<>\"\",input!E36,BY37)","v":73.995000000000005},{"$f":"IF(input!F36<>\"\",input!F36,BZ37)","v":74.006},{"$f":"IF(input!G36<>\"\",input!G36,CA37)","v":{"$error":"#N/A"}},{"$f":"IF(input!H36<>\"\",input!H36,CB37)","v":{"$error":"#N/A"}},{"$f":"IF(input!I36<>\"\",input!I36,CC37)","v":{"$error":"#N/A"}},null,74.05,73.95,73.988653335194286,74.011068887027918,73.97744555927747,74.022276662944734,73.966237783360654,74.033484438861549,73.999861111111102,null,null,null,null,null,null,null,null,null,null,32,73.998000000000005,32,0.43405668733961555,0.56594331266038445,0.42432559175303974,-106.58556409925768,-0.15643442021381651]
[null,33,{"$f":"IF(input!E37=\"\",\"\",input!E37)","v":73.984999999999999},{"$f":"IF(input!F37=\"\",\"\",input!F37)","v":74.003},{"$f":"IF(input!G37=\"\",\"\",input!G37)","v":""},{"$f":"IF(input!H37=\"\",\"\",input!H37)","v":""},{"$f":"IF(input!I37=\"\",\"\",input!I37)","v":""},null,null,null,null,33,73.984999999999999,74.003,"","","",null,0,0,0,0,0,null,null,null,73.994,9.0000000000003411E-3,1.8000000000000682E-2,null,33,{"$f":"IF(AA39=\"\",NA(),xquerquer)","v":73.999861111111102},{"$f":"IF(AA39=\"\",NA(),AA39)","v":73.994},{"$f":"IF(AA39=\"\",NA(),xquerquer+(Azwei*Rquer))","v":74.0252411111111},{"$f":"IF(AA39=\"\",NA(),xquerquer-(Azwei*Rquer))","v":73.974481111111103},{"$f":"IF(AA39=\"\",NA(),Rquer)","v":1.3500000000000512E-2},1.8000000000000682E-2,{"$f":"IF(AA39=\"\",NA(),Dvier*Rquer)","v":4.4145000000001676E-2},null,null,33,73.994,0,0,null,null,"E21",{"$f":"IF($M$23=\"\",\"\",$M$23)","v":73.994},null,null,{"$f":"IF($O$17=\"\",\"\",$O$17)","v":""},null,"E13",{"$f":"IF($M$15=\"\",\"\",$M$15)","v":74.007999999999996},null,null,{"$f":"IF($O$13=\"\",\"\",$O$13)","v":""},null,null,null,null,null,null,null,null,null,null,null,null,null,null,null,null,null,33,{"$f":"IF((AnzahlderStichproben>BW39),BW39,AnzahlderStichproben)","v":33},{"$f":"IF(input!E37<>\"\",input!E37,BY38)","v":73.984999999999999},{"$f":"IF(input!F37<>\"\",input!F37,BZ38)","v":74.003},{"$f":"IF(input!G37<>\"\",input!G37,CA38)","v":{"$error":"#N/A"}},{"$f":"IF(input!H37<>\"\",input!H37,CB38)","v":{"$error":"#N/A"}},{"$f":"IF(input!I37<>\"\",input!I37,CC38)","v":{"$error":"#N/A"}},null,{"$f":"IF($BI$12=\"\",#N/A,IF(AP39<>\"\",OGW,CE38))","v":74.05},73.95,73.988653335194286,74.011068887027918,73.97744555927747,74.022276662944734,73.966237783360654,74.033484438861549,73.999861111111102,null,null,null,null,null,null,null,null,null,null,33,73.998000000000005,33,0.43405668733961555,{"$f":"IF(AP39=\"\",\"\",1-DA39)","v":0.56594331266038445},0.45953076610994226,{"$f":"IF(AP39=\"\",\"\",(2*CZ39-1)*(LN(DC39)+LN(DA39)))","v":-104.7884188795359},-0.12147487125457951]
[null,34,{"$f":"IF(input!E38=\"\",\"\",input!E38)","v":74.007999999999996},{"$f":"IF(input!F38=\"\",\"\",input!F38)","v":73.995000000000005},{"$f":"IF(input!G38=\"\",\"\",input!G38)","v":""},{"$f":"IF(input!H38=\"\",\"\",input!H38)","v":""},{"$f":"IF(input!I38=\"\",\"\",input!I38)","v":""},null,null,null,null,34,74.007999999999996,73.995000000000005,"","","",null,0,0,0,0,0,null,null,null,74.001499999999993,6.4999999999955094E-3,1.2999999999991019E-2,null,34,73.999861111111102,74.001499999999993,74.0252411111111,73.974481111111103,1.3500000000000512E-2,1.2999999999991019E-2,4.4145000000001676E-2,null,null,34,74.012,0,0,null,null,null,{"$f":"IF($N$23=\"\",\"\",$N$23)","v":74.012},null,"E16",{"$f":"IF($M$18=\"\",\"\",$M$18)","v":74.004000000000005},null,null,{"$f":"IF($N$15=\"\",\"\",$N$15)","v":73.995000000000005},null,null,{"$f":"IF($P$13=\"\",\"\",$P$13)","v":""},null,null,"Umfang der Stichprobe neue Werte",{"$f":"COUNT(calculation!C7:G7)","v":2},"entsprechendes A2","entsprechendes D4","entsprechendes D2",null,null,null,null,null,null,null,null,null,null,34,34,{"$f":"IF(input!E38<>\"\",input!E38,BY39)","v":74.007999999999996},{"$f":"IF(input!F38<>\"\",input!F38,BZ39)","v":73.995000000000005},{"$f":"IF(input!G38<>\"\",input!G38,CA39)","v":{"$error":"#N/A"}},{"$f":"IF(input!H38<>\"\",input!H38,CB39)","v":{"$error":"#N/A"}},{"$f":"IF(input!I38<>\"\",input!I38,CC39)","v":{"$error":"#N/A"}},null,74.05,73.95,{"$f":"CG39","v":73.988653335194286},74.011068887027918,73.97744555927747,74.022276662944734,73.966237783360654,74.033484438861549,73.999861111111102,null,null,null,null,null,null,null,null,null,null,34,73.998999999999995,{"$f":"IF(AP40=\"\",\"\",1+CZ39)","v":34},0.46937875462871936,0.53062124537128064,0.49505636798284425,-97.781736666530549,-8.6663202452129093E-2]
[null,35,{"$f":"IF(input!E39=\"\",\"\",input!E39)","v":73.998000000000005},{"$f":"IF(input!F39=\"\",\"\",input!F39)","v":74},{"$f":"IF(input!G39=\"\",\"\",input!G39)","v":""},{"$f":"IF(input!H39=\"\",\"\",input!H39)","v":""},{"$f":"IF(input!I39=\"\",\"\",input!I39)","v":""},null,null,null,null,35,73.998000000000005,74,"","","",null,0,0,0,0,0,null,null,null,73.998999999999995,9.9999999999766942E-4,1.9999999999953388E-3,null,35,73.999861111111102,73.998999999999995,74.0252411111111,73.974481111111103,1.3500000000000512E-2,1.9999999999953388E-3,4.4145000000001676E-2,null,null,35,74.006,0,0,null,null,"E22",{"$f":"IF($M$24=\"\",\"\",$M$24)","v":74.006},null,null,{"$f":"IF($N$18=\"\",\"\",$N$18)","v":74},null,null,{"$f":"IF($O$15=\"\",\"\",$O$15)","v":""},null,null,{"$f":"IF($Q$13=\"\",\"\",$Q$13)","v":""},null,null,"Umfang der Stichprobe",{"$f":"COUNT(calculation!M7:Q7)","v":2},{"$f":"BL54","v":1.88},{"$f":"BL56","v":3.27},{"$f":"BL55","v":1.1279999999999999},null,null,null,null,null,null,null,null,null,null,35,35,{"$f":"IF(input!E39<>\"\",input!E39,BY40)","v":73.998000000000005},{"$f":"IF(input!F39<>\"\",input!F39,BZ40)","v":74},{"$f":"IF(input!G39<>\"\",input!G39,CA40)","v":{"$error":"#N/A"}},{"$f":"IF(input!H39<>\"\",input!H39,CB40)","v":{"$error":"#N/A"}},{"$f":"IF(input!I39<>\"\",input!I39,CC40)","v":{"$error":"#N/A"}},null,74.05,73.95,73.988653335194286,74.011068887027918,73.97744555927747,74.022276662944734,73.966237783360654,74.033484438861549,73.999861111111102,null,null,null,null,null,null,null,null,null,null,35,74,35,0.50494363201715575,0.49505636798284425,0.49505636798284425,-95.661056548313297,-5.19562723768138E-2]
[null,36,{"$f":"IF(input!E40=\"\",\"\",input!E40)","v":73.994},{"$f":"IF(input!F40=\"\",\"\",input!F40)","v":73.998000000000005},{"$f":"IF(input!G40=\"\",\"\",input!G40)","v":""},{"$f":"IF(input!H40=\"\",\"\",input!H40)","v":""},{"$f":"IF(input!I40=\"\",\"\",input!I40)","v":""},null,null,null,null,36,73.994,73.998000000000005,"","","",null,0,0,0,0,0,null,null,null,73.996000000000009,2.0000000000024443E-3,4.0000000000048885E-3,null,36,73.999861111111102,73.996000000000009,74.0252411111111,73.974481111111103,1.3500000000000512E-2,4.0000000000048885E-3,4.4145000000001676E-2,null,null,36,74.010000000000005,0,0,null,null,null,{"$f":"IF($N$24=\"\",\"\",$N$24)","v":74.010000000000005},null,null,{"$f":"IF($O$18=\"\",\"\",$O$18)","v":""},null,null,{"$f":"IF($P$15=\"\",\"\",$P$15)","v":""},null,"E12",{"$f":"IF($M$14=\"\",\"\",$M$14)","v":73.984999999999999},null,null,"Anzahl der Stichproben",{"$f":"COUNT(M7:M56)","v":36},null,null,null,null,null,null,null,null,null,null,null,null,null,36,36,{"$f":"IF(input!E40<>\"\",input!E40,BY41)","v":73.994},{"$f":"IF(input!F40<>\"\",input!F40,BZ41)","v":73.998000000000005},{"$f":"IF(input!G40<>\"\",input!G40,CA41)","v":{"$error":"#N/A"}},{"$f":"IF(input!H40<>\"\",input!H40,CB41)","v":{"$error":"#N/A"}},{"$f":"IF(input!I40<>\"\",input!I40,CC41)","v":{"$error":"#N/A"}},null,74.05,73.95,73.988653335194286,74.011068887027918,73.97744555927747,74.022276662944734,73.966237783360654,74.033484438861549,73.999861111111102,null,null,null,null,null,null,null,null,null,null,36,74,36,0.50494363201715575,0.49505636798284425,0.49505636798284425,-98.433840796090493,-1.731183343343844E-2]
[null,37,{"$f":"IF(input!E41=\"\",\"\",input!E41)","v":""},{"$f":"IF(input!F41=\"\",\"\",input!F41)","v":""},{"$f":"IF(input!G41=\"\",\"\",input!G41)","v":""},{"$f":"IF(input!H41=\"\",\"\",input!H41)","v":""},{"$f":"IF(input!I41=\"\",\"\",input!I41)","v":""},null,null,null,null,37,"","","","","",null,0,0,0,0,0,null,null,null,"","","",null,36,{"$error":"#N/A"},{"$error":"#N/A"},{"$error":"#N/A"},{"$error":"#N/A"},{"$error":"#N/A"},{"$error":"#N/A"},{"$error":"#N/A"},null,null,37,73.983999999999995,0,0,null,null,"E23",{"$f":"IF($M$25=\"\",\"\",$M$25)","v":73.983999999999995},null,"E17",{"$f":"IF($M$19=\"\",\"\",$M$19)","v":73.983000000000004},null,"E14",{"$f":"IF($M$16=\"\",\"\",$M$16)","v":73.998000000000005},null,null,{"$f":"IF($N$14=\"\",\"\",$N$14)","v":74.003},null,null,"Fähigkeitswerte innerhalb",null,null,null,"userapiname",null,"userapikey",null,"anzahlstichprobe",null,null,null,null,null,null,37,36,{"$f":"IF(input!E41<>\"\",input!E41,BY42)","v":73.994},{"$f":"IF(input!F41<>\"\",input!F41,BZ42)","v":73.998000000000005},{"$f":"IF(input!G41<>\"\",input!G41,CA42)","v":{"$error":"#N/A"}},{"$f":"IF(input!H41<>\"\",input!H41,CB42)","v":{"$error":"#N/A"}},{"$f":"IF(input!I41<>\"\",input!I41,CC42)","v":{"$error":"#N/A"}},null,74.05,73.95,73.988653335194286,74.011068887027918,73.97744555927747,74.022276662944734,73.966237783360654,74.033484438861549,73.999861111111102,null,null,null,null,null,null,null,null,null,null,37,74,37,0.50494363201715575,0.49505636798284425,0.49505636798284425,-101.20662504386769,1.7311833433438301E-2]
[null,38,{"$f":"IF(input!E42=\"\",\"\",input!E42)","v":""},{"$f":"IF(input!F42=\"\",\"\",input!F42)","v":""},{"$f":"IF(input!G42=\"\",\"\",input!G42)","v":""},{"$f":"IF(input!H42=\"\",\"\",input!H42)","v":""},{"$f":"IF(input!I42=\"\",\"\",input!I42)","v":""},null,null,null,null,38,"","","","","",null,0,0,0,0,0,null,null,null,"","","",null,36,{"$error":"#N/A"},{"$error":"#N/A"},{"$error":"#N/A"},{"$error":"#N/A"},{"$error":"#N/A"},{"$error":"#N/A"},{"$error":"#N/A"},null,null,38,74.001999999999995,0,0,null,null,null,{"$f":"IF($N$25=\"\",\"\",$N$25)","v":74.001999999999995},null,null,{"$f":"IF($N$19=\"\",\"\",$N$19)","v":74.001999999999995},null,null,{"$f":"IF($N$16=\"\",\"\",$N$16)","v":74},null,null,{"$f":"IF($O$14=\"\",\"\",$O$14)","v":""},null,null,"Standardabweichung innerhalb",{"$f":"AVERAGE(Range)","v":1.3500000000000512E-2},null,"\"a\":[\"",{"$f":"info_setup!C5","v":"xx@sixsigmablackbelt.de"},"\",\"",{"$f":"info_setup!C6","v":"GFRDESX"},"\",\"",{"$f":"BI40","v":2},"\"]",null,null,null,null,null,38,36,{"$f":"IF(input!E42<>\"\",input!E42,BY43)","v":73.994},{"$f":"IF(input!F42<>\"\",input!F42,BZ43)","v":73.998000000000005},{"$f":"IF(input!G42<>\"\",input!G42,CA43)","v":{"$error":"#N/A"}},{"$f":"IF(input!H42<>\"\",input!H42,CB43)","v":{"$error":"#N/A"}},{"$f":"IF(input!I42<>\"\",input!I42,CC43)","v":{"$error":"#N/A"}},null,74.05,73.95,73.988653335194286,74.011068887027918,73.97744555927747,74.022276662944734,73.966237783360654,74.033484438861549,73.999861111111102,null,null,null,null,null,null,null,null,null,null,38,74,38,0.50494363201715575,0.49505636798284425,0.49505636798284425,-103.9794092916449,5.19562723768138E-2]
[null,39,{"$f":"IF(input!E43=\"\",\"\",input!E43)","v":""},{"$f":"IF(input!F43=\"\",\"\",input!F43)","v":""},{"$f":"IF(input!G43=\"\",\"\",input!G43)","v":""},{"$f":"IF(input!H43=\"\",\"\",input!H43)","v":""},{"$f":"IF(input!I43=\"\",\"\",input!I43)","v":""},null,null,null,null,39,"","","","","",null,0,0,0,0,0,null,null,null,"","","",null,36,{"$error":"#N/A"},{"$error":"#N/A"},{"$error":"#N/A"},{"$error":"#N/A"},{"$error":"#N/A"},{"$error":"#N/A"},{"$error":"#N/A"},null,null,39,74,0,0,null,null,"E24",{"$f":"IF($M$26=\"\",\"\",$M$26)","v":74},null,null,{"$f":"IF($O$19=\"\",\"\",$O$19)","v":""},null,null,{"$f":"IF($O$16=\"\",\"\",$O$16)","v":""},null,null,{"$f":"IF($P$14=\"\",\"\",$P$14)","v":""},null,null,"entsprechendes d2",{"$f":"BL41","v":1.1279999999999999},null,null,null,null,null,null,null,null,null,null,null,null,null,39,36,{"$f":"IF(input!E43<>\"\",input!E43,BY44)","v":73.994},{"$f":"IF(input!F43<>\"\",input!F43,BZ44)","v":73.998000000000005},{"$f":"IF(input!G43<>\"\",input!G43,CA44)","v":{"$error":"#N/A"}},{"$f":"IF(input!H43<>\"\",input!H43,CB44)","v":{"$error":"#N/A"}},{"$f":"IF(input!I43<>\"\",input!I43,CC44)","v":{"$error":"#N/A"}},null,74.05,73.95,73.988653335194286,74.011068887027918,73.97744555927747,74.022276662944734,73.966237783360654,74.033484438861549,73.999861111111102,null,null,null,null,null,null,null,null,null,null,39,74,39,0.50494363201715575,0.49505636798284425,0.53062124537128064,-101.41017606005825,8.6663202452129093E-2]
[null,40,{"$f":"IF(input!E44=\"\",\"\",input!E44)","v":""},{"$f":"IF(input!F44=\"\",\"\",input!F44)","v":""},{"$f":"IF(input!G44=\"\",\"\",input!G44)","v":""},{"$f":"IF(input!H44=\"\",\"\",input!H44)","v":""},{"$f":"IF(input!I44=\"\",\"\",input!I44)","v":""},null,null,null,null,40,"","","","","",null,0,0,0,0,0,null,null,null,"","","",null,36,{"$error":"#N/A"},{"$error":"#N/A"},{"$error":"#N/A"},{"$error":"#N/A"},{"$error":"#N/A"},{"$error":"#N/A"},{"$error":"#N/A"},null,null,40,74.010000000000005,0,0,null,null,null,{"$f":"IF($N$26=\"\",\"\",$N$26)","v":74.010000000000005},null,"E18",{"$f":"IF($M$20=\"\",\"\",$M$20)","v":74.006},null,null,{"$f":"IF($P$16=\"\",\"\",$P$16)","v":""},null,null,{"$f":"IF($Q$14=\"\",\"\",$Q$14)","v":""},null,null,"Standardabweichung innerhalb",{"$f":"BI44/BI45","v":1.1968085106383433E-2},null,{"$f":"BK44&BL44&BM44&BN44&BO44&BP44&BQ44","v":"\"a\":[\"xx@sixsigmablackbelt.de\",\"GFRDESX\",\"2\"]"},null,null,null,null,null,null,null,null,null,null,null,40,36,{"$f":"IF(input!E44<>\"\",input!E44,BY45)","v":73.994},{"$f":"IF(input!F44<>\"\",input!F44,BZ45)","v":73.998000000000005},{"$f":"IF(input!G44<>\"\",input!G44,CA45)","v":{"$error":"#N/A"}},{"$f":"IF(input!H44<>\"\",input!H44,CB45)","v":{"$error":"#N/A"}},{"$f":"IF(input!I44<>\"\",input!I44,CC45)","v":{"$error":"#N/A"}},null,74.05,73.95,73.988653335194286,74.011068887027918,73.97744555927747,74.022276662944734,73.966237783360654,74.033484438861549,73.999861111111102,null,null,null,null,null,null,null,null,null,null,40,74.001000000000005,40,0.54046923389005774,0.45953076610994226,0.56594331266038445,-93.581735090838407,0.12147487125457951]
[null,41,{"$f":"IF(input!E45=\"\",\"\",input!E45)","v":""},{"$f":"IF(input!F45=\"\",\"\",input!F45)","v":""},{"$f":"IF(input!G45=\"\",\"\",input!G45)","v":""},{"$f":"IF(input!H45=\"\",\"\",input!H45)","v":""},{"$f":"IF(input!I45=\"\",\"\",input!I45)","v":""},null,null,null,null,41,"","","","","",null,0,0,0,0,0,null,null,null,"","","",null,36,{"$error":"#N/A"},{"$error":"#N/A"},{"$error":"#N/A"},{"$error":"#N/A"},{"$error":"#N/A"},{"$error":"#N/A"},{"$error":"#N/A"},null,null,41,73.981999999999999,0,0,null,null,"E25",{"$f":"IF($M$27=\"\",\"\",$M$27)","v":73.981999999999999},null,null,{"$f":"IF($N$20=\"\",\"\",$N$20)","v":73.966999999999999},null,"E15",{"$f":"IF($M$17=\"\",\"\",$M$17)","v":73.994},null,"E13",{"$f":"IF($M$15=\"\",\"\",$M$15)","v":74.007999999999996},null,null,null,null,null,null,null,null,null,null,null,null,null,null,null,null,null,41,36,{"$f":"IF(input!E45<>\"\",input!E45,BY46)","v":73.994},{"$f":"IF(input!F45<>\"\",input!F45,BZ46)","v":73.998000000000005},{"$f":"IF(input!G45<>\"\",input!G45,CA46)","v":{"$error":"#N/A"}},{"$f":"IF(input!H45<>\"\",input!H45,CB46)","v":{"$error":"#N/A"}},{"$f":"IF(input!I45<>\"\",input!I45,CC46)","v":{"$error":"#N/A"}},null,74.05,73.95,73.988653335194286,74.011068887027918,73.97744555927747,74.022276662944734,73.966237783360654,74.033484438861549,73.999861111111102,null,null,null,null,null,null,null,null,null,null,41,74.001999999999995,41,0.57567440824696026,0.42432559175303974,0.56594331266038445,-90.839426535513908,0.15643442021381651]
[null,42,{"$f":"IF(input!E46=\"\",\"\",input!E46)","v":""},{"$f":"IF(input!F46=\"\",\"\",input!F46)","v":""},{"$f":"IF(input!G46=\"\",\"\",input!G46)","v":""},{"$f":"IF(input!H46=\"\",\"\",input!H46)","v":""},{"$f":"IF(input!I46=\"\",\"\",input!I46)","v":""},null,null,null,null,42,"","","","","",null,0,0,0,0,0,null,null,null,"","","",null,36,{"$error":"#N/A"},{"$error":"#N/A"},{"$error":"#N/A"},{"$error":"#N/A"},{"$error":"#N/A"},{"$error":"#N/A"},{"$error":"#N/A"},null,null,42,74.001000000000005,0,0,null,null,null,{"$f":"IF($N$27=\"\",\"\",$N$27)","v":74.001000000000005},null,null,{"$f":"IF($O$20=\"\",\"\",$O$20)","v":""},null,null,{"$f":"IF($N$17=\"\",\"\",$N$17)","v":73.998000000000005},null,null,{"$f":"IF($N$15=\"\",\"\",$N$15)","v":73.995000000000005},null,null,"Cp",{"$f":"IF(OR(BI11=\"\",BI12=\"\"),\"\",(BI12-BI11)/(6*BI46))","v":1.3925925925924605},null,"[\"{\\\"ergebnisuservalidieren\\\":[\\\"user xx@sixsigmablackbelt.de mit ppk in datensatz nicht vorhanden\\\"],\\\"ergebnisuservalidieren_status\\\":[\\\"nein\\\"],\\\"Lizenzdatum\\\":[\\\"\\\"],\\\"Notiz\\\":[\\\" \\\"],\\\"a2\\\":[\\\"1.88\\\"],\\\"d2\\\":[\\\"1.128\\\"],\\\"d4\\\":[\\\"3.27\\\"]}\"]",null,null,null,null,null,null,null,null,null,null,null,42,36,{"$f":"IF(input!E46<>\"\",input!E46,BY47)","v":73.994},{"$f":"IF(input!F46<>\"\",input!F46,BZ47)","v":73.998000000000005},{"$f":"IF(input!G46<>\"\",input!G46,CA47)","v":{"$error":"#N/A"}},{"$f":"IF(input!H46<>\"\",input!H46,CB47)","v":{"$error":"#N/A"}},{"$f":"IF(input!I46<>\"\",input!I46,CC47)","v":{"$error":"#N/A"}},null,74.05,73.95,73.988653335194286,74.011068887027918,73.97744555927747,74.022276662944734,73.966237783360654,74.033484438861549,73.999861111111102,null,null,null,null,null,null,null,null,null,null,42,74.001999999999995,42,0.57567440824696026,0.42432559175303974,0.56594331266038445,-93.082375338859933,0.19158626986230679]
[null,43,{"$f":"IF(input!E47=\"\",\"\",input!E47)","v":""},{"$f":"IF(input!F47=\"\",\"\",input!F47)","v":""},{"$f":"IF(input!G47=\"\",\"\",input!G47)","v":""},{"$f":"IF(input!H47=\"\",\"\",input!H47)","v":""},{"$f":"IF(input!I47=\"\",\"\",input!I47)","v":""},null,null,null,null,43,"","","","","",null,0,0,0,0,0,null,null,null,"","","",null,36,{"$error":"#N/A"},{"$error":"#N/A"},{"$error":"#N/A"},{"$error":"#N/A"},{"$error":"#N/A"},{"$error":"#N/A"},{"$error":"#N/A"},null,null,43,74.004000000000005,0,0,null,null,"E26",{"$f":"IF($M$28=\"\",\"\",$M$28)","v":74.004000000000005},null,"E19",{"$f":"IF($M$21=\"\",\"\",$M$21)","v":74.012},null,null,{"$f":"IF($O$17=\"\",\"\",$O$17)","v":""},null,null,{"$f":"IF($O$15=\"\",\"\",$O$15)","v":""},null,null,"CPL",{"$f":"IF(BI11<>\"\",(Mittelwert-BI11)/(3*BI46),\"\")","v":1.3887242798349988},null,null,null,null,null,null,null,null,null,null,null,null,null,43,36,{"$f":"IF(input!E47<>\"\",input!E47,BY48)","v":73.994},{"$f":"IF(input!F47<>\"\",input!F47,BZ48)","v":73.998000000000005},{"$f":"IF(input!G47<>\"\",input!G47,CA48)","v":{"$error":"#N/A"}},{"$f":"IF(input!H47<>\"\",input!H47,CB48)","v":{"$error":"#N/A"}},{"$f":"IF(input!I47<>\"\",input!I47,CC48)","v":{"$error":"#N/A"}},null,74.05,73.95,73.988653335194286,74.011068887027918,73.97744555927747,74.022276662944734,73.966237783360654,74.033484438861549,73.999861111111102,null,null,null,null,null,null,null,null,null,null,43,74.001999999999995,43,0.57567440824696026,0.42432559175303974,0.56594331266038445,-95.325324142205943,0.22697653424996603]
[null,44,{"$f":"IF(input!E48=\"\",\"\",input!E48)","v":""},{"$f":"IF(input!F48=\"\",\"\",input!F48)","v":""},{"$f":"IF(input!G48=\"\",\"\",input!G48)","v":""},{"$f":"IF(input!H48=\"\",\"\",input!H48)","v":""},{"$f":"IF(input!I48=\"\",\"\",input!I48)","v":""},null,null,null,null,44,"","","","","",null,0,0,0,0,0,null,null,null,"","","",null,36,{"$error":"#N/A"},{"$error":"#N/A"},{"$error":"#N/A"},{"$error":"#N/A"},{"$error":"#N/A"},{"$error":"#N/A"},{"$error":"#N/A"},null,null,44,73.998999999999995,0,0,null,null,null,{"$f":"IF($N$28=\"\",\"\",$N$28)","v":73.998999999999995},null,null,{"$f":"IF($N$21=\"\",\"\",$N$21)","v":74.013999999999996},null,null,{"$f":"IF($P$17=\"\",\"\",$P$17)","v":""},null,null,{"$f":"IF($P$15=\"\",\"\",$P$15)","v":""},null,null,"CPU",{"$f":"IF(BI12<>\"\",(BI12-Mittelwert)/(3*BI46),\"\")","v":1.3964609053499224},null,"ergebnisuservalidieren:user xx@sixsigmablackbelt.de mit ppk in datensatz nicht vorhanden",null,null,null,null,null,null,null,null,null,null,null,44,36,{"$f":"IF(input!E48<>\"\",input!E48,BY49)","v":73.994},{"$f":"IF(input!F48<>\"\",input!F48,BZ49)","v":73.998000000000005},{"$f":"IF(input!G48<>\"\",input!G48,CA49)","v":{"$error":"#N/A"}},{"$f":"IF(input!H48<>\"\",input!H48,CB49)","v":{"$error":"#N/A"}},{"$f":"IF(input!I48<>\"\",input!I48,CC49)","v":{"$error":"#N/A"}},null,74.05,73.95,73.988653335194286,74.011068887027918,73.97744555927747,74.022276662944734,73.966237783360654,74.033484438861549,73.999861111111102,null,null,null,null,null,null,null,null,null,null,44,74.001999999999995,44,0.57567440824696026,0.42432559175303974,0.63476594572661615,-87.583942173880928,0.26265347495939884]
[null,45,{"$f":"IF(input!E49=\"\",\"\",input!E49)","v":""},{"$f":"IF(input!F49=\"\",\"\",input!F49)","v":""},{"$f":"IF(input!G49=\"\",\"\",input!G49)","v":""},{"$f":"IF(input!H49=\"\",\"\",input!H49)","v":""},{"$f":"IF(input!I49=\"\",\"\",input!I49)","v":""},null,null,null,null,45,"","","","","",null,0,0,0,0,0,null,null,null,"","","",null,36,{"$error":"#N/A"},{"$error":"#N/A"},{"$error":"#N/A"},{"$error":"#N/A"},{"$error":"#N/A"},{"$error":"#N/A"},{"$error":"#N/A"},null,null,45,74.010000000000005,0,0,null,null,"E27",{"$f":"IF($M$29=\"\",\"\",$M$29)","v":74.010000000000005},null,null,{"$f":"IF($O$21=\"\",\"\",$O$21)","v":""},null,"E16",{"$f":"IF($M$18=\"\",\"\",$M$18)","v":74.004000000000005},null,null,{"$f":"IF($Q$15=\"\",\"\",$Q$15)","v":""},null,null,"CPK",{"$f":"MIN(BI49:BI50)","v":1.3887242798349988},null,"nein",null,null,null,null,null,null,null,null,null,null,null,45,36,{"$f":"IF(input!E49<>\"\",input!E49,BY50)","v":73.994},{"$f":"IF(input!F49<>\"\",input!F49,BZ50)","v":73.998000000000005},{"$f":"IF(input!G49<>\"\",input!G49,CA50)","v":{"$error":"#N/A"}},{"$f":"IF(input!H49<>\"\",input!H49,CB50)","v":{"$error":"#N/A"}},{"$f":"IF(input!I49<>\"\",input!I49,CC50)","v":{"$error":"#N/A"}},null,74.05,73.95,73.988653335194286,74.011068887027918,73.97744555927747,74.022276662944734,73.966237783360654,74.033484438861549,73.999861111111102,null,null,null,null,null,null,null,null,null,null,45,74.001999999999995,45,0.57567440824696026,0.42432559175303974,0.63476594572661615,-89.597366131901168,0.29866800697629825]
[null,46,{"$f":"IF(input!E50=\"\",\"\",input!E50)","v":""},{"$f":"IF(input!F50=\"\",\"\",input!F50)","v":""},{"$f":"IF(input!G50=\"\",\"\",input!G50)","v":""},{"$f":"IF(input!H50=\"\",\"\",input!H50)","v":""},{"$f":"IF(input!I50=\"\",\"\",input!I50)","v":""},null,null,null,null,46,"","","","","",null,0,0,0,0,0,null,null,null,"","","",null,36,{"$error":"#N/A"},{"$error":"#N/A"},{"$error":"#N/A"},{"$error":"#N/A"},{"$error":"#N/A"},{"$error":"#N/A"},{"$error":"#N/A"},null,null,46,73.989000000000004,0,0,null,null,null,{"$f":"IF($N$29=\"\",\"\",$N$29)","v":73.989000000000004},null,"E20",{"$f":"IF($M$22=\"\",\"\",$M$22)","v":74},null,null,{"$f":"IF($N$18=\"\",\"\",$N$18)","v":74},null,"E14",{"$f":"IF($M$16=\"\",\"\",$M$16)","v":73.998000000000005},null,null,null,null,null,null,null,null,null,null,null,null,null,null,null,null,null,46,36,{"$f":"IF(input!E50<>\"\",input!E50,BY51)","v":73.994},{"$f":"IF(input!F50<>\"\",input!F50,BZ51)","v":73.998000000000005},{"$f":"IF(input!G50<>\"\",input!G50,CA51)","v":{"$error":"#N/A"}},{"$f":"IF(input!H50<>\"\",input!H50,CB51)","v":{"$error":"#N/A"}},{"$f":"IF(input!I50<>\"\",input!I50,CC51)","v":{"$error":"#N/A"}},null,74.05,73.95,73.988653335194286,74.011068887027918,73.97744555927747,74.022276662944734,73.966237783360654,74.033484438861549,73.999861111111102,null,null,null,null,null,null,null,null,null,null,46,74.001999999999995,46,0.57567440824696026,0.42432559175303974,0.66775653440954175,-87.000066143483338,0.33507427112434957]
[null,47,{"$f":"IF(input!E51=\"\",\"\",input!E51)","v":""},{"$f":"IF(input!F51=\"\",\"\",input!F51)","v":""},{"$f":"IF(input!G51=\"\",\"\",input!G51)","v":""},{"$f":"IF(input!H51=\"\",\"\",input!H51)","v":""},{"$f":"IF(input!I51=\"\",\"\",input!I51)","v":""},null,null,null,null,47,"","","","","",null,0,0,0,0,0,null,null,null,"","","",null,36,{"$error":"#N/A"},{"$error":"#N/A"},{"$error":"#N/A"},{"$error":"#N/A"},{"$error":"#N/A"},{"$error":"#N/A"},{"$error":"#N/A"},null,null,47,74.015000000000001,0,0,null,null,"E28",{"$f":"IF($M$30=\"\",\"\",$M$30)","v":74.015000000000001},null,null,{"$f":"IF($N$22=\"\",\"\",$N$22)","v":73.983999999999995},null,null,{"$f":"IF($O$18=\"\",\"\",$O$18)","v":""},null,null,{"$f":"IF($N$16=\"\",\"\",$N$16)","v":74},null,null,null,null,null," ","kostenlos",null,null,null,null,null,null,null,null,null,null,47,36,{"$f":"IF(input!E51<>\"\",input!E51,BY52)","v":73.994},{"$f":"IF(input!F51<>\"\",input!F51,BZ52)","v":73.998000000000005},{"$f":"IF(input!G51<>\"\",input!G51,CA52)","v":{"$error":"#N/A"}},{"$f":"IF(input!H51<>\"\",input!H51,CB52)","v":{"$error":"#N/A"}},{"$f":"IF(input!I51<>\"\",input!I51,CC52)","v":{"$error":"#N/A"}},null,74.05,73.95,73.988653335194286,74.011068887027918,73.97744555927747,74.022276662944734,73.966237783360654,74.033484438861549,73.999861111111102,null,null,null,null,null,null,null,null,null,null,47,74.003,47,0.61028559423110074,0.38971440576889926,0.66775653440954175,-83.482369346250877,0.37193029107802988]
[null,48,{"$f":"IF(input!E52=\"\",\"\",input!E52)","v":""},{"$f":"IF(input!F52=\"\",\"\",input!F52)","v":""},{"$f":"IF(input!G52=\"\",\"\",input!G52)","v":""},{"$f":"IF(input!H52=\"\",\"\",input!H52)","v":""},{"$f":"IF(input!I52=\"\",\"\",input!I52)","v":""},null,null,null,null,48,"","","","","",null,0,0,0,0,0,null,null,null,"","","",null,36,{"$error":"#N/A"},{"$error":"#N/A"},{"$error":"#N/A"},{"$error":"#N/A"},{"$error":"#N/A"},{"$error":"#N/A"},{"$error":"#N/A"},null,null,48,74.007999999999996,0,0,null,null,null,{"$f":"IF($N$30=\"\",\"\",$N$30)","v":74.007999999999996},null,null,{"$f":"IF($O$22=\"\",\"\",$O$22)","v":""},null,null,{"$f":"IF($P$18=\"\",\"\",$P$18)","v":""},null,null,{"$f":"IF($O$16=\"\",\"\",$O$16)","v":""},null,null,null,null,null,1.88,1.88,null,null,null,null,null,null,null,null,null,null,48,36,{"$f":"IF(input!E52<>\"\",input!E52,BY53)","v":73.994},{"$f":"IF(input!F52<>\"\",input!F52,BZ53)","v":73.998000000000005},{"$f":"IF(input!G52<>\"\",input!G52,CA53)","v":{"$error":"#N/A"}},{"$f":"IF(input!H52<>\"\",input!H52,CB53)","v":{"$error":"#N/A"}},{"$f":"IF(input!I52<>\"\",input!I52,CC53)","v":{"$error":"#N/A"}},null,74.05,73.95,73.988653335194286,74.011068887027918,73.97744555927747,74.022276662944734,73.966237783360654,74.033484438861549,73.999861111111102,null,null,null,null,null,null,null,null,null,null,48,74.003,48,0.61028559423110074,0.38971440576889926,0.66775653440954175,-85.277689117137996,0.40929873739669065]
[null,49,{"$f":"IF(input!E53=\"\",\"\",input!E53)","v":""},{"$f":"IF(input!F53=\"\",\"\",input!F53)","v":""},{"$f":"IF(input!G53=\"\",\"\",input!G53)","v":""},{"$f":"IF(input!H53=\"\",\"\",input!H53)","v":""},{"$f":"IF(input!I53=\"\",\"\",input!I53)","v":""},null,null,null,null,49,"","","","","",null,0,0,0,0,0,null,null,null,"","","",null,36,{"$error":"#N/A"},{"$error":"#N/A"},{"$error":"#N/A"},{"$error":"#N/A"},{"$error":"#N/A"},{"$error":"#N/A"},{"$error":"#N/A"},null,null,49,73.981999999999999,0,0,null,null,"E29",{"$f":"IF($M$31=\"\",\"\",$M$31)","v":73.981999999999999},null,"E21",{"$f":"IF($M$23=\"\",\"\",$M$23)","v":73.994},null,"E17",{"$f":"IF($M$19=\"\",\"\",$M$19)","v":73.983000000000004},null,null,{"$f":"IF($P$16=\"\",\"\",$P$16)","v":""},null,null,null,null,null,1.1279999999999999,1.1279999999999999,null,null,null,null,null,null,null,null,null,null,49,36,{"$f":"IF(input!E53<>\"\",input!E53,BY54)","v":73.994},{"$f":"IF(input!F53<>\"\",input!F53,BZ54)","v":73.998000000000005},{"$f":"IF(input!G53<>\"\",input!G53,CA54)","v":{"$error":"#N/A"}},{"$f":"IF(input!H53<>\"\",input!H53,CB54)","v":{"$error":"#N/A"}},{"$f":"IF(input!I53<>\"\",input!I53,CC54)","v":{"$error":"#N/A"}},null,74.05,73.95,73.988653335194286,74.011068887027918,73.97744555927747,74.022276662944734,73.966237783360654,74.033484438861549,73.999861111111102,null,null,null,null,null,null,null,null,null,null,49,74.004000000000005,49,0.64404318071259248,0.35595681928740752,0.66775653440954175,-81.850651128734171,0.44724782697349391]
[null,50,{"$f":"IF(input!E54=\"\",\"\",input!E54)","v":""},{"$f":"IF(input!F54=\"\",\"\",input!F54)","v":""},{"$f":"IF(input!G54=\"\",\"\",input!G54)","v":""},{"$f":"IF(input!H54=\"\",\"\",input!H54)","v":""},{"$f":"IF(input!I54=\"\",\"\",input!I54)","v":""},null,null,null,null,50,"","","","","",null,0,0,0,0,0,null,null,null,"","","",null,36,{"$error":"#N/A"},{"$error":"#N/A"},{"$error":"#N/A"},{"$error":"#N/A"},{"$error":"#N/A"},{"$error":"#N/A"},{"$error":"#N/A"},null,null,50,73.983999999999995,0,0,null,null,null,{"$f":"IF($N$31=\"\",\"\",$N$31)","v":73.983999999999995},null,null,{"$f":"IF($N$23=\"\",\"\",$N$23)","v":74.012},null,null,{"$f":"IF($N$19=\"\",\"\",$N$19)","v":74.001999999999995},null,null,{"$f":"IF($Q$16=\"\",\"\",$Q$16)","v":""},null,null,null,null,null,3.27,3.27,null,null,null,null,null,null,null,null,null,null,50,36,{"$f":"IF(input!E54<>\"\",input!E54,BY55)","v":73.994},{"$f":"IF(input!F54<>\"\",input!F54,BZ55)","v":73.998000000000005},{"$f":"IF(input!G54<>\"\",input!G54,CA55)","v":{"$error":"#N/A"}},{"$f":"IF(input!H54<>\"\",input!H54,CB55)","v":{"$error":"#N/A"}},{"$f":"IF(input!I54<>\"\",input!I54,CC55)","v":{"$error":"#N/A"}},null,74.05,73.95,{"$f":"CG55","v":73.988653335194286},74.011068887027918,73.97744555927747,74.022276662944734,73.966237783360654,74.033484438861549,73.999861111111102,null,null,null,null,null,null,null,null,null,null,50,74.004000000000005,50,0.64404318071259248,0.35595681928740752,0.66775653440954175,-83.538293420048277,0.48585239432893973]
[null,null,null,null,null,null,null,null,null,null,null,null,{"$f":"IF(input!E55=\"\",\"\",input!E55)","v":""},{"$f":"IF(input!F55=\"\",\"\",input!F55)","v":""},{"$f":"IF(input!G55=\"\",\"\",input!G55)","v":""},{"$f":"IF(input!H55=\"\",\"\",input!H55)","v":""},"Mittelwert",null,null,null,null,"Summe",{"$f":"SUM(S2:W56)","v":0},null,null,null,{"$f":"AVERAGE(AA7:AA56)","v":73.999861111111102},{"$f":"AVERAGE(AB7:AB56)","v":6.7500000000002558E-3},{"$f":"AVERAGE(AC7:AC56)","v":1.3500000000000512E-2},null,null,null,null,null,null,null,null,null,null,null,51,74.03,0,0,null,null,"E30",{"$f":"IF($M$32=\"\",\"\",$M$32)","v":74.03},null,null,{"$f":"IF($O$23=\"\",\"\",$O$23)","v":""},null,null,{"$f":"IF($O$19=\"\",\"\",$O$19)","v":""},null,"E15",{"$f":"IF($M$17=\"\",\"\",$M$17)","v":73.994},null,null,null,null,null,null,null,null,null,null,null,null,null,null,null,null,null,null,null,null,null,null,null,null,null,null,null,null,null,null,null,null,null,null,null,null,null,null,null,null,null,null,null,null,51,74.006,51,0.70806298299295123,0.29193701700704877,0.66775653440954175,-75.654441025829044,0.5251951821212576]
[null,null,null,null,null,null,null,null,null,null,null,null,{"$f":"IF(input!E56=\"\",\"\",input!E56)","v":""},{"$f":"IF(input!F56=\"\",\"\",input!F56)","v":""},{"$f":"IF(input!G56=\"\",\"\",input!G56)","v":""},{"$f":"IF(input!H56=\"\",\"\",input!H56)","v":""},{"$f":"IF(input!I56=\"\",\"\",input!I56)","v":""},null,null,null,null,null,null,null,null,null,"Mittelwert","Standardabweichung","Range",null,null,null,null,null,null,null,null,null,null,null,52,74.001999999999995,0,0,null,null,null,{"$f":"IF($N$32=\"\",\"\",$N$32)","v":74.001999999999995},null,"E22",{"$f":"IF($M$24=\"\",\"\",$M$24)","v":74.006},null,null,{"$f":"IF($P$19=\"\",\"\",$P$19)","v":""},null,null,{"$f":"IF($N$17=\"\",\"\",$N$17)","v":73.998000000000005},null,null,null,null,null,null,null,null,null,null,null,null,null,null,null,null,null,null,null,null,null,null,null,null,null,null,null,null,null,null,null,null,null,null,null,null,null,null,null,null,null,null,null,null,52,74.006,52,0.70806298299295123,0.29193701700704877,0.69949563153628946,-72.369649904183674,0.56536841329986853]
[null,null,null,null,null,null,null,null,null,null,null,null,{"$f":"IF(input!E57=\"\",\"\",input!E57)","v":""},{"$f":"IF(input!F57=\"\",\"\",input!F57)","v":""},{"$f":"IF(input!G57=\"\",\"\",input!G57)","v":""},{"$f":"IF(input!H57=\"\",\"\",input!H57)","v":""},{"$f":"IF(input!I57=\"\",\"\",input!I57)","v":""},null,null,null,null,null,null,null,null,null,null,null,null,null,null,null,null,null,null,null,null,null,null,null,53,73.995000000000005,0,0,null,null,"E31",{"$f":"IF($M$33=\"\",\"\",$M$33)","v":73.995000000000005},null,null,{"$f":"IF($N$24=\"\",\"\",$N$24)","v":74.010000000000005},null,"E18",{"$f":"IF($M$20=\"\",\"\",$M$20)","v":74.006},null,null,{"$f":"IF($O$17=\"\",\"\",$O$17)","v":""},null,null,null,null,null,null,null,null,null,null,null,null,null,null,null,null,null,null,null,null,null,null,null,null,null,null,null,null,null,null,null,null,null,null,null,null,null,null,null,null,null,null,null,null,53,74.006,53,0.70806298299295123,0.29193701700704877,0.69949563153628946,-73.774885824653254,0.60647572828941787]
[null,null,null,null,null,null,null,null,null,null,null,null,null,null,null,null,null,null,null,null,null,null,null,null,null,null,null,null,null,null,null,null,null,null,null,null,null,null,null,null,54,73.992000000000004,0,0,null,null,null,{"$f":"IF($N$33=\"\",\"\",$N$33)","v":73.992000000000004},null,null,{"$f":"IF($O$24=\"\",\"\",$O$24)","v":""},null,null,{"$f":"IF($N$20=\"\",\"\",$N$20)","v":73.966999999999999},null,null,{"$f":"IF($P$17=\"\",\"\",$P$17)","v":""},null,null,null,"Histogramm Messwerte",null,null,null,null,null,null,null,null,null,null,null,null,null,null,null,null,null,null,null,null,null,null,null,null,null,null,null,null,null,null,null,null,null,null,null,null,null,null,null,null,54,74.006,54,0.70806298299295123,0.29193701700704877,0.69949563153628946,-75.180121745122847,0.64863460018193808]
[null,null,null,null,null,null,null,null,null,null,null,null,null,null,null,null,null,null,null,null,null,null,null,null,null,null,null,null,null,null,null,null,null,null,null,null,null,null,null,null,55,73.988,0,0,null,null,"E32",{"$f":"IF($M$34=\"\",\"\",$M$34)","v":73.988},null,"E23",{"$f":"IF($M$25=\"\",\"\",$M$25)","v":73.983999999999995},null,null,{"$f":"IF($O$20=\"\",\"\",$O$20)","v":""},null,null,{"$f":"IF($Q$17=\"\",\"\",$Q$17)","v":""},null,null,null,"Anzahl Klassen Histogramm",null,null,{"$f":"AnzahlKlassenHistogramm","v":20},null,null,null,null,null,null,null,null,null,null,null,null,null,null,null,null,null,null,null,null,null,null,null,null,null,null,null,null,null,null,null,null,null,null,null,null,null,55,74.007000000000005,55,0.73792407394343928,0.26207592605656072,0.69949563153628946,-72.082797687667195,0.69197938333281728]
[null,null,null,null,null,null,null,null,null,null,null,null,null,null,null,null,null,null,null,null,null,null,null,null,null,null,null,null,null,null,null,null,null,null,null,null,null,null,null,null,56,74.024000000000001,0,0,null,null,null,{"$f":"IF($N$34=\"\",\"\",$N$34)","v":74.024000000000001},null,null,{"$f":"IF($N$25=\"\",\"\",$N$25)","v":74.001999999999995},null,null,{"$f":"IF($P$20=\"\",\"\",$P$20)","v":""},null,"E16",{"$f":"IF($M$18=\"\",\"\",$M$18)","v":74.004000000000005},null,null,null,"Nummer","Untere","Obere",null,null,"Absolute","Relative",null,null,"Häufig-",null,null,null,null,null,null,null,null,null,null,null,null,null,null,null,null,null,null,null,null,null,null,null,null,null,null,null,null,null,null,null,56,74.007000000000005,56,0.73792407394343928,0.26207592605656072,0.69949563153628946,-73.405417828725319,0.73666521261450413]
[null,null,null,null,null,null,null,null,null,null,null,null,null,null,null,null,null,null,null,null,null,null,null,null,null,null,null,null,null,null,null,null,null,null,null,null,null,null,null,null,57,74.001999999999995,0,0,null,null,"E33",{"$f":"IF($M$35=\"\",\"\",$M$35)","v":74.001999999999995},null,null,{"$f":"IF($O$25=\"\",\"\",$O$25)","v":""},null,"E19",{"$f":"IF($M$21=\"\",\"\",$M$21)","v":74.012},null,null,{"$f":"IF($N$18=\"\",\"\",$N$18)","v":74},null,null,null,"der","Klassen-","Klassen-","Klassen-","Klassen-","Summen-","Summen-","Absolute","Relative","keits-",null,null,null,null,null,null,null,null,null,null,null,null,null,null,null,null,null,null,null,null,null,null,null,null,null,null,null,null,null,null,null,57,74.007999999999996,57,0.76613649020502328,0.23386350979497672,0.75847266115299794,-61.341311388699985,0.78287306252506605]
[null,null,null,null,null,null,null,null,null,null,null,null,null,null,null,null,null,null,null,null,null,null,null,null,null,null,null,null,null,null,null,null,null,null,null,null,null,null,null,null,58,73.995999999999995,0,0,null,null,null,{"$f":"IF($N$35=\"\",\"\",$N$35)","v":73.995999999999995},null,"E24",{"$f":"IF($M$26=\"\",\"\",$M$26)","v":74},null,null,{"$f":"IF($N$21=\"\",\"\",$N$21)","v":74.013999999999996},null,null,{"$f":"IF($O$18=\"\",\"\",$O$18)","v":""},null,null,null,"Klasse","grenze","grenze","mitte","breite","häufigkeit","häufigkeit","Häufigkeit","Häufigkeit","dichte",null,null,null,null,null,null,null,null,null,null,null,null,null,null,null,null,null,null,null,null,null,null,null,null,null,null,null,null,null,null,null,58,74.007999999999996,58,0.76613649020502328,0.23386350979497672,0.75847266115299794,-62.426998315933609,0.83081641494276304]
[null,null,null,null,null,null,null,null,null,null,null,null,null,null,null,null,null,null,null,null,null,null,null,null,null,null,null,null,null,null,null,null,null,null,null,null,null,null,null,null,59,73.992000000000004,0,0,null,null,"E34",{"$f":"IF($M$36=\"\",\"\",$M$36)","v":73.992000000000004},null,null,{"$f":"IF($N$26=\"\",\"\",$N$26)","v":74.010000000000005},null,null,{"$f":"IF($O$21=\"\",\"\",$O$21)","v":""},null,null,{"$f":"IF($P$18=\"\",\"\",$P$18)","v":""},null,null,null,"j","UKGj","OKGj","xj´","wj","G(OKGj)","H(OKGj)","nj","hj","h(x)",null,null,null,null,null,null,null,null,null,null,null,null,null,null,null,null,null,null,null,null,null,null,null,null,null,null,null,null,null,null,null,59,74.007999999999996,59,0.76613649020502328,0.23386350979497672,0.75847266115299794,-63.51268524316724,0.88075020135558701]
[null,null,null,null,null,null,null,null,null,null,null,null,null,null,null,null,null,null,null,null,null,null,null,null,null,null,null,null,null,null,null,null,null,null,null,null,null,null,null,null,60,74.007000000000005,0,0,null,null,null,{"$f":"IF($N$36=\"\",\"\",$N$36)","v":74.007000000000005},null,null,{"$f":"IF($O$26=\"\",\"\",$O$26)","v":""},null,null,{"$f":"IF($P$21=\"\",\"\",$P$21)","v":""},null,null,{"$f":"IF($Q$18=\"\",\"\",$Q$18)","v":""},null,null,null,1,{"$f":"Minimum","v":73.966999999999999},{"$f":"BJ66+BM66","v":73.970150000000004},{"$f":"(BK66+BJ66)/2","v":73.968575000000001},{"$f":"Spannweite/AnzahlKlassenHistogramm","v":3.1500000000001193E-3},{"$f":"FREQUENCY(xi,BK66)","v":1},{"$f":"$BN66/Anzahl","v":1.3888888888888888E-2},{"$f":"BN66","v":1},{"$f":"BP66/Anzahl","v":1.3888888888888888E-2},{"$f":"BQ66/BM66","v":4.4091710758375751},null,null,null,null,null,null,null,null,null,null,null,null,null,null,null,null,null,null,null,null,null,null,null,null,null,null,null,null,null,null,null,60,74.009,60,0.79258004409138161,0.20741995590861839,0.75847266115299794,-60.560325756089959,0.93298303198639998]
[null,null,null,null,null,null,null,null,null,null,null,null,null,null,null,null,null,null,null,null,null,null,null,null,null,null,null,null,null,null,null,null,null,null,null,null,null,null,null,null,61,74.009,0,0,null,null,"E35",{"$f":"IF($M$37=\"\",\"\",$M$37)","v":74.009},null,"E25",{"$f":"IF($M$27=\"\",\"\",$M$27)","v":73.981999999999999},null,"E20",{"$f":"IF($M$22=\"\",\"\",$M$22)","v":74},null,"E17",{"$f":"IF($M$19=\"\",\"\",$M$19)","v":73.983000000000004},null,null,null,2,{"$f":"IF(AnzahlKlassenHistogramm<BI67,BJ66,BJ66+BM67+0.00000001)","v":73.970150009999998},{"$f":"BJ67+BM67","v":73.973300010000003},{"$f":"(BK67+BJ67)/2","v":73.97172501},3.1500000000001193E-3,1,1.3888888888888888E-2,{"$f":"BN67-BN66","v":0},0,{"$f":"BQ67/BM67","v":0},null,null,null,null,null,null,null,null,null,null,null,null,null,null,null,null,null,null,null,null,null,null,null,null,null,null,null,null,null,null,null,61,74.009,61,0.79258004409138161,0.20741995590861839,0.8337446930180078,-50.12906861825487,0.98789429474054891]
[null,null,null,null,null,null,null,null,null,null,null,null,null,null,null,null,null,null,null,null,null,null,null,null,null,null,null,null,null,null,null,null,null,null,null,null,null,null,null,null,62,73.994,0,0,null,null,null,{"$f":"IF($N$37=\"\",\"\",$N$37)","v":73.994},null,null,{"$f":"IF($N$27=\"\",\"\",$N$27)","v":74.001000000000005},null,null,{"$f":"IF($N$22=\"\",\"\",$N$22)","v":73.983999999999995},null,null,{"$f":"IF($N$19=\"\",\"\",$N$19)","v":74.001999999999995},null,null,null,3,73.973300019999996,{"$f":"BJ68+BM68","v":73.976450020000001},{"$f":"(BK68+BJ68)/2","v":73.974875019999999},3.1500000000001193E-3,1,1.3888888888888888E-2,{"$f":"BN68-BN67","v":0},0,{"$f":"BQ68/BM68","v":0},null,null,null,null,null,null,null,null,null,null,null,null,null,null,null,null,null,null,null,null,null,null,null,null,null,null,null,null,null,null,null,62,74.010000000000005,62,0.81716923770011152,0.18283076229988848,0.85503907471920138,-44.097611903809586,1.0459586790681843]
[null,null,null,null,null,null,null,null,null,null,null,null,null,null,null,null,null,null,null,null,null,null,null,null,null,null,null,null,null,null,null,null,null,null,null,null,null,null,null,null,63,73.995000000000005,0,0,null,null,"E36",{"$f":"IF($M$38=\"\",\"\",$M$38)","v":73.995000000000005},null,null,{"$f":"IF($O$27=\"\",\"\",$O$27)","v":""},null,null,{"$f":"IF($O$22=\"\",\"\",$O$22)","v":""},null,null,{"$f":"IF($O$19=\"\",\"\",$O$19)","v":""},null,null,null,4,73.976450029999995,73.97960003,73.978025029999998,3.1500000000001193E-3,1,1.3888888888888888E-2,0,0,0,null,null,null,null,null,null,null,null,null,null,null,null,null,null,null,null,null,null,null,null,null,null,null,null,null,null,null,null,null,null,null,63,74.010000000000005,63,0.81716923770011152,0.18283076229988848,0.85503907471920138,-44.814646243708928,1.1077824039874549]
[null,null,null,null,null,null,null,null,null,null,null,null,null,null,null,null,null,null,null,null,null,null,null,null,null,null,null,null,null,null,null,null,null,null,null,null,null,null,null,null,64,74.006,0,0,null,null,null,{"$f":"IF($N$38=\"\",\"\",$N$38)","v":74.006},null,"E26",{"$f":"IF($M$28=\"\",\"\",$M$28)","v":74.004000000000005},null,null,{"$f":"IF($P$22=\"\",\"\",$P$22)","v":""},null,null,{"$f":"IF($P$19=\"\",\"\",$P$19)","v":""},null,null,null,5,73.979600039999994,73.982750039999999,73.981175039999997,3.1500000000001193E-3,3,4.1666666666666664E-2,2,2.7777777777777776E-2,8.8183421516751501,null,null,null,null,null,null,null,null,null,null,null,null,null,null,null,null,null,null,null,null,null,null,null,null,null,null,null,null,null,null,null,64,74.010000000000005,64,0.81716923770011152,0.18283076229988848,0.90757425400188518,-37.958897143368404,1.1741586334672607]
[null,null,null,null,null,null,null,null,null,null,null,null,null,null,null,null,null,null,null,null,null,null,null,null,null,null,null,null,null,null,null,null,null,null,null,null,null,null,null,null,65,73.984999999999999,{"$f":"IF(AP71<>\"\",IF(AP71<UGW,1,0),\"\")","v":0},{"$f":"IF(AP71<>\"\",IF(AP71>OGW,1,0),\"\")","v":0},null,null,"E37",{"$f":"IF($M$39=\"\",\"\",$M$39)","v":73.984999999999999},null,null,{"$f":"IF($N$28=\"\",\"\",$N$28)","v":73.998999999999995},null,"E21",{"$f":"IF($M$23=\"\",\"\",$M$23)","v":73.994},null,null,{"$f":"IF($Q$19=\"\",\"\",$Q$19)","v":""},null,null,null,6,73.982750049999993,73.985900049999998,73.984325049999995,3.1500000000001193E-3,9,0.125,6,8.3333333333333329E-2,26.45502645502545,null,null,null,null,null,null,null,null,null,null,null,null,null,null,null,null,null,null,null,null,null,null,null,null,null,null,null,null,null,null,null,65,{"$f":"IF(AP71=\"\",NA(),SMALL(xi,CZ71))","v":74.012},65,{"$f":"IF(AP71=\"\",\"\",NORMSDIST((CY71-Mittelwert)/Standardabweichung)-0.00000001)","v":0.86061295708223784},{"$f":"IF(AP71=\"\",\"\",1-DA71)","v":0.13938704291776216},{"$f":"IF(AP71=\"\",\"\",SMALL(BG,CZ71))","v":0.90757425400188518},{"$f":"IF(AP71=\"\",\"\",(2*CZ71-1)*(LN(DC71)+LN(DA71)))","v":-31.87464823807483},{"$f":"IF(AP71=\"\",NA(),NORMSINV((CZ71-0.3)/(Anzahl+0.4)))","v":1.2461558548617906}]
[null,null,null,null,null,null,null,null,null,null,null,null,null,null,null,null,null,null,null,null,null,null,null,null,null,null,null,null,null,null,null,null,null,null,null,null,null,null,null,null,66,{"$f":"IF($BI$41=2,IF(AV72<>\"\",AV72,\"\"),(IF($BI$41=3,IF(AY72<>\"\",AY72,\"\"),(IF($BI$41=4,IF(BB72<>\"\",BB72,\"\"),IF(BE72<>\"\",BE72,\"\"))))))","v":74.003},0,0,null,null,null,{"$f":"IF($N$39=\"\",\"\",$N$39)","v":74.003},null,null,{"$f":"IF($O$28=\"\",\"\",$O$28)","v":""},null,null,{"$f":"IF($N$23=\"\",\"\",$N$23)","v":74.012},null,"E18",{"$f":"IF($M$20=\"\",\"\",$M$20)","v":74.006},null,null,null,7,73.985900059999992,73.989050059999997,73.987475059999994,3.1500000000001193E-3,12,0.16666666666666666,3,4.1666666666666664E-2,13.227513227512725,null,null,null,null,null,null,null,null,null,null,null,null,null,null,null,null,null,null,null,null,null,null,null,null,null,null,null,null,null,null,null,66,74.012,{"$f":"IF(AP72=\"\",\"\",1+CZ71)","v":66},0.86061295708223784,0.13938704291776216,0.92149333375622455,-30.374988188195211,1.3252662073492218]
[null,null,null,null,null,null,null,null,null,null,null,null,null,null,null,null,null,null,null,null,null,null,null,null,null,null,null,null,null,null,null,null,null,null,null,null,null,null,null,null,67,74.007999999999996,0,0,null,null,"E38",{"$f":"IF($M$40=\"\",\"\",$M$40)","v":74.007999999999996},null,"E27",{"$f":"IF($M$29=\"\",\"\",$M$29)","v":74.010000000000005},null,null,{"$f":"IF($O$23=\"\",\"\",$O$23)","v":""},null,null,{"$f":"IF($N$20=\"\",\"\",$N$20)","v":73.966999999999999},null,null,null,8,73.98905006999999,73.992200069999996,73.990625069999993,3.1500000000001193E-3,16,0.22222222222222221,4,5.5555555555555552E-2,17.6366843033503,null,null,null,null,null,null,null,null,null,null,null,null,null,null,null,null,null,null,null,null,null,null,null,null,null,null,null,null,null,null,null,67,74.013999999999996,67,0.8964401006635494,0.1035598993364506,0.92149333375622455,-25.414110666118475,1.4136708652538128]
[null,null,null,null,null,null,null,null,null,null,null,null,null,null,null,null,null,null,null,null,null,null,null,null,null,null,null,null,null,null,null,null,null,null,null,null,null,null,null,null,68,73.995000000000005,0,0,null,null,null,{"$f":"IF($N$40=\"\",\"\",$N$40)","v":73.995000000000005},null,null,{"$f":"IF($N$29=\"\",\"\",$N$29)","v":73.989000000000004},null,null,{"$f":"IF($P$23=\"\",\"\",$P$23)","v":""},null,null,{"$f":"IF($O$20=\"\",\"\",$O$20)","v":""},null,null,null,9,73.992200079999989,73.995350079999994,73.993775079999992,3.1500000000001193E-3,27,0.375,11,0.15277777777777779,48.500881834213338,null,null,null,null,null,null,null,null,null,null,null,null,null,null,null,null,null,null,null,null,null,null,null,null,null,null,null,null,null,null,null,68,74.015000000000001,68,0.91161201887672416,8.8387981123275838E-2,0.92149333375622455,-23.530572001279182,1.5147558137079749]
[null,null,null,null,null,null,null,null,null,null,null,null,null,null,null,null,null,null,null,null,null,null,null,null,null,null,null,null,null,null,null,null,null,null,null,null,null,null,null,null,69,73.998000000000005,0,0,null,null,"E39",{"$f":"IF($M$41=\"\",\"\",$M$41)","v":73.998000000000005},null,null,{"$f":"IF($O$29=\"\",\"\",$O$29)","v":""},null,"E22",{"$f":"IF($M$24=\"\",\"\",$M$24)","v":74.006},null,null,{"$f":"IF($P$20=\"\",\"\",$P$20)","v":""},null,null,null,10,73.995350089999988,73.998500089999993,73.996925089999991,3.1500000000001193E-3,33,0.45833333333333331,6,8.3333333333333329E-2,26.45502645502545,null,null,null,null,null,null,null,null,null,null,null,null,null,null,null,null,null,null,null,null,null,null,null,null,null,null,null,null,null,null,null,69,74.024000000000001,69,0.98437059397162952,1.5629406028370485E-2,0.93376233492352911,-11.547204669898907,1.6342329576323833]
[null,null,null,null,null,null,null,null,null,null,null,null,null,null,null,null,null,null,null,null,null,null,null,null,null,null,null,null,null,null,null,null,null,null,null,null,null,null,null,null,70,74,0,0,null,null,null,{"$f":"IF($N$41=\"\",\"\",$N$41)","v":74},null,"E28",{"$f":"IF($M$30=\"\",\"\",$M$30)","v":74.015000000000001},null,null,{"$f":"IF($N$24=\"\",\"\",$N$24)","v":74.010000000000005},null,null,{"$f":"IF($Q$20=\"\",\"\",$Q$20)","v":""},null,null,null,11,73.998500099999987,74.001650099999992,74.000075099999989,3.1500000000001193E-3,40,0.55555555555555558,7,9.7222222222222224E-2,30.864197530863031,null,null,null,null,null,null,null,null,null,null,null,null,null,null,null,null,null,null,null,null,null,null,null,null,null,null,null,null,null,null,null,70,74.024000000000001,70,0.98437059397162952,1.5629406028370485E-2,0.94449117611166367,-10.127785671204483,1.7830041034241486]
[null,null,null,null,null,null,null,null,null,null,null,null,null,null,null,null,null,null,null,null,null,null,null,null,null,null,null,null,null,null,null,null,null,null,null,null,null,null,null,null,71,73.994,0,0,null,null,"E40",{"$f":"IF($M$42=\"\",\"\",$M$42)","v":73.994},null,null,{"$f":"IF($N$30=\"\",\"\",$N$30)","v":74.007999999999996},null,null,{"$f":"IF($O$24=\"\",\"\",$O$24)","v":""},null,"E19",{"$f":"IF($M$21=\"\",\"\",$M$21)","v":74.012},null,null,null,12,74.001650109999986,74.004800109999991,74.003225109999988,3.1500000000001193E-3,50,0.69444444444444442,10,0.1388888888888889,44.091710758375754,null,null,null,null,null,null,null,null,null,null,null,null,null,null,null,null,null,null,null,null,null,null,null,null,null,null,null,null,null,null,null,71,74.03,71,0.99641779851600953,3.5822014839904659E-3,0.94449117611166367,-8.5583570043493342,1.9866488303120806]
[null,null,null,null,null,null,null,null,null,null,null,null,null,null,null,null,null,null,null,null,null,null,null,null,null,null,null,null,null,null,null,null,null,null,null,null,null,null,null,null,72,73.998000000000005,0,0,null,null,null,{"$f":"IF($N$42=\"\",\"\",$N$42)","v":73.998000000000005},null,null,{"$f":"IF($O$30=\"\",\"\",$O$30)","v":""},null,null,{"$f":"IF($P$24=\"\",\"\",$P$24)","v":""},null,null,{"$f":"IF($N$21=\"\",\"\",$N$21)","v":74.013999999999996},null,null,null,13,74.004800119999985,74.00795011999999,74.006375119999987,3.1500000000001193E-3,56,0.77777777777777779,6,8.3333333333333329E-2,26.45502645502545,null,null,null,null,null,null,null,null,null,null,null,null,null,null,null,null,null,null,null,null,null,null,null,null,null,null,null,null,null,null,null,72,74.03,72,0.99641779851600953,3.5822014839904659E-3,0.99831603375073541,-0.7541846663333045,2.3389694125229443]
[null,null,null,null,null,null,null,null,null,null,null,null,null,null,null,null,null,null,null,null,null,null,null,null,null,null,null,null,null,null,null,null,null,null,null,null,null,null,null,null,73,"","","",null,null,"E41",{"$f":"IF($M$43=\"\",\"\",$M$43)","v":""},null,"E29",{"$f":"IF($M$31=\"\",\"\",$M$31)","v":73.981999999999999},null,"E23",{"$f":"IF($M$25=\"\",\"\",$M$25)","v":73.983999999999995},null,null,{"$f":"IF($O$21=\"\",\"\",$O$21)","v":""},null,null,null,14,74.007950129999983,74.011100129999988,74.009525129999986,3.1500000000001193E-3,64,0.88888888888888884,8,0.1111111111111111,35.2733686067006,null,null,null,null,null,null,null,null,null,null,null,null,null,null,null,null,null,null,null,null,null,null,null,null,null,null,null,null,null,null,null,73,{"$error":"#N/A"},"","","","","",{"$error":"#N/A"}]
[null,null,null,null,null,null,null,null,null,null,null,null,null,null,null,null,null,null,null,null,null,null,null,null,null,null,null,null,null,null,null,null,null,null,null,null,null,null,null,null,74,"","","",null,null,null,{"$f":"IF($N$43=\"\",\"\",$N$43)","v":""},null,null,{"$f":"IF($N$31=\"\",\"\",$N$31)","v":73.983999999999995},null,null,{"$f":"IF($N$25=\"\",\"\",$N$25)","v":74.001999999999995},null,null,{"$f":"IF($P$21=\"\",\"\",$P$21)","v":""},null,null,null,15,74.011100139999982,74.014250139999987,74.012675139999985,3.1500000000001193E-3,67,0.93055555555555558,3,4.1666666666666664E-2,13.227513227512725,null,null,null,null,null,null,null,null,null,null,null,null,null,null,null,null,null,null,null,null,null,null,null,null,null,null,null,null,null,null,null,74,{"$error":"#N/A"},"","","","","",{"$error":"#N/A"}]
[null,null,null,null,null,null,null,null,null,null,null,null,null,null,null,null,null,null,null,null,null,null,null,null,null,null,null,null,null,null,null,null,null,null,null,null,null,null,null,null,75,"","","",null,null,"E42",{"$f":"IF($M$44=\"\",\"\",$M$44)","v":""},null,null,{"$f":"IF($O$31=\"\",\"\",$O$31)","v":""},null,null,{"$f":"IF($O$25=\"\",\"\",$O$25)","v":""},null,null,{"$f":"IF($Q$21=\"\",\"\",$Q$21)","v":""},null,null,null,16,74.014250149999981,74.017400149999986,74.015825149999984,3.1500000000001193E-3,68,0.94444444444444442,1,1.3888888888888888E-2,4.4091710758375751,null,null,null,null,null,null,null,null,null,null,null,null,null,null,null,null,null,null,null,null,null,null,null,null,null,null,null,null,null,null,null,75,{"$error":"#N/A"},"","","","","",{"$error":"#N/A"}]
[null,null,null,null,null,null,null,null,null,null,null,null,null,null,null,null,null,null,null,null,null,null,null,null,null,null,null,null,null,null,null,null,null,null,null,null,null,null,null,null,76,"","","",null,null,null,{"$f":"IF($N$44=\"\",\"\",$N$44)","v":""},null,"E30",{"$f":"IF($M$32=\"\",\"\",$M$32)","v":74.03},null,null,{"$f":"IF($P$25=\"\",\"\",$P$25)","v":""},null,"E20",{"$f":"IF($M$22=\"\",\"\",$M$22)","v":74},null,null,null,17,74.01740015999998,74.020550159999985,74.018975159999982,3.1500000000001193E-3,68,0.94444444444444442,0,0,0,null,null,null,null,null,null,null,null,null,null,null,null,null,null,null,null,null,null,null,null,null,null,null,null,null,null,null,null,null,null,null,76,{"$error":"#N/A"},"","","","","",{"$error":"#N/A"}]
[null,null,null,null,null,null,null,null,null,null,null,null,null,null,null,null,null,null,null,null,null,null,null,null,null,null,null,null,null,null,null,null,null,null,null,null,null,null,null,null,77,"","","",null,null,"E43",{"$f":"IF($M$45=\"\",\"\",$M$45)","v":""},null,null,{"$f":"IF($N$32=\"\",\"\",$N$32)","v":74.001999999999995},null,"E24",{"$f":"IF($M$26=\"\",\"\",$M$26)","v":74},null,null,{"$f":"IF($N$22=\"\",\"\",$N$22)","v":73.983999999999995},null,null,null,18,74.020550169999979,74.023700169999984,74.022125169999981,3.1500000000001193E-3,68,0.94444444444444442,0,0,0,null,null,null,null,null,null,null,null,null,null,null,null,null,null,null,null,null,null,null,null,null,null,null,null,null,null,null,null,null,null,null,77,{"$error":"#N/A"},"","","","","",{"$error":"#N/A"}]
[null,null,null,null,null,null,null,null,null,null,null,null,null,null,null,null,null,null,null,null,null,null,null,null,null,null,null,null,null,null,null,null,null,null,null,null,null,null,null,null,78,"","","",null,null,null,{"$f":"IF($N$45=\"\",\"\",$N$45)","v":""},null,null,{"$f":"IF($O$32=\"\",\"\",$O$32)","v":""},null,null,{"$f":"IF($N$26=\"\",\"\",$N$26)","v":74.010000000000005},null,null,{"$f":"IF($O$22=\"\",\"\",$O$22)","v":""},null,null,null,19,74.023700179999977,74.026850179999983,74.02527517999998,3.1500000000001193E-3,70,0.97222222222222221,2,2.7777777777777776E-2,8.8183421516751501,null,null,null,null,null,null,null,null,null,null,null,null,null,null,null,null,null,null,null,null,null,null,null,null,null,null,null,null,null,null,null,78,{"$error":"#N/A"},"","","","","",{"$error":"#N/A"}]
[null,null,null,null,null,null,null,null,null,null,null,null,null,null,null,null,null,null,null,null,null,null,null,null,null,null,null,null,null,null,null,null,null,null,null,null,null,null,null,null,79,"","","",null,null,"E44",{"$f":"IF($M$46=\"\",\"\",$M$46)","v":""},null,"E31",{"$f":"IF($M$33=\"\",\"\",$M$33)","v":73.995000000000005},null,null,{"$f":"IF($O$26=\"\",\"\",$O$26)","v":""},null,null,{"$f":"IF($P$22=\"\",\"\",$P$22)","v":""},null,null,null,20,74.026850189999976,74.030000189999981,74.028425189999979,3.1500000000001193E-3,72,1,2,2.7777777777777776E-2,8.8183421516751501,null,null,null,null,null,null,null,null,null,null,null,null,null,null,null,null,null,null,null,null,null,null,null,null,null,null,null,null,null,null,null,79,{"$error":"#N/A"},"","","","","",{"$error":"#N/A"}]
[null,null,null,null,null,null,null,null,null,null,null,null,null,null,null,null,null,null,null,null,null,null,null,null,null,null,null,null,null,null,null,null,null,null,null,null,null,null,null,null,80,"","","",null,null,null,{"$f":"IF($N$46=\"\",\"\",$N$46)","v":""},null,null,{"$f":"IF($N$33=\"\",\"\",$N$33)","v":73.992000000000004},null,null,{"$f":"IF($P$26=\"\",\"\",$P$26)","v":""},null,null,{"$f":"IF($Q$22=\"\",\"\",$Q$22)","v":""},null,null,null,null,null,null,null,null,null,null,null,null,null,null,null,null,null,null,null,null,null,null,null,null,null,null,null,null,null,null,null,null,null,null,null,null,null,null,null,null,null,null,null,null,80,{"$error":"#N/A"},"","","","","",{"$error":"#N/A"}]
[null,null,null,null,null,null,null,null,null,null,null,null,null,null,null,null,null,null,null,null,null,null,null,null,null,null,null,null,null,null,null,null,null,null,null,null,null,null,null,null,81,"","","",null,null,"E45",{"$f":"IF($M$47=\"\",\"\",$M$47)","v":""},null,null,{"$f":"IF($O$33=\"\",\"\",$O$33)","v":""},null,"E25",{"$f":"IF($M$27=\"\",\"\",$M$27)","v":73.981999999999999},null,"E21",{"$f":"IF($M$23=\"\",\"\",$M$23)","v":73.994},null,null,null,null,null,null,null,null,null,null,null,null,null,null,null,null,null,null,null,null,null,null,null,null,null,null,null,null,null,null,null,null,null,null,null,null,null,null,null,null,null,null,null,null,81,{"$error":"#N/A"},"","","","","",{"$error":"#N/A"}]
[null,null,null,null,null,null,null,null,null,null,null,null,null,null,null,null,null,null,null,null,null,null,null,null,null,null,null,null,null,null,null,null,null,null,null,null,null,null,null,null,82,"","","",null,null,null,{"$f":"IF($N$47=\"\",\"\",$N$47)","v":""},null,"E32",{"$f":"IF($M$34=\"\",\"\",$M$34)","v":73.988},null,null,{"$f":"IF($N$27=\"\",\"\",$N$27)","v":74.001000000000005},null,null,{"$f":"IF($N$23=\"\",\"\",$N$23)","v":74.012},null,null,null,"Histogramm Normalverteilung",null,null,null,null,null,null,null,null,null,null,null,null,null,null,null,null,null,null,null,null,null,null,null,null,null,null,null,null,null,null,null,null,null,null,null,null,null,null,null,null,82,{"$error":"#N/A"},"","","","","",{"$error":"#N/A"}]
[null,null,null,null,null,null,null,null,null,null,null,null,null,null,null,null,null,null,null,null,null,null,null,null,null,null,null,null,null,null,null,null,null,null,null,null,null,null,null,null,83,"","","",null,null,"E46",{"$f":"IF($M$48=\"\",\"\",$M$48)","v":""},null,null,{"$f":"IF($N$34=\"\",\"\",$N$34)","v":74.024000000000001},null,null,{"$f":"IF($O$27=\"\",\"\",$O$27)","v":""},null,null,{"$f":"IF($O$23=\"\",\"\",$O$23)","v":""},null,null,null,null,1.1000000000000001,{"$f":"BK90-(BJ89*Standardabweichung)","v":73.925889790060111},{"$f":"NORMDIST(BK89,Mittelwert,Standardabweichung,0)","v":1.237248143124341E-8},null,"OGW",{"$f":"IF(BI12=\"\",#N/A,BI12)","v":74.05},{"$f":"MAX(Häufigkeitsdichte)*1.05","v":50.925925925924005},null,null,null,null,null,null,null,null,null,null,null,null,null,null,null,null,null,null,null,null,null,null,null,null,null,null,null,null,null,null,null,null,null,83,{"$error":"#N/A"},"","","","","",{"$error":"#N/A"}]
[null,null,null,null,null,null,null,null,null,null,null,null,null,null,null,null,null,null,null,null,null,null,null,null,null,null,null,null,null,null,null,null,null,null,null,null,null,null,null,null,84,"","","",null,null,null,{"$f":"IF($N$48=\"\",\"\",$N$48)","v":""},null,null,{"$f":"IF($O$34=\"\",\"\",$O$34)","v":""},null,null,{"$f":"IF($P$27=\"\",\"\",$P$27)","v":""},null,null,{"$f":"IF($P$23=\"\",\"\",$P$23)","v":""},null,null,null,null,1,73.938218343568607,9.6091857318111317E-6,null,"UGW",{"$f":"IF(BI11=\"\",#N/A,BI11)","v":73.95},50.925925925924005,null,null,null,null,null,null,null,null,null,null,null,null,null,null,null,null,null,null,null,null,null,null,null,null,null,null,null,null,null,null,null,null,null,84,{"$error":"#N/A"},"","","","","",{"$error":"#N/A"}]
[null,null,null,null,null,null,null,null,null,null,null,null,null,null,null,null,null,null,null,null,null,null,null,null,null,null,null,null,null,null,null,null,null,null,null,null,null,null,null,null,85,"","","",null,null,"E47",{"$f":"IF($M$49=\"\",\"\",$M$49)","v":""},null,"E33",{"$f":"IF($M$35=\"\",\"\",$M$35)","v":74.001999999999995},null,"E26",{"$f":"IF($M$28=\"\",\"\",$M$28)","v":74.004000000000005},null,null,{"$f":"IF($Q$23=\"\",\"\",$Q$23)","v":""},null,null,null,null,0.9,73.949426119485423,1.4261296108617327E-3,null,{"$f":"\"+ 3 Sigma\"","v":"+ 3 Sigma"},{"$f":"Mittelwert+3*Standardabweichung","v":74.033484438861549},50.925925925924005,null,null,null,null,null,null,null,null,null,null,null,null,null,null,null,null,null,null,null,null,null,null,null,null,null,null,null,null,null,null,null,null,null,85,{"$error":"#N/A"},"","","","","",{"$error":"#N/A"}]
[null,null,null,null,null,null,null,null,null,null,null,null,null,null,null,null,null,null,null,null,null,null,null,null,null,null,null,null,null,null,null,null,null,null,null,null,null,null,null,null,86,"","","",null,null,null,{"$f":"IF($N$49=\"\",\"\",$N$49)","v":""},null,null,{"$f":"IF($N$35=\"\",\"\",$N$35)","v":73.995999999999995},null,null,{"$f":"IF($N$28=\"\",\"\",$N$28)","v":73.998999999999995},null,"E22",{"$f":"IF($M$24=\"\",\"\",$M$24)","v":74.006},null,null,null,null,0.8,73.959513117810559,5.459619594953824E-2,null,{"$f":"\"- 3 Sigma\"","v":"- 3 Sigma"},{"$f":"Mittelwert-3*Standardabweichung","v":73.966237783360654},50.925925925924005,null,null,null,null,null,null,null,null,null,null,null,null,null,null,null,null,null,null,null,null,null,null,null,null,null,null,null,null,null,null,null,null,null,86,{"$error":"#N/A"},"","","","","",{"$error":"#N/A"}]
[null,null,null,null,null,null,null,null,null,null,null,null,null,null,null,null,null,null,null,null,null,null,null,null,null,null,null,null,null,null,null,null,null,null,null,null,null,null,null,null,87,"","","",null,null,"E48",{"$f":"IF($M$50=\"\",\"\",$M$50)","v":""},null,null,{"$f":"IF($O$35=\"\",\"\",$O$35)","v":""},null,null,{"$f":"IF($O$28=\"\",\"\",$O$28)","v":""},null,null,{"$f":"IF($N$24=\"\",\"\",$N$24)","v":74.010000000000005},null,null,null,null,0.7,73.968479338544014,0.70624641692743895,null,"Mittelwert",{"$f":"Mittelwert","v":73.999861111111102},50.925925925924005,null,null,null,null,null,null,null,null,null,null,null,null,null,null,null,null,null,null,null,null,null,null,null,null,null,null,null,null,null,null,null,null,null,87,{"$error":"#N/A"},"","","","","",{"$error":"#N/A"}]
[null,null,null,null,null,null,null,null,null,null,null,null,null,null,null,null,null,null,null,null,null,null,null,null,null,null,null,null,null,null,null,null,null,null,null,null,null,null,null,null,88,"","","",null,null,null,{"$f":"IF($N$50=\"\",\"\",$N$50)","v":""},null,"E34",{"$f":"IF($M$36=\"\",\"\",$M$36)","v":73.992000000000004},null,null,{"$f":"IF($P$28=\"\",\"\",$P$28)","v":""},null,null,{"$f":"IF($O$24=\"\",\"\",$O$24)","v":""},null,null,null,null,0.6,73.97632478168579,3.9243821706368993,null,"Nominalwert",{"$f":"Sollwert","v":74},50.925925925924005,null,null,null,null,null,null,null,null,null,null,null,null,null,null,null,null,null,null,null,null,null,null,null,null,null,null,null,null,null,null,null,null,null,88,{"$error":"#N/A"},"","","","","",{"$error":"#N/A"}]
[null,null,null,null,null,null,null,null,null,null,null,null,null,null,null,null,null,null,null,null,null,null,null,null,null,null,null,null,null,null,null,null,null,null,null,null,null,null,null,null,89,"","","",null,null,"E49",{"$f":"IF($M$51=\"\",\"\",$M$51)","v":""},null,null,{"$f":"IF($N$36=\"\",\"\",$N$36)","v":74.007000000000005},null,"E27",{"$f":"IF($M$29=\"\",\"\",$M$29)","v":74.010000000000005},null,null,{"$f":"IF($P$24=\"\",\"\",$P$24)","v":""},null,null,null,null,0.5,73.983049447235885,11.55604792844737,null,null,null,null,null,null,null,null,null,null,null,null,null,null,null,null,null,null,null,null,null,null,null,null,null,null,null,null,null,null,null,null,null,null,null,null,null,89,{"$error":"#N/A"},"","","","","",{"$error":"#N/A"}]
[null,null,null,null,null,null,null,null,null,null,null,null,null,null,null,null,null,null,null,null,null,null,null,null,null,null,null,null,null,null,null,null,null,null,null,null,null,null,null,null,90,"","","",null,null,null,{"$f":"IF($N$51=\"\",\"\",$N$51)","v":""},null,null,{"$f":"IF($O$36=\"\",\"\",$O$36)","v":""},null,null,{"$f":"IF($N$29=\"\",\"\",$N$29)","v":73.989000000000004},null,null,{"$f":"IF($Q$24=\"\",\"\",$Q$24)","v":""},null,null,null,null,0.4,73.9886533351943,21.589539826220395,null,null,null,null,null,null,null,null,null,null,null,null,null,null,null,null,null,null,null,null,null,null,null,null,null,null,null,null,null,null,null,null,null,null,null,null,null,90,{"$error":"#N/A"},"","","","","",{"$error":"#N/A"}]
[null,null,null,null,null,null,null,null,null,null,null,null,null,null,null,null,null,null,null,null,null,null,null,null,null,null,null,null,null,null,null,null,null,null,null,null,null,null,null,null,91,"","","",null,null,"E50",{"$f":"IF($M$52=\"\",\"\",$M$52)","v":""},null,"E35",{"$f":"IF($M$37=\"\",\"\",$M$37)","v":74.009},null,null,{"$f":"IF($O$29=\"\",\"\",$O$29)","v":""},null,"E23",{"$f":"IF($M$25=\"\",\"\",$M$25)","v":73.983999999999995},null,null,null,null,0.3,73.993136445561021,29.731554713899989,null,null,null,null,null,null,null,null,null,null,null,null,null,null,null,null,null,null,null,null,null,null,null,null,null,null,null,null,null,null,null,null,null,null,null,null,null,91,{"$error":"#N/A"},"","","","","",{"$error":"#N/A"}]
[null,null,null,null,null,null,null,null,null,null,null,null,null,null,null,null,null,null,null,null,null,null,null,null,null,null,null,null,null,null,null,null,null,null,null,null,null,null,null,null,92,"","","",null,null,null,{"$f":"IF($N$52=\"\",\"\",$N$52)","v":""},null,null,{"$f":"IF($N$37=\"\",\"\",$N$37)","v":73.994},null,null,{"$f":"IF($P$29=\"\",\"\",$P$29)","v":""},null,null,{"$f":"IF($N$25=\"\",\"\",$N$25)","v":74.001999999999995},null,null,null,null,0.2,73.996498778336061,34.028858026000186,null,null,null,null,null,null,null,null,null,null,null,null,null,null,null,null,null,null,null,null,null,null,null,null,null,null,null,null,null,null,null,null,null,null,null,null,null,92,{"$error":"#N/A"},"","","","","",{"$error":"#N/A"}]
[null,null,null,null,null,null,null,null,null,null,null,null,null,null,null,null,null,null,null,null,null,null,null,null,null,null,null,null,null,null,null,null,null,null,null,null,null,null,null,null,93,"","","",null,null,"E51",{"$f":"IF($M$53=\"\",\"\",$M$53)","v":""},null,null,{"$f":"IF($O$37=\"\",\"\",$O$37)","v":""},null,"E28",{"$f":"IF($M$30=\"\",\"\",$M$30)","v":74.015000000000001},null,null,{"$f":"IF($O$25=\"\",\"\",$O$25)","v":""},null,null,null,null,0.1,73.998740333519422,35.417602066920395,null,null,null,null,null,null,null,null,null,null,null,null,null,null,null,null,null,null,null,null,null,null,null,null,null,null,null,null,null,null,null,null,null,null,null,null,null,93,{"$error":"#N/A"},"","","","","",{"$error":"#N/A"}]
[null,null,null,null,null,null,null,null,null,null,null,null,null,null,null,null,null,null,null,null,null,null,null,null,null,null,null,null,null,null,null,null,null,null,null,null,null,null,null,null,94,"","","",null,null,null,{"$f":"IF($N$53=\"\",\"\",$N$53)","v":""},null,"E36",{"$f":"IF($M$38=\"\",\"\",$M$38)","v":73.995000000000005},null,null,{"$f":"IF($N$30=\"\",\"\",$N$30)","v":74.007999999999996},null,null,{"$f":"IF($P$25=\"\",\"\",$P$25)","v":""},null,null,null,null,0,{"$f":"Mittelwert","v":73.999861111111102},35.595133536070328,null,null,null,null,null,null,null,null,null,null,null,null,null,null,null,null,null,null,null,null,null,null,null,null,null,null,null,null,null,null,null,null,null,null,null,null,null,94,{"$error":"#N/A"},"","","","","",{"$error":"#N/A"}]
[null,null,null,null,null,null,null,null,null,null,null,null,null,null,null,null,null,null,null,null,null,null,null,null,null,null,null,null,null,null,null,null,null,null,null,null,null,null,null,null,95,"","","",null,null,"E52",{"$f":"IF($M$54=\"\",\"\",$M$54)","v":""},null,null,{"$f":"IF($N$38=\"\",\"\",$N$38)","v":74.006},null,null,{"$f":"IF($O$30=\"\",\"\",$O$30)","v":""},null,null,{"$f":"IF($Q$25=\"\",\"\",$Q$25)","v":""},null,null,null,null,0.1,{"$f":"BK100+(BJ101*Standardabweichung)","v":74.000981888702782},35.417602066920395,null,null,null,null,null,null,null,null,null,null,null,null,null,null,null,null,null,null,null,null,null,null,null,null,null,null,null,null,null,null,null,null,null,null,null,null,null,95,{"$error":"#N/A"},"","","","","",{"$error":"#N/A"}]
[null,null,null,null,null,null,null,null,null,null,null,null,null,null,null,null,null,null,null,null,null,null,null,null,null,null,null,null,null,null,null,null,null,null,null,null,null,null,null,null,96,"","","",null,null,null,{"$f":"IF($N$54=\"\",\"\",$N$54)","v":""},null,null,{"$f":"IF($O$38=\"\",\"\",$O$38)","v":""},null,null,{"$f":"IF($P$30=\"\",\"\",$P$30)","v":""},null,"E24",{"$f":"IF($M$26=\"\",\"\",$M$26)","v":74},null,null,null,null,0.2,74.003223443886142,34.028858026000186,null,null,null,null,null,null,null,null,null,null,null,null,null,null,null,null,null,null,null,null,null,null,null,null,null,null,null,null,null,null,null,null,null,null,null,null,null,96,{"$error":"#N/A"},"","","","","",{"$error":"#N/A"}]
[null,null,null,null,null,null,null,null,null,null,null,null,null,null,null,null,null,null,null,null,null,null,null,null,null,null,null,null,null,null,null,null,null,null,null,null,null,null,null,null,97,"","","",null,null,"E53",{"$f":"IF($M$55=\"\",\"\",$M$55)","v":""},null,"E37",{"$f":"IF($M$39=\"\",\"\",$M$39)","v":73.984999999999999},null,"E29",{"$f":"IF($M$31=\"\",\"\",$M$31)","v":73.981999999999999},null,null,{"$f":"IF($N$26=\"\",\"\",$N$26)","v":74.010000000000005},null,null,null,null,0.3,74.006585776661183,29.731554713899989,null,null,null,null,null,null,null,null,null,null,null,null,null,null,null,null,null,null,null,null,null,null,null,null,null,null,null,null,null,null,null,null,null,null,null,null,null,97,{"$error":"#N/A"},"","",{"$f":"IF(AP103=\"\",\"\",1-DA103)","v":""},"",{"$f":"IF(AP103=\"\",\"\",(2*CZ103-1)*(LN(DC103)+LN(DA103)))","v":""},{"$error":"#N/A"}]
[null,null,null,null,null,null,null,null,null,null,null,null,null,null,null,null,null,null,null,null,null,null,null,null,null,null,null,null,null,null,null,null,null,null,null,null,null,null,null,null,98,"","","",null,null,null,{"$f":"IF($N$55=\"\",\"\",$N$55)","v":""},null,null,{"$f":"IF($N$39=\"\",\"\",$N$39)","v":74.003},null,null,{"$f":"IF($N$31=\"\",\"\",$N$31)","v":73.983999999999995},null,null,{"$f":"IF($O$26=\"\",\"\",$O$26)","v":""},null,null,null,null,0.4,74.011068887027903,21.589539826220395,null,null,null,null,null,null,null,null,null,null,null,null,null,null,null,null,null,null,null,null,null,null,null,null,null,null,null,null,null,null,null,null,null,null,null,null,null,98,{"$error":"#N/A"},{"$f":"IF(AP104=\"\",\"\",1+CZ103)","v":""},"","","","",{"$error":"#N/A"}]
[null,null,null,null,null,null,null,null,null,null,null,null,null,null,null,null,null,null,null,null,null,null,null,null,null,null,null,null,null,null,null,null,null,null,null,null,null,null,null,null,99,"","","",null,null,"E54",{"$f":"IF($M$56=\"\",\"\",$M$56)","v":""},null,null,{"$f":"IF($O$39=\"\",\"\",$O$39)","v":""},null,null,{"$f":"IF($O$31=\"\",\"\",$O$31)","v":""},null,null,{"$f":"IF($P$26=\"\",\"\",$P$26)","v":""},null,null,null,null,0.5,74.016672774986318,11.55604792844737,null,null,null,null,null,null,null,null,null,null,null,null,null,null,null,null,null,null,null,null,null,null,null,null,null,null,null,null,null,null,null,null,null,null,null,null,null,99,{"$error":"#N/A"},"","","","","",{"$error":"#N/A"}]
[null,null,null,null,null,null,null,null,null,null,null,null,null,null,null,null,null,null,null,null,null,null,null,null,null,null,null,null,null,null,null,null,null,null,null,null,null,null,null,null,100,"","","",null,null,null,{"$f":"IF($N$56=\"\",\"\",$N$56)","v":""},null,"E38",{"$f":"IF($M$40=\"\",\"\",$M$40)","v":74.007999999999996},null,null,{"$f":"IF($P$31=\"\",\"\",$P$31)","v":""},null,null,{"$f":"IF($Q$26=\"\",\"\",$Q$26)","v":""},null,null,null,null,0.6,74.023397440536414,3.9243821706368993,null,null,null,null,null,null,null,null,null,null,null,null,null,null,null,null,null,null,null,null,null,null,null,null,null,null,null,null,null,null,null,null,null,null,null,null,null,100,{"$error":"#N/A"},"","","","","",{"$error":"#N/A"}]
[null,null,null,null,null,null,null,null,null,null,null,null,null,null,null,null,null,null,null,null,null,null,null,null,null,null,null,null,null,null,null,null,null,null,null,null,null,null,null,null,101,"","","",null,null,null,null,null,null,{"$f":"IF($N$40=\"\",\"\",$N$40)","v":73.995000000000005},null,"E30",{"$f":"IF($M$32=\"\",\"\",$M$32)","v":74.03},null,"E25",{"$f":"IF($M$27=\"\",\"\",$M$27)","v":73.981999999999999},null,null,null,null,0.7,74.031242883678189,0.70624641692743895,null,null,null,null,null,null,null,null,null,null,null,null,null,null,null,null,null,null,null,null,null,null,null,null,null,null,null,null,null,null,null,null,null,null,null,null,null,101,{"$error":"#N/A"},"","","","","",{"$error":"#N/A"}]
[null,null,null,null,null,null,null,null,null,null,null,null,null,null,null,null,null,null,null,null,null,null,null,null,null,null,null,null,null,null,null,null,null,null,null,null,null,null,null,null,102,"","","",null,null,null,null,null,null,{"$f":"IF($O$40=\"\",\"\",$O$40)","v":""},null,null,{"$f":"IF($N$32=\"\",\"\",$N$32)","v":74.001999999999995},null,null,{"$f":"IF($N$27=\"\",\"\",$N$27)","v":74.001000000000005},null,null,null,null,0.8,74.040209104411645,5.459619594953824E-2,null,null,null,null,null,null,null,null,null,null,null,null,null,null,null,null,null,null,null,null,null,null,null,null,null,null,null,null,null,null,null,null,null,null,null,null,null,102,{"$error":"#N/A"},"","","","","",{"$error":"#N/A"}]
[null,null,null,null,null,null,null,null,null,null,null,null,null,null,null,null,null,null,null,null,null,null,null,null,null,null,null,null,null,null,null,null,null,null,null,null,null,null,null,null,103,"","","",null,null,null,null,null,"E39",{"$f":"IF($M$41=\"\",\"\",$M$41)","v":73.998000000000005},null,null,{"$f":"IF($O$32=\"\",\"\",$O$32)","v":""},null,null,{"$f":"IF($O$27=\"\",\"\",$O$27)","v":""},null,null,null,null,0.9,74.05029610273678,1.4261296108617327E-3,null,null,null,null,null,null,null,null,null,null,null,null,null,null,null,null,null,null,null,null,null,null,null,null,null,null,null,null,null,null,null,null,null,null,null,null,null,103,{"$error":"#N/A"},"","","","","",{"$error":"#N/A"}]
[null,null,null,null,null,null,null,null,null,null,null,null,null,null,null,null,null,null,null,null,null,null,null,null,null,null,null,null,null,null,null,null,null,null,null,null,null,null,null,null,104,"","","",null,null,null,null,null,null,{"$f":"IF($N$41=\"\",\"\",$N$41)","v":74},null,null,{"$f":"IF($P$32=\"\",\"\",$P$32)","v":""},null,null,{"$f":"IF($P$27=\"\",\"\",$P$27)","v":""},null,null,null,null,1,74.061503878653596,9.6091857318111317E-6,null,null,null,null,null,null,null,null,null,null,null,null,null,null,null,null,null,null,null,null,null,null,null,null,null,null,null,null,null,null,null,null,null,null,null,null,null,104,{"$error":"#N/A"},"","","","","",{"$error":"#N/A"}]
[null,null,null,null,null,null,null,null,null,null,null,null,null,null,null,null,null,null,null,null,null,null,null,null,null,null,null,null,null,null,null,null,null,null,null,null,null,null,null,null,105,"","","",null,null,null,null,null,null,{"$f":"IF($O$41=\"\",\"\",$O$41)","v":""},null,"E31",{"$f":"IF($M$33=\"\",\"\",$M$33)","v":73.995000000000005},null,null,{"$f":"IF($Q$27=\"\",\"\",$Q$27)","v":""},null,null,null,null,1.1000000000000001,74.073832432162092,1.237248143124341E-8,null,null,null,null,null,null,null,null,null,null,null,null,null,null,null,null,null,null,null,null,null,null,null,null,null,null,null,null,null,null,null,null,null,null,null,null,null,105,{"$error":"#N/A"},"","","","","",{"$error":"#N/A"}]
[null,null,null,null,null,null,null,null,null,null,null,null,null,null,null,null,null,null,null,null,null,null,null,null,null,null,null,null,null,null,null,null,null,null,null,null,null,null,null,null,106,"","","",null,null,null,null,null,"E40",{"$f":"IF($M$42=\"\",\"\",$M$42)","v":73.994},null,null,{"$f":"IF($N$33=\"\",\"\",$N$33)","v":73.992000000000004},null,"E26",{"$f":"IF($M$28=\"\",\"\",$M$28)","v":74.004000000000005},null,null,null,null,null,null,null,null,null,null,null,null,null,null,null,null,null,null,null,null,null,null,null,null,null,null,null,null,null,null,null,null,null,null,null,null,null,null,null,null,null,null,null,null,106,{"$error":"#N/A"},"","","","","",{"$error":"#N/A"}]
[null,null,null,null,null,null,null,null,null,null,null,null,null,null,null,null,null,null,null,null,null,null,null,null,null,null,null,null,null,null,null,null,null,null,null,null,null,null,null,null,107,"","","",null,null,null,null,null,null,{"$f":"IF($N$42=\"\",\"\",$N$42)","v":73.998000000000005},null,null,{"$f":"IF($O$33=\"\",\"\",$O$33)","v":""},null,null,{"$f":"IF($N$28=\"\",\"\",$N$28)","v":73.998999999999995},null,null,null,null,null,null,null,null,null,null,null,null,null,null,null,null,null,null,null,null,null,null,null,null,null,null,null,null,null,null,null,null,null,null,null,null,null,null,null,null,null,null,null,null,107,{"$error":"#N/A"},"","","","","",{"$error":"#N/A"}]
[null,null,null,null,null,null,null,null,null,null,null,null,null,null,null,null,null,null,null,null,null,null,null,null,null,null,null,null,null,null,null,null,null,null,null,null,null,null,null,null,108,"","","",null,null,null,null,null,null,{"$f":"IF($O$42=\"\",\"\",$O$42)","v":""},null,null,{"$f":"IF($P$33=\"\",\"\",$P$33)","v":""},null,null,{"$f":"IF($O$28=\"\",\"\",$O$28)","v":""},null,null,null,null,null,null,null,null,null,null,null,null,null,null,null,null,null,null,null,null,null,null,null,null,null,null,null,null,null,null,null,null,null,null,null,null,null,null,null,null,null,null,null,null,108,{"$error":"#N/A"},"","","","","",{"$error":"#N/A"}]
[null,null,null,null,null,null,null,null,null,null,null,null,null,null,null,null,null,null,null,null,null,null,null,null,null,null,null,null,null,null,null,null,null,null,null,null,null,null,null,null,109,"","","",null,null,null,null,null,"E41",{"$f":"IF($M$43=\"\",\"\",$M$43)","v":""},null,"E32",{"$f":"IF($M$34=\"\",\"\",$M$34)","v":73.988},null,null,{"$f":"IF($P$28=\"\",\"\",$P$28)","v":""},null,null,null,null,null,null,null,null,null,null,null,null,null,null,null,null,null,null,null,null,null,null,null,null,null,null,null,null,null,null,null,null,null,null,null,null,null,null,null,null,null,null,null,null,109,{"$error":"#N/A"},"","","","","",{"$error":"#N/A"}]
[null,null,null,null,null,null,null,null,null,null,null,null,null,null,null,null,null,null,null,null,null,null,null,null,null,null,null,null,null,null,null,null,null,null,null,null,null,null,null,null,110,"","","",null,null,null,null,null,null,{"$f":"IF($N$43=\"\",\"\",$N$43)","v":""},null,null,{"$f":"IF($N$34=\"\",\"\",$N$34)","v":74.024000000000001},null,null,{"$f":"IF($Q$28=\"\",\"\",$Q$28)","v":""},null,null,null,null,null,null,null,null,null,null,null,null,null,null,null,null,null,null,null,null,null,null,null,null,null,null,null,null,null,null,null,null,null,null,null,null,null,null,null,null,null,null,null,null,110,{"$error":"#N/A"},"","","","","",{"$error":"#N/A"}]
[null,null,null,null,null,null,null,null,null,null,null,null,null,null,null,null,null,null,null,null,null,null,null,null,null,null,null,null,null,null,null,null,null,null,null,null,null,null,null,null,111,"","","",null,null,null,null,null,null,{"$f":"IF($O$43=\"\",\"\",$O$43)","v":""},null,null,{"$f":"IF($O$34=\"\",\"\",$O$34)","v":""},null,"E27",{"$f":"IF($M$29=\"\",\"\",$M$29)","v":74.010000000000005},null,null,null,null,null,null,null,null,null,null,null,null,null,null,null,null,null,null,null,null,null,null,null,null,null,null,null,null,null,null,null,null,null,null,null,null,null,null,null,null,null,null,null,null,111,{"$error":"#N/A"},"","","","","",{"$error":"#N/A"}]
[null,null,null,null,null,null,null,null,null,null,null,null,null,null,null,null,null,null,null,null,null,null,null,null,null,null,null,null,null,null,null,null,null,null,null,null,null,null,null,null,112,"","","",null,null,null,null,null,"E42",{"$f":"IF($M$44=\"\",\"\",$M$44)","v":""},null,null,{"$f":"IF($P$34=\"\",\"\",$P$34)","v":""},null,null,{"$f":"IF($N$29=\"\",\"\",$N$29)","v":73.989000000000004},null,null,null,null,null,null,null,null,null,null,null,null,null,null,null,null,null,null,null,null,null,null,null,null,null,null,null,null,null,null,null,null,null,null,null,null,null,null,null,null,null,null,null,null,112,{"$error":"#N/A"},"","","","","",{"$error":"#N/A"}]
[null,null,null,null,null,null,null,null,null,null,null,null,null,null,null,null,null,null,null,null,null,null,null,null,null,null,null,null,null,null,null,null,null,null,null,null,null,null,null,null,113,"","","",null,null,null,null,null,null,{"$f":"IF($N$44=\"\",\"\",$N$44)","v":""},null,"E33",{"$f":"IF($M$35=\"\",\"\",$M$35)","v":74.001999999999995},null,null,{"$f":"IF($O$29=\"\",\"\",$O$29)","v":""},null,null,null,null,null,null,null,null,null,null,null,null,null,null,null,null,null,null,null,null,null,null,null,null,null,null,null,null,null,null,null,null,null,null,null,null,null,null,null,null,null,null,null,null,113,{"$error":"#N/A"},"","","","","",{"$error":"#N/A"}]
[null,null,null,null,null,null,null,null,null,null,null,null,null,null,null,null,null,null,null,null,null,null,null,null,null,null,null,null,null,null,null,null,null,null,null,null,null,null,null,null,114,"","","",null,null,null,null,null,null,{"$f":"IF($O$44=\"\",\"\",$O$44)","v":""},null,null,{"$f":"IF($N$35=\"\",\"\",$N$35)","v":73.995999999999995},null,null,{"$f":"IF($P$29=\"\",\"\",$P$29)","v":""},null,null,null,null,null,null,null,null,null,null,null,null,null,null,null,null,null,null,null,null,null,null,null,null,null,null,null,null,null,null,null,null,null,null,null,null,null,null,null,null,null,null,null,null,114,{"$error":"#N/A"},"","","","","",{"$error":"#N/A"}]
[null,null,null,null,null,null,null,null,null,null,null,null,null,null,null,null,null,null,null,null,null,null,null,null,null,null,null,null,null,null,null,null,null,null,null,null,null,null,null,null,115,"","","",null,null,null,null,null,"E43",{"$f":"IF($M$45=\"\",\"\",$M$45)","v":""},null,null,{"$f":"IF($O$35=\"\",\"\",$O$35)","v":""},null,null,{"$f":"IF($Q$29=\"\",\"\",$Q$29)","v":""},null,null,null,null,null,null,null,null,null,null,null,null,null,null,null,null,null,null,null,null,null,null,null,null,null,null,null,null,null,null,null,null,null,null,null,null,null,null,null,null,null,null,null,null,115,{"$error":"#N/A"},"","","","","",{"$error":"#N/A"}]
[null,null,null,null,null,null,null,null,null,null,null,null,null,null,null,null,null,null,null,null,null,null,null,null,null,null,null,null,null,null,null,null,null,null,null,null,null,null,null,null,116,"","","",null,null,null,null,null,null,{"$f":"IF($N$45=\"\",\"\",$N$45)","v":""},null,null,{"$f":"IF($P$35=\"\",\"\",$P$35)","v":""},null,"E28",{"$f":"IF($M$30=\"\",\"\",$M$30)","v":74.015000000000001},null,null,null,null,null,null,null,null,null,null,null,null,null,null,null,null,null,null,null,null,null,null,null,null,null,null,null,null,null,null,null,null,null,null,null,null,null,null,null,null,null,null,null,null,116,{"$error":"#N/A"},"","","","","",{"$error":"#N/A"}]
[null,null,null,null,null,null,null,null,null,null,null,null,null,null,null,null,null,null,null,null,null,null,null,null,null,null,null,null,null,null,null,null,null,null,null,null,null,null,null,null,117,"","","",null,null,null,null,null,null,{"$f":"IF($O$45=\"\",\"\",$O$45)","v":""},null,"E34",{"$f":"IF($M$36=\"\",\"\",$M$36)","v":73.992000000000004},null,null,{"$f":"IF($N$30=\"\",\"\",$N$30)","v":74.007999999999996},null,null,null,null,null,null,null,null,null,null,null,null,null,null,null,null,null,null,null,null,null,null,null,null,null,null,null,null,null,null,null,null,null,null,null,null,null,null,null,null,null,null,null,null,117,{"$error":"#N/A"},"","","","","",{"$error":"#N/A"}]
[null,null,null,null,null,null,null,null,null,null,null,null,null,null,null,null,null,null,null,null,null,null,null,null,null,null,null,null,null,null,null,null,null,null,null,null,null,null,null,null,118,"","","",null,null,null,null,null,"E44",{"$f":"IF($M$46=\"\",\"\",$M$46)","v":""},null,null,{"$f":"IF($N$36=\"\",\"\",$N$36)","v":74.007000000000005},null,null,{"$f":"IF($O$30=\"\",\"\",$O$30)","v":""},null,null,null,null,null,null,null,null,null,null,null,null,null,null,null,null,null,null,null,null,null,null,null,null,null,null,null,null,null,null,null,null,null,null,null,null,null,null,null,null,null,null,null,null,118,{"$error":"#N/A"},"","","","","",{"$error":"#N/A"}]
[null,null,null,null,null,null,null,null,null,null,null,null,null,null,null,null,null,null,null,null,null,null,null,null,null,null,null,null,null,null,null,null,null,null,null,null,null,null,null,null,119,"","","",null,null,null,null,null,null,{"$f":"IF($N$46=\"\",\"\",$N$46)","v":""},null,null,{"$f":"IF($O$36=\"\",\"\",$O$36)","v":""},null,null,{"$f":"IF($P$30=\"\",\"\",$P$30)","v":""},null,null,null,null,null,null,null,null,null,null,null,null,null,null,null,null,null,null,null,null,null,null,null,null,null,null,null,null,null,null,null,null,null,null,null,null,null,null,null,null,null,null,null,null,119,{"$error":"#N/A"},"","","","","",{"$error":"#N/A"}]
[null,null,null,null,null,null,null,null,null,null,null,null,null,null,null,null,null,null,null,null,null,null,null,null,null,null,null,null,null,null,null,null,null,null,null,null,null,null,null,null,120,"","","",null,null,null,null,null,null,{"$f":"IF($O$46=\"\",\"\",$O$46)","v":""},null,null,{"$f":"IF($P$36=\"\",\"\",$P$36)","v":""},null,null,{"$f":"IF($Q$30=\"\",\"\",$Q$30)","v":""},null,null,null,null,null,null,null,null,null,null,null,null,null,null,null,null,null,null,null,null,null,null,null,null,null,null,null,null,null,null,null,null,null,null,null,null,null,null,null,null,null,null,null,null,120,{"$error":"#N/A"},"","","","","",{"$error":"#N/A"}]
[null,null,null,null,null,null,null,null,null,null,null,null,null,null,null,null,null,null,null,null,null,null,null,null,null,null,null,null,null,null,null,null,null,null,null,null,null,null,null,null,121,"","","",null,null,null,null,null,"E45",{"$f":"IF($M$47=\"\",\"\",$M$47)","v":""},null,"E35",{"$f":"IF($M$37=\"\",\"\",$M$37)","v":74.009},null,"E29",{"$f":"IF($M$31=\"\",\"\",$M$31)","v":73.981999999999999},null,null,null,null,null,null,null,null,null,null,null,null,null,null,null,null,null,null,null,null,null,null,null,null,null,null,null,null,null,null,null,null,null,null,null,null,null,null,null,null,null,null,null,null,121,{"$error":"#N/A"},"","","","","",{"$error":"#N/A"}]
[null,null,null,null,null,null,null,null,null,null,null,null,null,null,null,null,null,null,null,null,null,null,null,null,null,null,null,null,null,null,null,null,null,null,null,null,null,null,null,null,122,"","","",null,null,null,null,null,null,{"$f":"IF($N$47=\"\",\"\",$N$47)","v":""},null,null,{"$f":"IF($N$37=\"\",\"\",$N$37)","v":73.994},null,null,{"$f":"IF($N$31=\"\",\"\",$N$31)","v":73.983999999999995},null,null,null,null,null,null,null,null,null,null,null,null,null,null,null,null,null,null,null,null,null,null,null,null,null,null,null,null,null,null,null,null,null,null,null,null,null,null,null,null,null,null,null,null,122,{"$error":"#N/A"},"","","","","",{"$error":"#N/A"}]
[null,null,null,null,null,null,null,null,null,null,null,null,null,null,null,null,null,null,null,null,null,null,null,null,null,null,null,null,null,null,null,null,null,null,null,null,null,null,null,null,123,"","","",null,null,null,null,null,null,{"$f":"IF($O$47=\"\",\"\",$O$47)","v":""},null,null,{"$f":"IF($O$37=\"\",\"\",$O$37)","v":""},null,null,{"$f":"IF($O$31=\"\",\"\",$O$31)","v":""},null,null,null,null,null,null,null,null,null,null,null,null,null,null,null,null,null,null,null,null,null,null,null,null,null,null,null,null,null,null,null,null,null,null,null,null,null,null,null,null,null,null,null,null,123,{"$error":"#N/A"},"","","","","",{"$error":"#N/A"}]
[null,null,null,null,null,null,null,null,null,null,null,null,null,null,null,null,null,null,null,null,null,null,null,null,null,null,null,null,null,null,null,null,null,null,null,null,null,null,null,null,124,"","","",null,null,null,null,null,"E46",{"$f":"IF($M$48=\"\",\"\",$M$48)","v":""},null,null,{"$f":"IF($P$37=\"\",\"\",$P$37)","v":""},null,null,{"$f":"IF($P$31=\"\",\"\",$P$31)","v":""},null,null,null,null,null,null,null,null,null,null,null,null,null,null,null,null,null,null,null,null,null,null,null,null,null,null,null,null,null,null,null,null,null,null,null,null,null,null,null,null,null,null,null,null,124,{"$error":"#N/A"},"","","","","",{"$error":"#N/A"}]
[null,null,null,null,null,null,null,null,null,null,null,null,null,null,null,null,null,null,null,null,null,null,null,null,null,null,null,null,null,null,null,null,null,null,null,null,null,null,null,null,125,"","","",null,null,null,null,null,null,{"$f":"IF($N$48=\"\",\"\",$N$48)","v":""},null,"E36",{"$f":"IF($M$38=\"\",\"\",$M$38)","v":73.995000000000005},null,null,{"$f":"IF($Q$31=\"\",\"\",$Q$31)","v":""},null,null,null,null,null,null,null,null,null,null,null,null,null,null,null,null,null,null,null,null,null,null,null,null,null,null,null,null,null,null,null,null,null,null,null,null,null,null,null,null,null,null,null,null,125,{"$error":"#N/A"},"","","","","",{"$error":"#N/A"}]
[null,null,null,null,null,null,null,null,null,null,null,null,null,null,null,null,null,null,null,null,null,null,null,null,null,null,null,null,null,null,null,null,null,null,null,null,null,null,null,null,126,"","","",null,null,null,null,null,null,{"$f":"IF($O$48=\"\",\"\",$O$48)","v":""},null,null,{"$f":"IF($N$38=\"\",\"\",$N$38)","v":74.006},null,"E30",{"$f":"IF($M$32=\"\",\"\",$M$32)","v":74.03},null,null,null,null,null,null,null,null,null,null,null,null,null,null,null,null,null,null,null,null,null,null,null,null,null,null,null,null,null,null,null,null,null,null,null,null,null,null,null,null,null,null,null,null,126,{"$error":"#N/A"},"","","","","",{"$error":"#N/A"}]
[null,null,null,null,null,null,null,null,null,null,null,null,null,null,null,null,null,null,null,null,null,null,null,null,null,null,null,null,null,null,null,null,null,null,null,null,null,null,null,null,127,"","","",null,null,null,null,null,"E47",{"$f":"IF($M$49=\"\",\"\",$M$49)","v":""},null,null,{"$f":"IF($O$38=\"\",\"\",$O$38)","v":""},null,null,{"$f":"IF($N$32=\"\",\"\",$N$32)","v":74.001999999999995},null,null,null,null,null,null,null,null,null,null,null,null,null,null,null,null,null,null,null,null,null,null,null,null,null,null,null,null,null,null,null,null,null,null,null,null,null,null,null,null,null,null,null,null,127,{"$error":"#N/A"},"","","","","",{"$error":"#N/A"}]
[null,null,null,null,null,null,null,null,null,null,null,null,null,null,null,null,null,null,null,null,null,null,null,null,null,null,null,null,null,null,null,null,null,null,null,null,null,null,null,null,128,"","","",null,null,null,null,null,null,{"$f":"IF($N$49=\"\",\"\",$N$49)","v":""},null,null,{"$f":"IF($P$38=\"\",\"\",$P$38)","v":""},null,null,{"$f":"IF($O$32=\"\",\"\",$O$32)","v":""},null,null,null,null,null,null,null,null,null,null,null,null,null,null,null,null,null,null,null,null,null,null,null,null,null,null,null,null,null,null,null,null,null,null,null,null,null,null,null,null,null,null,null,null,128,{"$error":"#N/A"},"","","","","",{"$error":"#N/A"}]
[null,null,null,null,null,null,null,null,null,null,null,null,null,null,null,null,null,null,null,null,null,null,null,null,null,null,null,null,null,null,null,null,null,null,null,null,null,null,null,null,129,"",{"$f":"IF(AP135<>\"\",IF(AP135<UGW,1,0),\"\")","v":""},{"$f":"IF(AP135<>\"\",IF(AP135>OGW,1,0),\"\")","v":""},null,null,null,null,null,null,{"$f":"IF($O$49=\"\",\"\",$O$49)","v":""},null,"E37",{"$f":"IF($M$39=\"\",\"\",$M$39)","v":73.984999999999999},null,null,{"$f":"IF($P$32=\"\",\"\",$P$32)","v":""},null,null,null,null,null,null,null,null,null,null,null,null,null,null,null,null,null,null,null,null,null,null,null,null,null,null,null,null,null,null,null,null,null,null,null,null,null,null,null,null,null,null,null,null,129,{"$f":"IF(AP135=\"\",NA(),SMALL(xi,CZ135))","v":{"$error":"#N/A"}},"",{"$f":"IF(AP135=\"\",\"\",NORMSDIST((CY135-Mittelwert)/Standardabweichung)-0.00000001)","v":""},{"$f":"IF(AP135=\"\",\"\",1-DA135)","v":""},{"$f":"IF(AP135=\"\",\"\",SMALL(BG,CZ135))","v":""},{"$f":"IF(AP135=\"\",\"\",(2*CZ135-1)*(LN(DC135)+LN(DA135)))","v":""},{"$f":"IF(AP135=\"\",NA(),NORMSINV((CZ135-0.3)/(Anzahl+0.4)))","v":{"$error":"#N/A"}}]
[null,null,null,null,null,null,null,null,null,null,null,null,null,null,null,null,null,null,null,null,null,null,null,null,null,null,null,null,null,null,null,null,null,null,null,null,null,null,null,null,130,{"$f":"IF($BI$41=2,IF(AV136<>\"\",AV136,\"\"),(IF($BI$41=3,IF(AY136<>\"\",AY136,\"\"),(IF($BI$41=4,IF(BB136<>\"\",BB136,\"\"),IF(BE136<>\"\",BE136,\"\"))))))","v":""},"","",null,null,null,null,null,"E48",{"$f":"IF($M$50=\"\",\"\",$M$50)","v":""},null,null,{"$f":"IF($N$39=\"\",\"\",$N$39)","v":74.003},null,null,{"$f":"IF($Q$32=\"\",\"\",$Q$32)","v":""},null,null,null,null,null,null,null,null,null,null,null,null,null,null,null,null,null,null,null,null,null,null,null,null,null,null,null,null,null,null,null,null,null,null,null,null,null,null,null,null,null,null,null,null,130,{"$error":"#N/A"},{"$f":"IF(AP136=\"\",\"\",1+CZ135)","v":""},"","","","",{"$error":"#N/A"}]
[null,null,null,null,null,null,null,null,null,null,null,null,null,null,null,null,null,null,null,null,null,null,null,null,null,null,null,null,null,null,null,null,null,null,null,null,null,null,null,null,131,"","","",null,null,null,null,null,null,{"$f":"IF($N$50=\"\",\"\",$N$50)","v":""},null,null,{"$f":"IF($O$39=\"\",\"\",$O$39)","v":""},null,"E31",{"$f":"IF($M$33=\"\",\"\",$M$33)","v":73.995000000000005},null,null,null,null,null,null,null,null,null,null,null,null,null,null,null,null,null,null,null,null,null,null,null,null,null,null,null,null,null,null,null,null,null,null,null,null,null,null,null,null,null,null,null,null,131,{"$error":"#N/A"},"","","","","",{"$error":"#N/A"}]
[null,null,null,null,null,null,null,null,null,null,null,null,null,null,null,null,null,null,null,null,null,null,null,null,null,null,null,null,null,null,null,null,null,null,null,null,null,null,null,null,132,"","","",null,null,null,null,null,null,{"$f":"IF($O$50=\"\",\"\",$O$50)","v":""},null,null,{"$f":"IF($P$39=\"\",\"\",$P$39)","v":""},null,null,{"$f":"IF($N$33=\"\",\"\",$N$33)","v":73.992000000000004},null,null,null,null,null,null,null,null,null,null,null,null,null,null,null,null,null,null,null,null,null,null,null,null,null,null,null,null,null,null,null,null,null,null,null,null,null,null,null,null,null,null,null,null,132,{"$error":"#N/A"},"","","","","",{"$error":"#N/A"}]
[null,null,null,null,null,null,null,null,null,null,null,null,null,null,null,null,null,null,null,null,null,null,null,null,null,null,null,null,null,null,null,null,null,null,null,null,null,null,null,null,133,"","","",null,null,null,null,null,"E49",{"$f":"IF($M$51=\"\",\"\",$M$51)","v":""},null,"E38",{"$f":"IF($M$40=\"\",\"\",$M$40)","v":74.007999999999996},null,null,{"$f":"IF($O$33=\"\",\"\",$O$33)","v":""},null,null,null,null,null,null,null,null,null,null,null,null,null,null,null,null,null,null,null,null,null,null,null,null,null,null,null,null,null,null,null,null,null,null,null,null,null,null,null,null,null,null,null,null,133,{"$error":"#N/A"},"","","","","",{"$error":"#N/A"}]
[null,null,null,null,null,null,null,null,null,null,null,null,null,null,null,null,null,null,null,null,null,null,null,null,null,null,null,null,null,null,null,null,null,null,null,null,null,null,null,null,134,"","","",null,null,null,null,null,null,{"$f":"IF($N$51=\"\",\"\",$N$51)","v":""},null,null,{"$f":"IF($N$40=\"\",\"\",$N$40)","v":73.995000000000005},null,null,{"$f":"IF($P$33=\"\",\"\",$P$33)","v":""},null,null,null,null,null,null,null,null,null,null,null,null,null,null,null,null,null,null,null,null,null,null,null,null,null,null,null,null,null,null,null,null,null,null,null,null,null,null,null,null,null,null,null,null,134,{"$error":"#N/A"},"","","","","",{"$error":"#N/A"}]
[null,null,null,null,null,null,null,null,null,null,null,null,null,null,null,null,null,null,null,null,null,null,null,null,null,null,null,null,null,null,null,null,null,null,null,null,null,null,null,null,135,"","","",null,null,null,null,null,null,{"$f":"IF($O$51=\"\",\"\",$O$51)","v":""},null,null,{"$f":"IF($O$40=\"\",\"\",$O$40)","v":""},null,null,{"$f":"IF($Q$33=\"\",\"\",$Q$33)","v":""},null,null,null,null,null,null,null,null,null,null,null,null,null,null,null,null,null,null,null,null,null,null,null,null,null,null,null,null,null,null,null,null,null,null,null,null,null,null,null,null,null,null,null,null,135,{"$error":"#N/A"},"","","","","",{"$error":"#N/A"}]
[null,null,null,null,null,null,null,null,null,null,null,null,null,null,null,null,null,null,null,null,null,null,null,null,null,null,null,null,null,null,null,null,null,null,null,null,null,null,null,null,136,"","","",null,null,null,null,null,"E50",{"$f":"IF($M$52=\"\",\"\",$M$52)","v":""},null,null,{"$f":"IF($P$40=\"\",\"\",$P$40)","v":""},null,"E32",{"$f":"IF($M$34=\"\",\"\",$M$34)","v":73.988},null,null,null,null,null,null,null,null,null,null,null,null,null,null,null,null,null,null,null,null,null,null,null,null,null,null,null,null,null,null,null,null,null,null,null,null,null,null,null,null,null,null,null,null,136,{"$error":"#N/A"},"","","","","",{"$error":"#N/A"}]
[null,null,null,null,null,null,null,null,null,null,null,null,null,null,null,null,null,null,null,null,null,null,null,null,null,null,null,null,null,null,null,null,null,null,null,null,null,null,null,null,137,"","","",null,null,null,null,null,null,{"$f":"IF($N$52=\"\",\"\",$N$52)","v":""},null,"E39",{"$f":"IF($M$41=\"\",\"\",$M$41)","v":73.998000000000005},null,null,{"$f":"IF($N$34=\"\",\"\",$N$34)","v":74.024000000000001},null,null,null,null,null,null,null,null,null,null,null,null,null,null,null,null,null,null,null,null,null,null,null,null,null,null,null,null,null,null,null,null,null,null,null,null,null,null,null,null,null,null,null,null,137,{"$error":"#N/A"},"","","","","",{"$error":"#N/A"}]
[null,null,null,null,null,null,null,null,null,null,null,null,null,null,null,null,null,null,null,null,null,null,null,null,null,null,null,null,null,null,null,null,null,null,null,null,null,null,null,null,138,"","","",null,null,null,null,null,null,{"$f":"IF($O$52=\"\",\"\",$O$52)","v":""},null,null,{"$f":"IF($N$41=\"\",\"\",$N$41)","v":74},null,null,{"$f":"IF($O$34=\"\",\"\",$O$34)","v":""},null,null,null,null,null,null,null,null,null,null,null,null,null,null,null,null,null,null,null,null,null,null,null,null,null,null,null,null,null,null,null,null,null,null,null,null,null,null,null,null,null,null,null,null,138,{"$error":"#N/A"},"","","","","",{"$error":"#N/A"}]
[null,null,null,null,null,null,null,null,null,null,null,null,null,null,null,null,null,null,null,null,null,null,null,null,null,null,null,null,null,null,null,null,null,null,null,null,null,null,null,null,139,"","","",null,null,null,null,null,"E51",{"$f":"IF($M$53=\"\",\"\",$M$53)","v":""},null,null,{"$f":"IF($O$41=\"\",\"\",$O$41)","v":""},null,null,{"$f":"IF($P$34=\"\",\"\",$P$34)","v":""},null,null,null,null,null,null,null,null,null,null,null,null,null,null,null,null,null,null,null,null,null,null,null,null,null,null,null,null,null,null,null,null,null,null,null,null,null,null,null,null,null,null,null,null,139,{"$error":"#N/A"},"","","","","",{"$error":"#N/A"}]
[null,null,null,null,null,null,null,null,null,null,null,null,null,null,null,null,null,null,null,null,null,null,null,null,null,null,null,null,null,null,null,null,null,null,null,null,null,null,null,null,140,"","","",null,null,null,null,null,null,{"$f":"IF($N$53=\"\",\"\",$N$53)","v":""},null,null,{"$f":"IF($P$41=\"\",\"\",$P$41)","v":""},null,null,{"$f":"IF($Q$34=\"\",\"\",$Q$34)","v":""},null,null,null,null,null,null,null,null,null,null,null,null,null,null,null,null,null,null,null,null,null,null,null,null,null,null,null,null,null,null,null,null,null,null,null,null,null,null,null,null,null,null,null,null,140,{"$error":"#N/A"},"","","","","",{"$error":"#N/A"}]
[null,null,null,null,null,null,null,null,null,null,null,null,null,null,null,null,null,null,null,null,null,null,null,null,null,null,null,null,null,null,null,null,null,null,null,null,null,null,null,null,141,"","","",null,null,null,null,null,null,{"$f":"IF($O$53=\"\",\"\",$O$53)","v":""},null,"E40",{"$f":"IF($M$42=\"\",\"\",$M$42)","v":73.994},null,"E33",{"$f":"IF($M$35=\"\",\"\",$M$35)","v":74.001999999999995},null,null,null,null,null,null,null,null,null,null,null,null,null,null,null,null,null,null,null,null,null,null,null,null,null,null,null,null,null,null,null,null,null,null,null,null,null,null,null,null,null,null,null,null,141,{"$error":"#N/A"},"","","","","",{"$error":"#N/A"}]
[null,null,null,null,null,null,null,null,null,null,null,null,null,null,null,null,null,null,null,null,null,null,null,null,null,null,null,null,null,null,null,null,null,null,null,null,null,null,null,null,142,"","","",null,null,null,null,null,"E52",{"$f":"IF($M$54=\"\",\"\",$M$54)","v":""},null,null,{"$f":"IF($N$42=\"\",\"\",$N$42)","v":73.998000000000005},null,null,{"$f":"IF($N$35=\"\",\"\",$N$35)","v":73.995999999999995},null,null,null,null,null,null,null,null,null,null,null,null,null,null,null,null,null,null,null,null,null,null,null,null,null,null,null,null,null,null,null,null,null,null,null,null,null,null,null,null,null,null,null,null,142,{"$error":"#N/A"},"","","","","",{"$error":"#N/A"}]
[null,null,null,null,null,null,null,null,null,null,null,null,null,null,null,null,null,null,null,null,null,null,null,null,null,null,null,null,null,null,null,null,null,null,null,null,null,null,null,null,143,"","","",null,null,null,null,null,null,{"$f":"IF($N$54=\"\",\"\",$N$54)","v":""},null,null,{"$f":"IF($O$42=\"\",\"\",$O$42)","v":""},null,null,{"$f":"IF($O$35=\"\",\"\",$O$35)","v":""},null,null,null,null,null,null,null,null,null,null,null,null,null,null,null,null,null,null,null,null,null,null,null,null,null,null,null,null,null,null,null,null,null,null,null,null,null,null,null,null,null,null,null,null,143,{"$error":"#N/A"},"","","","","",{"$error":"#N/A"}]
[null,null,null,null,null,null,null,null,null,null,null,null,null,null,null,null,null,null,null,null,null,null,null,null,null,null,null,null,null,null,null,null,null,null,null,null,null,null,null,null,144,"","","",null,null,null,null,null,null,{"$f":"IF($O$54=\"\",\"\",$O$54)","v":""},null,null,{"$f":"IF($P$42=\"\",\"\",$P$42)","v":""},null,null,{"$f":"IF($P$35=\"\",\"\",$P$35)","v":""},null,null,null,null,null,null,null,null,null,null,null,null,null,null,null,null,null,null,null,null,null,null,null,null,null,null,null,null,null,null,null,null,null,null,null,null,null,null,null,null,null,null,null,null,144,{"$error":"#N/A"},"","","","","",{"$error":"#N/A"}]
[null,null,null,null,null,null,null,null,null,null,null,null,null,null,null,null,null,null,null,null,null,null,null,null,null,null,null,null,null,null,null,null,null,null,null,null,null,null,null,null,145,"","","",null,null,null,null,null,"E53",{"$f":"IF($M$55=\"\",\"\",$M$55)","v":""},null,"E41",{"$f":"IF($M$43=\"\",\"\",$M$43)","v":""},null,null,{"$f":"IF($Q$35=\"\",\"\",$Q$35)","v":""},null,null,null,null,null,null,null,null,null,null,null,null,null,null,null,null,null,null,null,null,null,null,null,null,null,null,null,null,null,null,null,null,null,null,null,null,null,null,null,null,null,null,null,null,145,{"$error":"#N/A"},"","","","","",{"$error":"#N/A"}]
[null,null,null,null,null,null,null,null,null,null,null,null,null,null,null,null,null,null,null,null,null,null,null,null,null,null,null,null,null,null,null,null,null,null,null,null,null,null,null,null,146,"","","",null,null,null,null,null,null,{"$f":"IF($N$55=\"\",\"\",$N$55)","v":""},null,null,{"$f":"IF($N$43=\"\",\"\",$N$43)","v":""},null,"E34",{"$f":"IF($M$36=\"\",\"\",$M$36)","v":73.992000000000004},null,null,null,null,null,null,null,null,null,null,null,null,null,null,null,null,null,null,null,null,null,null,null,null,null,null,null,null,null,null,null,null,null,null,null,null,null,null,null,null,null,null,null,null,146,{"$error":"#N/A"},"","","","","",{"$error":"#N/A"}]
[null,null,null,null,null,null,null,null,null,null,null,null,null,null,null,null,null,null,null,null,null,null,null,null,null,null,null,null,null,null,null,null,null,null,null,null,null,null,null,null,147,"","","",null,null,null,null,null,null,{"$f":"IF($O$55=\"\",\"\",$O$55)","v":""},null,null,{"$f":"IF($O$43=\"\",\"\",$O$43)","v":""},null,null,{"$f":"IF($N$36=\"\",\"\",$N$36)","v":74.007000000000005},null,null,null,null,null,null,null,null,null,null,null,null,null,null,null,null,null,null,null,null,null,null,null,null,null,null,null,null,null,null,null,null,null,null,null,null,null,null,null,null,null,null,null,null,147,{"$error":"#N/A"},"","","","","",{"$error":"#N/A"}]
[null,null,null,null,null,null,null,null,null,null,null,null,null,null,null,null,null,null,null,null,null,null,null,null,null,null,null,null,null,null,null,null,null,null,null,null,null,null,null,null,148,"","","",null,null,null,null,null,"E54",{"$f":"IF($M$56=\"\",\"\",$M$56)","v":""},null,null,{"$f":"IF($P$43=\"\",\"\",$P$43)","v":""},null,null,{"$f":"IF($O$36=\"\",\"\",$O$36)","v":""},null,null,null,null,null,null,null,null,null,null,null,null,null,null,null,null,null,null,null,null,null,null,null,null,null,null,null,null,null,null,null,null,null,null,null,null,null,null,null,null,null,null,null,null,148,{"$error":"#N/A"},"","","","","",{"$error":"#N/A"}]
[null,null,null,null,null,null,null,null,null,null,null,null,null,null,null,null,null,null,null,null,null,null,null,null,null,null,null,null,null,null,null,null,null,null,null,null,null,null,null,null,149,"","","",null,null,null,null,null,null,{"$f":"IF($N$56=\"\",\"\",$N$56)","v":""},null,"E42",{"$f":"IF($M$44=\"\",\"\",$M$44)","v":""},null,null,{"$f":"IF($P$36=\"\",\"\",$P$36)","v":""},null,null,null,null,null,null,null,null,null,null,null,null,null,null,null,null,null,null,null,null,null,null,null,null,null,null,null,null,null,null,null,null,null,null,null,null,null,null,null,null,null,null,null,null,149,{"$error":"#N/A"},"","","","","",{"$error":"#N/A"}]
[null,null,null,null,null,null,null,null,null,null,null,null,null,null,null,null,null,null,null,null,null,null,null,null,null,null,null,null,null,null,null,null,null,null,null,null,null,null,null,null,150,"","","",null,null,null,null,null,null,{"$f":"IF($O$56=\"\",\"\",$O$56)","v":""},null,null,{"$f":"IF($N$44=\"\",\"\",$N$44)","v":""},null,null,{"$f":"IF($Q$36=\"\",\"\",$Q$36)","v":""},null,null,null,null,null,null,null,null,null,null,null,null,null,null,null,null,null,null,null,null,null,null,null,null,null,null,null,null,null,null,null,null,null,null,null,null,null,null,null,null,null,null,null,null,150,{"$error":"#N/A"},"","","","","",{"$error":"#N/A"}]
[null,null,null,null,null,null,null,null,null,null,null,null,null,null,null,null,null,null,null,null,null,null,null,null,null,null,null,null,null,null,null,null,null,null,null,null,null,null,null,null,151,"","","",null,null,null,null,null,null,null,null,null,{"$f":"IF($O$44=\"\",\"\",$O$44)","v":""},null,"E35",{"$f":"IF($M$37=\"\",\"\",$M$37)","v":74.009},null,null,null,null,null,null,null,null,null,null,null,null,null,null,null,null,null,null,null,null,null,null,null,null,null,null,null,null,null,null,null,null,null,null,null,null,null,null,null,null,null,null,null,null,151,{"$error":"#N/A"},"","","","","",{"$error":"#N/A"}]
[null,null,null,null,null,null,null,null,null,null,null,null,null,null,null,null,null,null,null,null,null,null,null,null,null,null,null,null,null,null,null,null,null,null,null,null,null,null,null,null,152,"","","",null,null,null,null,null,null,null,null,null,{"$f":"IF($P$44=\"\",\"\",$P$44)","v":""},null,null,{"$f":"IF($N$37=\"\",\"\",$N$37)","v":73.994},null,null,null,null,null,null,null,null,null,null,null,null,null,null,null,null,null,null,null,null,null,null,null,null,null,null,null,null,null,null,null,null,null,null,null,null,null,null,null,null,null,null,null,null,152,{"$error":"#N/A"},"","","","","",{"$error":"#N/A"}]
[null,null,null,null,null,null,null,null,null,null,null,null,null,null,null,null,null,null,null,null,null,null,null,null,null,null,null,null,null,null,null,null,null,null,null,null,null,null,null,null,153,"","","",null,null,null,null,null,null,null,null,"E43",{"$f":"IF($M$45=\"\",\"\",$M$45)","v":""},null,null,{"$f":"IF($O$37=\"\",\"\",$O$37)","v":""},null,null,null,null,null,null,null,null,null,null,null,null,null,null,null,null,null,null,null,null,null,null,null,null,null,null,null,null,null,null,null,null,null,null,null,null,null,null,null,null,null,null,null,null,153,{"$error":"#N/A"},"","","","","",{"$error":"#N/A"}]
[null,null,null,null,null,null,null,null,null,null,null,null,null,null,null,null,null,null,null,null,null,null,null,null,null,null,null,null,null,null,null,null,null,null,null,null,null,null,null,null,154,"","","",null,null,null,null,null,null,null,null,null,{"$f":"IF($N$45=\"\",\"\",$N$45)","v":""},null,null,{"$f":"IF($P$37=\"\",\"\",$P$37)","v":""},null,null,null,null,null,null,null,null,null,null,null,null,null,null,null,null,null,null,null,null,null,null,null,null,null,null,null,null,null,null,null,null,null,null,null,null,null,null,null,null,null,null,null,null,154,{"$error":"#N/A"},"","","","","",{"$error":"#N/A"}]
[null,null,null,null,null,null,null,null,null,null,null,null,null,null,null,null,null,null,null,null,null,null,null,null,null,null,null,null,null,null,null,null,null,null,null,null,null,null,null,null,155,"","","",null,null,null,null,null,null,null,null,null,{"$f":"IF($O$45=\"\",\"\",$O$45)","v":""},null,null,{"$f":"IF($Q$37=\"\",\"\",$Q$37)","v":""},null,null,null,null,null,null,null,null,null,null,null,null,null,null,null,null,null,null,null,null,null,null,null,null,null,null,null,null,null,null,null,null,null,null,null,null,null,null,null,null,null,null,null,null,155,{"$error":"#N/A"},"","","","","",{"$error":"#N/A"}]
[null,null,null,null,null,null,null,null,null,null,null,null,null,null,null,null,null,null,null,null,null,null,null,null,null,null,null,null,null,null,null,null,null,null,null,null,null,null,null,null,156,"","","",null,null,null,null,null,null,null,null,null,{"$f":"IF($P$45=\"\",\"\",$P$45)","v":""},null,"E36",{"$f":"IF($M$38=\"\",\"\",$M$38)","v":73.995000000000005},null,null,null,null,null,null,null,null,null,null,null,null,null,null,null,null,null,null,null,null,null,null,null,null,null,null,null,null,null,null,null,null,null,null,null,null,null,null,null,null,null,null,null,null,156,{"$error":"#N/A"},"","","","","",{"$error":"#N/A"}]
[null,null,null,null,null,null,null,null,null,null,null,null,null,null,null,null,null,null,null,null,null,null,null,null,null,null,null,null,null,null,null,null,null,null,null,null,null,null,null,null,157,"","","",null,null,null,null,null,null,null,null,"E44",{"$f":"IF($M$46=\"\",\"\",$M$46)","v":""},null,null,{"$f":"IF($N$38=\"\",\"\",$N$38)","v":74.006},null,null,null,null,null,null,null,null,null,null,null,null,null,null,null,null,null,null,null,null,null,null,null,null,null,null,null,null,null,null,null,null,null,null,null,null,null,null,null,null,null,null,null,null,157,{"$error":"#N/A"},"","","","","",{"$error":"#N/A"}]
[null,null,null,null,null,null,null,null,null,null,null,null,null,null,null,null,null,null,null,null,null,null,null,null,null,null,null,null,null,null,null,null,null,null,null,null,null,null,null,null,158,"","","",null,null,null,null,null,null,null,null,null,{"$f":"IF($N$46=\"\",\"\",$N$46)","v":""},null,null,{"$f":"IF($O$38=\"\",\"\",$O$38)","v":""},null,null,null,null,null,null,null,null,null,null,null,null,null,null,null,null,null,null,null,null,null,null,null,null,null,null,null,null,null,null,null,null,null,null,null,null,null,null,null,null,null,null,null,null,158,{"$error":"#N/A"},"","","","","",{"$error":"#N/A"}]
[null,null,null,null,null,null,null,null,null,null,null,null,null,null,null,null,null,null,null,null,null,null,null,null,null,null,null,null,null,null,null,null,null,null,null,null,null,null,null,null,159,"","","",null,null,null,null,null,null,null,null,null,{"$f":"IF($O$46=\"\",\"\",$O$46)","v":""},null,null,{"$f":"IF($P$38=\"\",\"\",$P$38)","v":""},null,null,null,null,null,null,null,null,null,null,null,null,null,null,null,null,null,null,null,null,null,null,null,null,null,null,null,null,null,null,null,null,null,null,null,null,null,null,null,null,null,null,null,null,159,{"$error":"#N/A"},"","","","","",{"$error":"#N/A"}]
[null,null,null,null,null,null,null,null,null,null,null,null,null,null,null,null,null,null,null,null,null,null,null,null,null,null,null,null,null,null,null,null,null,null,null,null,null,null,null,null,160,"","","",null,null,null,null,null,null,null,null,null,{"$f":"IF($P$46=\"\",\"\",$P$46)","v":""},null,null,{"$f":"IF($Q$38=\"\",\"\",$Q$38)","v":""},null,null,null,null,null,null,null,null,null,null,null,null,null,null,null,null,null,null,null,null,null,null,null,null,null,null,null,null,null,null,null,null,null,null,null,null,null,null,null,null,null,null,null,null,160,{"$error":"#N/A"},"","","","","",{"$error":"#N/A"}]
[null,null,null,null,null,null,null,null,null,null,null,null,null,null,null,null,null,null,null,null,null,null,null,null,null,null,null,null,null,null,null,null,null,null,null,null,null,null,null,null,161,"","","",null,null,null,null,null,null,null,null,"E45",{"$f":"IF($M$47=\"\",\"\",$M$47)","v":""},null,"E37",{"$f":"IF($M$39=\"\",\"\",$M$39)","v":73.984999999999999},null,null,null,null,null,null,null,null,null,null,null,null,null,null,null,null,null,null,null,null,null,null,null,null,null,null,null,null,null,null,null,null,null,null,null,null,null,null,null,null,null,null,null,null,161,{"$error":"#N/A"},"","",{"$f":"IF(AP167=\"\",\"\",1-DA167)","v":""},"",{"$f":"IF(AP167=\"\",\"\",(2*CZ167-1)*(LN(DC167)+LN(DA167)))","v":""},{"$error":"#N/A"}]
[null,null,null,null,null,null,null,null,null,null,null,null,null,null,null,null,null,null,null,null,null,null,null,null,null,null,null,null,null,null,null,null,null,null,null,null,null,null,null,null,162,"","","",null,null,null,null,null,null,null,null,null,{"$f":"IF($N$47=\"\",\"\",$N$47)","v":""},null,null,{"$f":"IF($N$39=\"\",\"\",$N$39)","v":74.003},null,null,null,null,null,null,null,null,null,null,null,null,null,null,null,null,null,null,null,null,null,null,null,null,null,null,null,null,null,null,null,null,null,null,null,null,null,null,null,null,null,null,null,null,162,{"$error":"#N/A"},{"$f":"IF(AP168=\"\",\"\",1+CZ167)","v":""},"","","","",{"$error":"#N/A"}]
[null,null,null,null,null,null,null,null,null,null,null,null,null,null,null,null,null,null,null,null,null,null,null,null,null,null,null,null,null,null,null,null,null,null,null,null,null,null,null,null,163,"","","",null,null,null,null,null,null,null,null,null,{"$f":"IF($O$47=\"\",\"\",$O$47)","v":""},null,null,{"$f":"IF($O$39=\"\",\"\",$O$39)","v":""},null,null,null,null,null,null,null,null,null,null,null,null,null,null,null,null,null,null,null,null,null,null,null,null,null,null,null,null,null,null,null,null,null,null,null,null,null,null,null,null,null,null,null,null,163,{"$error":"#N/A"},"","","","","",{"$error":"#N/A"}]
[null,null,null,null,null,null,null,null,null,null,null,null,null,null,null,null,null,null,null,null,null,null,null,null,null,null,null,null,null,null,null,null,null,null,null,null,null,null,null,null,164,"","","",null,null,null,null,null,null,null,null,null,{"$f":"IF($P$47=\"\",\"\",$P$47)","v":""},null,null,{"$f":"IF($P$39=\"\",\"\",$P$39)","v":""},null,null,null,null,null,null,null,null,null,null,null,null,null,null,null,null,null,null,null,null,null,null,null,null,null,null,null,null,null,null,null,null,null,null,null,null,null,null,null,null,null,null,null,null,164,{"$error":"#N/A"},"","","","","",{"$error":"#N/A"}]
[null,null,null,null,null,null,null,null,null,null,null,null,null,null,null,null,null,null,null,null,null,null,null,null,null,null,null,null,null,null,null,null,null,null,null,null,null,null,null,null,165,"","","",null,null,null,null,null,null,null,null,"E46",{"$f":"IF($M$48=\"\",\"\",$M$48)","v":""},null,null,{"$f":"IF($Q$39=\"\",\"\",$Q$39)","v":""},null,null,null,null,null,null,null,null,null,null,null,null,null,null,null,null,null,null,null,null,null,null,null,null,null,null,null,null,null,null,null,null,null,null,null,null,null,null,null,null,null,null,null,null,165,{"$error":"#N/A"},"","","","","",{"$error":"#N/A"}]
[null,null,null,null,null,null,null,null,null,null,null,null,null,null,null,null,null,null,null,null,null,null,null,null,null,null,null,null,null,null,null,null,null,null,null,null,null,null,null,null,166,"","","",null,null,null,null,null,null,null,null,null,{"$f":"IF($N$48=\"\",\"\",$N$48)","v":""},null,"E38",{"$f":"IF($M$40=\"\",\"\",$M$40)","v":74.007999999999996},null,null,null,null,null,null,null,null,null,null,null,null,null,null,null,null,null,null,null,null,null,null,null,null,null,null,null,null,null,null,null,null,null,null,null,null,null,null,null,null,null,null,null,null,166,{"$error":"#N/A"},"","","","","",{"$error":"#N/A"}]
[null,null,null,null,null,null,null,null,null,null,null,null,null,null,null,null,null,null,null,null,null,null,null,null,null,null,null,null,null,null,null,null,null,null,null,null,null,null,null,null,167,"","","",null,null,null,null,null,null,null,null,null,{"$f":"IF($O$48=\"\",\"\",$O$48)","v":""},null,null,{"$f":"IF($N$40=\"\",\"\",$N$40)","v":73.995000000000005},null,null,null,null,null,null,null,null,null,null,null,null,null,null,null,null,null,null,null,null,null,null,null,null,null,null,null,null,null,null,null,null,null,null,null,null,null,null,null,null,null,null,null,null,167,{"$error":"#N/A"},"","","","","",{"$error":"#N/A"}]
[null,null,null,null,null,null,null,null,null,null,null,null,null,null,null,null,null,null,null,null,null,null,null,null,null,null,null,null,null,null,null,null,null,null,null,null,null,null,null,null,168,"","","",null,null,null,null,null,null,null,null,null,{"$f":"IF($P$48=\"\",\"\",$P$48)","v":""},null,null,{"$f":"IF($O$40=\"\",\"\",$O$40)","v":""},null,null,null,null,null,null,null,null,null,null,null,null,null,null,null,null,null,null,null,null,null,null,null,null,null,null,null,null,null,null,null,null,null,null,null,null,null,null,null,null,null,null,null,null,168,{"$error":"#N/A"},"","","","","",{"$error":"#N/A"}]
[null,null,null,null,null,null,null,null,null,null,null,null,null,null,null,null,null,null,null,null,null,null,null,null,null,null,null,null,null,null,null,null,null,null,null,null,null,null,null,null,169,"","","",null,null,null,null,null,null,null,null,"E47",{"$f":"IF($M$49=\"\",\"\",$M$49)","v":""},null,null,{"$f":"IF($P$40=\"\",\"\",$P$40)","v":""},null,null,null,null,null,null,null,null,null,null,null,null,null,null,null,null,null,null,null,null,null,null,null,null,null,null,null,null,null,null,null,null,null,null,null,null,null,null,null,null,null,null,null,null,169,{"$error":"#N/A"},"","","","","",{"$error":"#N/A"}]
[null,null,null,null,null,null,null,null,null,null,null,null,null,null,null,null,null,null,null,null,null,null,null,null,null,null,null,null,null,null,null,null,null,null,null,null,null,null,null,null,170,"","","",null,null,null,null,null,null,null,null,null,{"$f":"IF($N$49=\"\",\"\",$N$49)","v":""},null,null,{"$f":"IF($Q$40=\"\",\"\",$Q$40)","v":""},null,null,null,null,null,null,null,null,null,null,null,null,null,null,null,null,null,null,null,null,null,null,null,null,null,null,null,null,null,null,null,null,null,null,null,null,null,null,null,null,null,null,null,null,170,{"$error":"#N/A"},"","","","","",{"$error":"#N/A"}]
[null,null,null,null,null,null,null,null,null,null,null,null,null,null,null,null,null,null,null,null,null,null,null,null,null,null,null,null,null,null,null,null,null,null,null,null,null,null,null,null,171,"","","",null,null,null,null,null,null,null,null,null,{"$f":"IF($O$49=\"\",\"\",$O$49)","v":""},null,"E39",{"$f":"IF($M$41=\"\",\"\",$M$41)","v":73.998000000000005},null,null,null,null,null,null,null,null,null,null,null,null,null,null,null,null,null,null,null,null,null,null,null,null,null,null,null,null,null,null,null,null,null,null,null,null,null,null,null,null,null,null,null,null,171,{"$error":"#N/A"},"","","","","",{"$error":"#N/A"}]
[null,null,null,null,null,null,null,null,null,null,null,null,null,null,null,null,null,null,null,null,null,null,null,null,null,null,null,null,null,null,null,null,null,null,null,null,null,null,null,null,172,"","","",null,null,null,null,null,null,null,null,null,{"$f":"IF($P$49=\"\",\"\",$P$49)","v":""},null,null,{"$f":"IF($N$41=\"\",\"\",$N$41)","v":74},null,null,null,null,null,null,null,null,null,null,null,null,null,null,null,null,null,null,null,null,null,null,null,null,null,null,null,null,null,null,null,null,null,null,null,null,null,null,null,null,null,null,null,null,172,{"$error":"#N/A"},"","","","","",{"$error":"#N/A"}]
[null,null,null,null,null,null,null,null,null,null,null,null,null,null,null,null,null,null,null,null,null,null,null,null,null,null,null,null,null,null,null,null,null,null,null,null,null,null,null,null,173,"","","",null,null,null,null,null,null,null,null,"E48",{"$f":"IF($M$50=\"\",\"\",$M$50)","v":""},null,null,{"$f":"IF($O$41=\"\",\"\",$O$41)","v":""},null,null,null,null,null,null,null,null,null,null,null,null,null,null,null,null,null,null,null,null,null,null,null,null,null,null,null,null,null,null,null,null,null,null,null,null,null,null,null,null,null,null,null,null,173,{"$error":"#N/A"},"","","","","",{"$error":"#N/A"}]
[null,null,null,null,null,null,null,null,null,null,null,null,null,null,null,null,null,null,null,null,null,null,null,null,null,null,null,null,null,null,null,null,null,null,null,null,null,null,null,null,174,"","","",null,null,null,null,null,null,null,null,null,{"$f":"IF($N$50=\"\",\"\",$N$50)","v":""},null,null,{"$f":"IF($P$41=\"\",\"\",$P$41)","v":""},null,null,null,null,null,null,null,null,null,null,null,null,null,null,null,null,null,null,null,null,null,null,null,null,null,null,null,null,null,null,null,null,null,null,null,null,null,null,null,null,null,null,null,null,174,{"$error":"#N/A"},"","","","","",{"$error":"#N/A"}]
[null,null,null,null,null,null,null,null,null,null,null,null,null,null,null,null,null,null,null,null,null,null,null,null,null,null,null,null,null,null,null,null,null,null,null,null,null,null,null,null,175,"","","",null,null,null,null,null,null,null,null,null,{"$f":"IF($O$50=\"\",\"\",$O$50)","v":""},null,null,{"$f":"IF($Q$41=\"\",\"\",$Q$41)","v":""},null,null,null,null,null,null,null,null,null,null,null,null,null,null,null,null,null,null,null,null,null,null,null,null,null,null,null,null,null,null,null,null,null,null,null,null,null,null,null,null,null,null,null,null,175,{"$error":"#N/A"},"","","","","",{"$error":"#N/A"}]
[null,null,null,null,null,null,null,null,null,null,null,null,null,null,null,null,null,null,null,null,null,null,null,null,null,null,null,null,null,null,null,null,null,null,null,null,null,null,null,null,176,"","","",null,null,null,null,null,null,null,null,null,{"$f":"IF($P$50=\"\",\"\",$P$50)","v":""},null,"E40",{"$f":"IF($M$42=\"\",\"\",$M$42)","v":73.994},null,null,null,null,null,null,null,null,null,null,null,null,null,null,null,null,null,null,null,null,null,null,null,null,null,null,null,null,null,null,null,null,null,null,null,null,null,null,null,null,null,null,null,null,176,{"$error":"#N/A"},"","","","","",{"$error":"#N/A"}]
[null,null,null,null,null,null,null,null,null,null,null,null,null,null,null,null,null,null,null,null,null,null,null,null,null,null,null,null,null,null,null,null,null,null,null,null,null,null,null,null,177,"","","",null,null,null,null,null,null,null,null,"E49",{"$f":"IF($M$51=\"\",\"\",$M$51)","v":""},null,null,{"$f":"IF($N$42=\"\",\"\",$N$42)","v":73.998000000000005},null,null,null,null,null,null,null,null,null,null,null,null,null,null,null,null,null,null,null,null,null,null,null,null,null,null,null,null,null,null,null,null,null,null,null,null,null,null,null,null,null,null,null,null,177,{"$error":"#N/A"},"","","","","",{"$error":"#N/A"}]
[null,null,null,null,null,null,null,null,null,null,null,null,null,null,null,null,null,null,null,null,null,null,null,null,null,null,null,null,null,null,null,null,null,null,null,null,null,null,null,null,178,"","","",null,null,null,null,null,null,null,null,null,{"$f":"IF($N$51=\"\",\"\",$N$51)","v":""},null,null,{"$f":"IF($O$42=\"\",\"\",$O$42)","v":""},null,null,null,null,null,null,null,null,null,null,null,null,null,null,null,null,null,null,null,null,null,null,null,null,null,null,null,null,null,null,null,null,null,null,null,null,null,null,null,null,null,null,null,null,178,{"$error":"#N/A"},"","","","","",{"$error":"#N/A"}]
[null,null,null,null,null,null,null,null,null,null,null,null,null,null,null,null,null,null,null,null,null,null,null,null,null,null,null,null,null,null,null,null,null,null,null,null,null,null,null,null,179,"","","",null,null,null,null,null,null,null,null,null,{"$f":"IF($O$51=\"\",\"\",$O$51)","v":""},null,null,{"$f":"IF($P$42=\"\",\"\",$P$42)","v":""},null,null,null,null,null,null,null,null,null,null,null,null,null,null,null,null,null,null,null,null,null,null,null,null,null,null,null,null,null,null,null,null,null,null,null,null,null,null,null,null,null,null,null,null,179,{"$error":"#N/A"},"","","","","",{"$error":"#N/A"}]
[null,null,null,null,null,null,null,null,null,null,null,null,null,null,null,null,null,null,null,null,null,null,null,null,null,null,null,null,null,null,null,null,null,null,null,null,null,null,null,null,180,"","","",null,null,null,null,null,null,null,null,null,{"$f":"IF($P$51=\"\",\"\",$P$51)","v":""},null,null,{"$f":"IF($Q$42=\"\",\"\",$Q$42)","v":""},null,null,null,null,null,null,null,null,null,null,null,null,null,null,null,null,null,null,null,null,null,null,null,null,null,null,null,null,null,null,null,null,null,null,null,null,null,null,null,null,null,null,null,null,180,{"$error":"#N/A"},"","","","","",{"$error":"#N/A"}]
[null,null,null,null,null,null,null,null,null,null,null,null,null,null,null,null,null,null,null,null,null,null,null,null,null,null,null,null,null,null,null,null,null,null,null,null,null,null,null,null,181,"","","",null,null,null,null,null,null,null,null,"E50",{"$f":"IF($M$52=\"\",\"\",$M$52)","v":""},null,"E41",{"$f":"IF($M$43=\"\",\"\",$M$43)","v":""},null,null,null,null,null,null,null,null,null,null,null,null,null,null,null,null,null,null,null,null,null,null,null,null,null,null,null,null,null,null,null,null,null,null,null,null,null,null,null,null,null,null,null,null,181,{"$error":"#N/A"},"","","","","",{"$error":"#N/A"}]
[null,null,null,null,null,null,null,null,null,null,null,null,null,null,null,null,null,null,null,null,null,null,null,null,null,null,null,null,null,null,null,null,null,null,null,null,null,null,null,null,182,"","","",null,null,null,null,null,null,null,null,null,{"$f":"IF($N$52=\"\",\"\",$N$52)","v":""},null,null,{"$f":"IF($N$43=\"\",\"\",$N$43)","v":""},null,null,null,null,null,null,null,null,null,null,null,null,null,null,null,null,null,null,null,null,null,null,null,null,null,null,null,null,null,null,null,null,null,null,null,null,null,null,null,null,null,null,null,null,182,{"$error":"#N/A"},"","","","","",{"$error":"#N/A"}]
[null,null,null,null,null,null,null,null,null,null,null,null,null,null,null,null,null,null,null,null,null,null,null,null,null,null,null,null,null,null,null,null,null,null,null,null,null,null,null,null,183,"","","",null,null,null,null,null,null,null,null,null,{"$f":"IF($O$52=\"\",\"\",$O$52)","v":""},null,null,{"$f":"IF($O$43=\"\",\"\",$O$43)","v":""},null,null,null,null,null,null,null,null,null,null,null,null,null,null,null,null,null,null,null,null,null,null,null,null,null,null,null,null,null,null,null,null,null,null,null,null,null,null,null,null,null,null,null,null,183,{"$error":"#N/A"},"","","","","",{"$error":"#N/A"}]
[null,null,null,null,null,null,null,null,null,null,null,null,null,null,null,null,null,null,null,null,null,null,null,null,null,null,null,null,null,null,null,null,null,null,null,null,null,null,null,null,184,"","","",null,null,null,null,null,null,null,null,null,{"$f":"IF($P$52=\"\",\"\",$P$52)","v":""},null,null,{"$f":"IF($P$43=\"\",\"\",$P$43)","v":""},null,null,null,null,null,null,null,null,null,null,null,null,null,null,null,null,null,null,null,null,null,null,null,null,null,null,null,null,null,null,null,null,null,null,null,null,null,null,null,null,null,null,null,null,184,{"$error":"#N/A"},"","","","","",{"$error":"#N/A"}]
[null,null,null,null,null,null,null,null,null,null,null,null,null,null,null,null,null,null,null,null,null,null,null,null,null,null,null,null,null,null,null,null,null,null,null,null,null,null,null,null,185,"","","",null,null,null,null,null,null,null,null,"E51",{"$f":"IF($M$53=\"\",\"\",$M$53)","v":""},null,null,{"$f":"IF($Q$43=\"\",\"\",$Q$43)","v":""},null,null,null,null,null,null,null,null,null,null,null,null,null,null,null,null,null,null,null,null,null,null,null,null,null,null,null,null,null,null,null,null,null,null,null,null,null,null,null,null,null,null,null,null,185,{"$error":"#N/A"},"","","","","",{"$error":"#N/A"}]
[null,null,null,null,null,null,null,null,null,null,null,null,null,null,null,null,null,null,null,null,null,null,null,null,null,null,null,null,null,null,null,null,null,null,null,null,null,null,null,null,186,"","","",null,null,null,null,null,null,null,null,null,{"$f":"IF($N$53=\"\",\"\",$N$53)","v":""},null,"E42",{"$f":"IF($M$44=\"\",\"\",$M$44)","v":""},null,null,null,null,null,null,null,null,null,null,null,null,null,null,null,null,null,null,null,null,null,null,null,null,null,null,null,null,null,null,null,null,null,null,null,null,null,null,null,null,null,null,null,null,186,{"$error":"#N/A"},"","","","","",{"$error":"#N/A"}]
[null,null,null,null,null,null,null,null,null,null,null,null,null,null,null,null,null,null,null,null,null,null,null,null,null,null,null,null,null,null,null,null,null,null,null,null,null,null,null,null,187,"","","",null,null,null,null,null,null,null,null,null,{"$f":"IF($O$53=\"\",\"\",$O$53)","v":""},null,null,{"$f":"IF($N$44=\"\",\"\",$N$44)","v":""},null,null,null,null,null,null,null,null,null,null,null,null,null,null,null,null,null,null,null,null,null,null,null,null,null,null,null,null,null,null,null,null,null,null,null,null,null,null,null,null,null,null,null,null,187,{"$error":"#N/A"},"","","","","",{"$error":"#N/A"}]
[null,null,null,null,null,null,null,null,null,null,null,null,null,null,null,null,null,null,null,null,null,null,null,null,null,null,null,null,null,null,null,null,null,null,null,null,null,null,null,null,188,"","","",null,null,null,null,null,null,null,null,null,{"$f":"IF($P$53=\"\",\"\",$P$53)","v":""},null,null,{"$f":"IF($O$44=\"\",\"\",$O$44)","v":""},null,null,null,null,null,null,null,null,null,null,null,null,null,null,null,null,null,null,null,null,null,null,null,null,null,null,null,null,null,null,null,null,null,null,null,null,null,null,null,null,null,null,null,null,188,{"$error":"#N/A"},"","","","","",{"$error":"#N/A"}]
[null,null,null,null,null,null,null,null,null,null,null,null,null,null,null,null,null,null,null,null,null,null,null,null,null,null,null,null,null,null,null,null,null,null,null,null,null,null,null,null,189,"","","",null,null,null,null,null,null,null,null,"E52",{"$f":"IF($M$54=\"\",\"\",$M$54)","v":""},null,null,{"$f":"IF($P$44=\"\",\"\",$P$44)","v":""},null,null,null,null,null,null,null,null,null,null,null,null,null,null,null,null,null,null,null,null,null,null,null,null,null,null,null,null,null,null,null,null,null,null,null,null,null,null,null,null,null,null,null,null,189,{"$error":"#N/A"},"","","","","",{"$error":"#N/A"}]
[null,null,null,null,null,null,null,null,null,null,null,null,null,null,null,null,null,null,null,null,null,null,null,null,null,null,null,null,null,null,null,null,null,null,null,null,null,null,null,null,190,"","","",null,null,null,null,null,null,null,null,null,{"$f":"IF($N$54=\"\",\"\",$N$54)","v":""},null,null,{"$f":"IF($Q$44=\"\",\"\",$Q$44)","v":""},null,null,null,null,null,null,null,null,null,null,null,null,null,null,null,null,null,null,null,null,null,null,null,null,null,null,null,null,null,null,null,null,null,null,null,null,null,null,null,null,null,null,null,null,190,{"$error":"#N/A"},"","","","","",{"$error":"#N/A"}]
[null,null,null,null,null,null,null,null,null,null,null,null,null,null,null,null,null,null,null,null,null,null,null,null,null,null,null,null,null,null,null,null,null,null,null,null,null,null,null,null,191,"","","",null,null,null,null,null,null,null,null,null,{"$f":"IF($O$54=\"\",\"\",$O$54)","v":""},null,"E43",{"$f":"IF($M$45=\"\",\"\",$M$45)","v":""},null,null,null,null,null,null,null,null,null,null,null,null,null,null,null,null,null,null,null,null,null,null,null,null,null,null,null,null,null,null,null,null,null,null,null,null,null,null,null,null,null,null,null,null,191,{"$error":"#N/A"},"","","","","",{"$error":"#N/A"}]
[null,null,null,null,null,null,null,null,null,null,null,null,null,null,null,null,null,null,null,null,null,null,null,null,null,null,null,null,null,null,null,null,null,null,null,null,null,null,null,null,192,"","","",null,null,null,null,null,null,null,null,null,{"$f":"IF($P$54=\"\",\"\",$P$54)","v":""},null,null,{"$f":"IF($N$45=\"\",\"\",$N$45)","v":""},null,null,null,null,null,null,null,null,null,null,null,null,null,null,null,null,null,null,null,null,null,null,null,null,null,null,null,null,null,null,null,null,null,null,null,null,null,null,null,null,null,null,null,null,192,{"$error":"#N/A"},"","","","","",{"$error":"#N/A"}]
[null,null,null,null,null,null,null,null,null,null,null,null,null,null,null,null,null,null,null,null,null,null,null,null,null,null,null,null,null,null,null,null,null,null,null,null,null,null,null,null,193,"",{"$f":"IF(AP199<>\"\",IF(AP199<UGW,1,0),\"\")","v":""},{"$f":"IF(AP199<>\"\",IF(AP199>OGW,1,0),\"\")","v":""},null,null,null,null,null,null,null,null,"E53",{"$f":"IF($M$55=\"\",\"\",$M$55)","v":""},null,null,{"$f":"IF($O$45=\"\",\"\",$O$45)","v":""},null,null,null,null,null,null,null,null,null,null,null,null,null,null,null,null,null,null,null,null,null,null,null,null,null,null,null,null,null,null,null,null,null,null,null,null,null,null,null,null,null,null,null,null,193,{"$f":"IF(AP199=\"\",NA(),SMALL(xi,CZ199))","v":{"$error":"#N/A"}},"",{"$f":"IF(AP199=\"\",\"\",NORMSDIST((CY199-Mittelwert)/Standardabweichung)-0.00000001)","v":""},{"$f":"IF(AP199=\"\",\"\",1-DA199)","v":""},{"$f":"IF(AP199=\"\",\"\",SMALL(BG,CZ199))","v":""},{"$f":"IF(AP199=\"\",\"\",(2*CZ199-1)*(LN(DC199)+LN(DA199)))","v":""},{"$f":"IF(AP199=\"\",NA(),NORMSINV((CZ199-0.3)/(Anzahl+0.4)))","v":{"$error":"#N/A"}}]
[null,null,null,null,null,null,null,null,null,null,null,null,null,null,null,null,null,null,null,null,null,null,null,null,null,null,null,null,null,null,null,null,null,null,null,null,null,null,null,null,194,{"$f":"IF($BI$41=2,IF(AV200<>\"\",AV200,\"\"),(IF($BI$41=3,IF(AY200<>\"\",AY200,\"\"),(IF($BI$41=4,IF(BB200<>\"\",BB200,\"\"),IF(BE200<>\"\",BE200,\"\"))))))","v":""},"","",null,null,null,null,null,null,null,null,null,{"$f":"IF($N$55=\"\",\"\",$N$55)","v":""},null,null,{"$f":"IF($P$45=\"\",\"\",$P$45)","v":""},null,null,null,null,null,null,null,null,null,null,null,null,null,null,null,null,null,null,null,null,null,null,null,null,null,null,null,null,null,null,null,null,null,null,null,null,null,null,null,null,null,null,null,null,194,{"$error":"#N/A"},{"$f":"IF(AP200=\"\",\"\",1+CZ199)","v":""},"","","","",{"$error":"#N/A"}]
[null,null,null,null,null,null,null,null,null,null,null,null,null,null,null,null,null,null,null,null,null,null,null,null,null,null,null,null,null,null,null,null,null,null,null,null,null,null,null,null,195,"","","",null,null,null,null,null,null,null,null,null,{"$f":"IF($O$55=\"\",\"\",$O$55)","v":""},null,null,{"$f":"IF($Q$45=\"\",\"\",$Q$45)","v":""},null,null,null,null,null,null,null,null,null,null,null,null,null,null,null,null,null,null,null,null,null,null,null,null,null,null,null,null,null,null,null,null,null,null,null,null,null,null,null,null,null,null,null,null,195,{"$error":"#N/A"},"","","","","",{"$error":"#N/A"}]
[null,null,null,null,null,null,null,null,null,null,null,null,null,null,null,null,null,null,null,null,null,null,null,null,null,null,null,null,null,null,null,null,null,null,null,null,null,null,null,null,196,"","","",null,null,null,null,null,null,null,null,null,{"$f":"IF($P$55=\"\",\"\",$P$55)","v":""},null,"E44",{"$f":"IF($M$46=\"\",\"\",$M$46)","v":""},null,null,null,null,null,null,null,null,null,null,null,null,null,null,null,null,null,null,null,null,null,null,null,null,null,null,null,null,null,null,null,null,null,null,null,null,null,null,null,null,null,null,null,null,196,{"$error":"#N/A"},"","","","","",{"$error":"#N/A"}]
[null,null,null,null,null,null,null,null,null,null,null,null,null,null,null,null,null,null,null,null,null,null,null,null,null,null,null,null,null,null,null,null,null,null,null,null,null,null,null,null,197,"","","",null,null,null,null,null,null,null,null,"E54",{"$f":"IF($M$56=\"\",\"\",$M$56)","v":""},null,null,{"$f":"IF($N$46=\"\",\"\",$N$46)","v":""},null,null,null,null,null,null,null,null,null,null,null,null,null,null,null,null,null,null,null,null,null,null,null,null,null,null,null,null,null,null,null,null,null,null,null,null,null,null,null,null,null,null,null,null,197,{"$error":"#N/A"},"","","","","",{"$error":"#N/A"}]
[null,null,null,null,null,null,null,null,null,null,null,null,null,null,null,null,null,null,null,null,null,null,null,null,null,null,null,null,null,null,null,null,null,null,null,null,null,null,null,null,198,"","","",null,null,null,null,null,null,null,null,null,{"$f":"IF($N$56=\"\",\"\",$N$56)","v":""},null,null,{"$f":"IF($O$46=\"\",\"\",$O$46)","v":""},null,null,null,null,null,null,null,null,null,null,null,null,null,null,null,null,null,null,null,null,null,null,null,null,null,null,null,null,null,null,null,null,null,null,null,null,null,null,null,null,null,null,null,null,198,{"$error":"#N/A"},"","","","","",{"$error":"#N/A"}]
[null,null,null,null,null,null,null,null,null,null,null,null,null,null,null,null,null,null,null,null,null,null,null,null,null,null,null,null,null,null,null,null,null,null,null,null,null,null,null,null,199,"","","",null,null,null,null,null,null,null,null,null,{"$f":"IF($O$56=\"\",\"\",$O$56)","v":""},null,null,{"$f":"IF($P$46=\"\",\"\",$P$46)","v":""},null,null,null,null,null,null,null,null,null,null,null,null,null,null,null,null,null,null,null,null,null,null,null,null,null,null,null,null,null,null,null,null,null,null,null,null,null,null,null,null,null,null,null,null,199,{"$error":"#N/A"},"","","","","",{"$error":"#N/A"}]
[null,null,null,null,null,null,null,null,null,null,null,null,null,null,null,null,null,null,null,null,null,null,null,null,null,null,null,null,null,null,null,null,null,null,null,null,null,null,null,null,200,"","","",null,null,null,null,null,null,null,null,null,{"$f":"IF($P$56=\"\",\"\",$P$56)","v":""},null,null,{"$f":"IF($Q$46=\"\",\"\",$Q$46)","v":""},null,null,null,null,null,null,null,null,null,null,null,null,null,null,null,null,null,null,null,null,null,null,null,null,null,null,null,null,null,null,null,null,null,null,null,null,null,null,null,null,null,null,null,null,200,{"$error":"#N/A"},"","","","","",{"$error":"#N/A"}]
[null,null,null,null,null,null,null,null,null,null,null,null,null,null,null,null,null,null,null,null,null,null,null,null,null,null,null,null,null,null,null,null,null,null,null,null,null,null,null,null,201,"","","",null,null,null,null,null,null,null,null,null,null,null,"E45",{"$f":"IF($M$47=\"\",\"\",$M$47)","v":""},null,null,null,null,null,null,null,null,null,null,null,null,null,null,null,null,null,null,null,null,null,null,null,null,null,null,null,null,null,null,null,null,null,null,null,null,null,null,null,null,null,null,null,null,201,{"$error":"#N/A"},{"$f":"IF(AP207=\"\",\"\",1+CZ206)","v":""},"",{"$f":"IF(AP207=\"\",\"\",1-DA207)","v":""},"",{"$f":"IF(AP207=\"\",\"\",(2*CZ207-1)*(LN(DC207)+LN(DA207)))","v":""},{"$error":"#N/A"}]
[null,null,null,null,null,null,null,null,null,null,null,null,null,null,null,null,null,null,null,null,null,null,null,null,null,null,null,null,null,null,null,null,null,null,null,null,null,null,null,null,202,"","","",null,null,null,null,null,null,null,null,null,null,null,null,{"$f":"IF($N$47=\"\",\"\",$N$47)","v":""},null,null,null,null,null,null,null,null,null,null,null,null,null,null,null,null,null,null,null,null,null,null,null,null,null,null,null,null,null,null,null,null,null,null,null,null,null,null,null,null,null,null,null,null,202,{"$error":"#N/A"},"","","","","",{"$error":"#N/A"}]
[null,null,null,null,null,null,null,null,null,null,null,null,null,null,null,null,null,null,null,null,null,null,null,null,null,null,null,null,null,null,null,null,null,null,null,null,null,null,null,null,203,"","","",null,null,null,null,null,null,null,null,null,null,null,null,{"$f":"IF($O$47=\"\",\"\",$O$47)","v":""},null,null,null,null,null,null,null,null,null,null,null,null,null,null,null,null,null,null,null,null,null,null,null,null,null,null,null,null,null,null,null,null,null,null,null,null,null,null,null,null,null,null,null,null,203,{"$error":"#N/A"},"","","","","",{"$error":"#N/A"}]
[null,null,null,null,null,null,null,null,null,null,null,null,null,null,null,null,null,null,null,null,null,null,null,null,null,null,null,null,null,null,null,null,null,null,null,null,null,null,null,null,204,"","","",null,null,null,null,null,null,null,null,null,null,null,null,{"$f":"IF($P$47=\"\",\"\",$P$47)","v":""},null,null,null,null,null,null,null,null,null,null,null,null,null,null,null,null,null,null,null,null,null,null,null,null,null,null,null,null,null,null,null,null,null,null,null,null,null,null,null,null,null,null,null,null,204,{"$error":"#N/A"},"","","","","",{"$error":"#N/A"}]
[null,null,null,null,null,null,null,null,null,null,null,null,null,null,null,null,null,null,null,null,null,null,null,null,null,null,null,null,null,null,null,null,null,null,null,null,null,null,null,null,205,"","","",null,null,null,null,null,null,null,null,null,null,null,null,{"$f":"IF($Q$47=\"\",\"\",$Q$47)","v":""},null,null,null,null,null,null,null,null,null,null,null,null,null,null,null,null,null,null,null,null,null,null,null,null,null,null,null,null,null,null,null,null,null,null,null,null,null,null,null,null,null,null,null,null,205,{"$error":"#N/A"},"","","","","",{"$error":"#N/A"}]
[null,null,null,null,null,null,null,null,null,null,null,null,null,null,null,null,null,null,null,null,null,null,null,null,null,null,null,null,null,null,null,null,null,null,null,null,null,null,null,null,206,"","","",null,null,null,null,null,null,null,null,null,null,null,"E46",{"$f":"IF($M$48=\"\",\"\",$M$48)","v":""},null,null,null,null,null,null,null,null,null,null,null,null,null,null,null,null,null,null,null,null,null,null,null,null,null,null,null,null,null,null,null,null,null,null,null,null,null,null,null,null,null,null,null,null,206,{"$error":"#N/A"},"","","","","",{"$error":"#N/A"}]
[null,null,null,null,null,null,null,null,null,null,null,null,null,null,null,null,null,null,null,null,null,null,null,null,null,null,null,null,null,null,null,null,null,null,null,null,null,null,null,null,207,"","","",null,null,null,null,null,null,null,null,null,null,null,null,{"$f":"IF($N$48=\"\",\"\",$N$48)","v":""},null,null,null,null,null,null,null,null,null,null,null,null,null,null,null,null,null,null,null,null,null,null,null,null,null,null,null,null,null,null,null,null,null,null,null,null,null,null,null,null,null,null,null,null,207,{"$error":"#N/A"},"","","","","",{"$error":"#N/A"}]
[null,null,null,null,null,null,null,null,null,null,null,null,null,null,null,null,null,null,null,null,null,null,null,null,null,null,null,null,null,null,null,null,null,null,null,null,null,null,null,null,208,"","","",null,null,null,null,null,null,null,null,null,null,null,null,{"$f":"IF($O$48=\"\",\"\",$O$48)","v":""},null,null,null,null,null,null,null,null,null,null,null,null,null,null,null,null,null,null,null,null,null,null,null,null,null,null,null,null,null,null,null,null,null,null,null,null,null,null,null,null,null,null,null,null,208,{"$error":"#N/A"},"","","","","",{"$error":"#N/A"}]
[null,null,null,null,null,null,null,null,null,null,null,null,null,null,null,null,null,null,null,null,null,null,null,null,null,null,null,null,null,null,null,null,null,null,null,null,null,null,null,null,209,"","","",null,null,null,null,null,null,null,null,null,null,null,null,{"$f":"IF($P$48=\"\",\"\",$P$48)","v":""},null,null,null,null,null,null,null,null,null,null,null,null,null,null,null,null,null,null,null,null,null,null,null,null,null,null,null,null,null,null,null,null,null,null,null,null,null,null,null,null,null,null,null,null,209,{"$error":"#N/A"},"","","","","",{"$error":"#N/A"}]
[null,null,null,null,null,null,null,null,null,null,null,null,null,null,null,null,null,null,null,null,null,null,null,null,null,null,null,null,null,null,null,null,null,null,null,null,null,null,null,null,210,"","","",null,null,null,null,null,null,null,null,null,null,null,null,{"$f":"IF($Q$48=\"\",\"\",$Q$48)","v":""},null,null,null,null,null,null,null,null,null,null,null,null,null,null,null,null,null,null,null,null,null,null,null,null,null,null,null,null,null,null,null,null,null,null,null,null,null,null,null,null,null,null,null,null,210,{"$error":"#N/A"},"","","","","",{"$error":"#N/A"}]
[null,null,null,null,null,null,null,null,null,null,null,null,null,null,null,null,null,null,null,null,null,null,null,null,null,null,null,null,null,null,null,null,null,null,null,null,null,null,null,null,211,"","","",null,null,null,null,null,null,null,null,null,null,null,"E47",{"$f":"IF($M$49=\"\",\"\",$M$49)","v":""},null,null,null,null,null,null,null,null,null,null,null,null,null,null,null,null,null,null,null,null,null,null,null,null,null,null,null,null,null,null,null,null,null,null,null,null,null,null,null,null,null,null,null,null,211,{"$error":"#N/A"},"","","","","",{"$error":"#N/A"}]
[null,null,null,null,null,null,null,null,null,null,null,null,null,null,null,null,null,null,null,null,null,null,null,null,null,null,null,null,null,null,null,null,null,null,null,null,null,null,null,null,212,"","","",null,null,null,null,null,null,null,null,null,null,null,null,{"$f":"IF($N$49=\"\",\"\",$N$49)","v":""},null,null,null,null,null,null,null,null,null,null,null,null,null,null,null,null,null,null,null,null,null,null,null,null,null,null,null,null,null,null,null,null,null,null,null,null,null,null,null,null,null,null,null,null,212,{"$error":"#N/A"},"","","","","",{"$error":"#N/A"}]
[null,null,null,null,null,null,null,null,null,null,null,null,null,null,null,null,null,null,null,null,null,null,null,null,null,null,null,null,null,null,null,null,null,null,null,null,null,null,null,null,213,"","","",null,null,null,null,null,null,null,null,null,null,null,null,{"$f":"IF($O$49=\"\",\"\",$O$49)","v":""},null,null,null,null,null,null,null,null,null,null,null,null,null,null,null,null,null,null,null,null,null,null,null,null,null,null,null,null,null,null,null,null,null,null,null,null,null,null,null,null,null,null,null,null,213,{"$error":"#N/A"},"","","","","",{"$error":"#N/A"}]
[null,null,null,null,null,null,null,null,null,null,null,null,null,null,null,null,null,null,null,null,null,null,null,null,null,null,null,null,null,null,null,null,null,null,null,null,null,null,null,null,214,"","","",null,null,null,null,null,null,null,null,null,null,null,null,{"$f":"IF($P$49=\"\",\"\",$P$49)","v":""},null,null,null,null,null,null,null,null,null,null,null,null,null,null,null,null,null,null,null,null,null,null,null,null,null,null,null,null,null,null,null,null,null,null,null,null,null,null,null,null,null,null,null,null,214,{"$error":"#N/A"},"","","","","",{"$error":"#N/A"}]
[null,null,null,null,null,null,null,null,null,null,null,null,null,null,null,null,null,null,null,null,null,null,null,null,null,null,null,null,null,null,null,null,null,null,null,null,null,null,null,null,215,"","","",null,null,null,null,null,null,null,null,null,null,null,null,{"$f":"IF($Q$49=\"\",\"\",$Q$49)","v":""},null,null,null,null,null,null,null,null,null,null,null,null,null,null,null,null,null,null,null,null,null,null,null,null,null,null,null,null,null,null,null,null,null,null,null,null,null,null,null,null,null,null,null,null,215,{"$error":"#N/A"},"","","","","",{"$error":"#N/A"}]
[null,null,null,null,null,null,null,null,null,null,null,null,null,null,null,null,null,null,null,null,null,null,null,null,null,null,null,null,null,null,null,null,null,null,null,null,null,null,null,null,216,"","","",null,null,null,null,null,null,null,null,null,null,null,"E48",{"$f":"IF($M$50=\"\",\"\",$M$50)","v":""},null,null,null,null,null,null,null,null,null,null,null,null,null,null,null,null,null,null,null,null,null,null,null,null,null,null,null,null,null,null,null,null,null,null,null,null,null,null,null,null,null,null,null,null,216,{"$error":"#N/A"},"","","","","",{"$error":"#N/A"}]
[null,null,null,null,null,null,null,null,null,null,null,null,null,null,null,null,null,null,null,null,null,null,null,null,null,null,null,null,null,null,null,null,null,null,null,null,null,null,null,null,217,"","","",null,null,null,null,null,null,null,null,null,null,null,null,{"$f":"IF($N$50=\"\",\"\",$N$50)","v":""},null,null,null,null,null,null,null,null,null,null,null,null,null,null,null,null,null,null,null,null,null,null,null,null,null,null,null,null,null,null,null,null,null,null,null,null,null,null,null,null,null,null,null,null,217,{"$error":"#N/A"},"","","","","",{"$error":"#N/A"}]
[null,null,null,null,null,null,null,null,null,null,null,null,null,null,null,null,null,null,null,null,null,null,null,null,null,null,null,null,null,null,null,null,null,null,null,null,null,null,null,null,218,"","","",null,null,null,null,null,null,null,null,null,null,null,null,{"$f":"IF($O$50=\"\",\"\",$O$50)","v":""},null,null,null,null,null,null,null,null,null,null,null,null,null,null,null,null,null,null,null,null,null,null,null,null,null,null,null,null,null,null,null,null,null,null,null,null,null,null,null,null,null,null,null,null,218,{"$error":"#N/A"},"","","","","",{"$error":"#N/A"}]
[null,null,null,null,null,null,null,null,null,null,null,null,null,null,null,null,null,null,null,null,null,null,null,null,null,null,null,null,null,null,null,null,null,null,null,null,null,null,null,null,219,"","","",null,null,null,null,null,null,null,null,null,null,null,null,{"$f":"IF($P$50=\"\",\"\",$P$50)","v":""},null,null,null,null,null,null,null,null,null,null,null,null,null,null,null,null,null,null,null,null,null,null,null,null,null,null,null,null,null,null,null,null,null,null,null,null,null,null,null,null,null,null,null,null,219,{"$error":"#N/A"},"","","","","",{"$error":"#N/A"}]
[null,null,null,null,null,null,null,null,null,null,null,null,null,null,null,null,null,null,null,null,null,null,null,null,null,null,null,null,null,null,null,null,null,null,null,null,null,null,null,null,220,"","","",null,null,null,null,null,null,null,null,null,null,null,null,{"$f":"IF($Q$50=\"\",\"\",$Q$50)","v":""},null,null,null,null,null,null,null,null,null,null,null,null,null,null,null,null,null,null,null,null,null,null,null,null,null,null,null,null,null,null,null,null,null,null,null,null,null,null,null,null,null,null,null,null,220,{"$error":"#N/A"},"","","","","",{"$error":"#N/A"}]
[null,null,null,null,null,null,null,null,null,null,null,null,null,null,null,null,null,null,null,null,null,null,null,null,null,null,null,null,null,null,null,null,null,null,null,null,null,null,null,null,221,"","","",null,null,null,null,null,null,null,null,null,null,null,"E49",{"$f":"IF($M$51=\"\",\"\",$M$51)","v":""},null,null,null,null,null,null,null,null,null,null,null,null,null,null,null,null,null,null,null,null,null,null,null,null,null,null,null,null,null,null,null,null,null,null,null,null,null,null,null,null,null,null,null,null,221,{"$error":"#N/A"},"","","","","",{"$error":"#N/A"}]
[null,null,null,null,null,null,null,null,null,null,null,null,null,null,null,null,null,null,null,null,null,null,null,null,null,null,null,null,null,null,null,null,null,null,null,null,null,null,null,null,222,"","","",null,null,null,null,null,null,null,null,null,null,null,null,{"$f":"IF($N$51=\"\",\"\",$N$51)","v":""},null,null,null,null,null,null,null,null,null,null,null,null,null,null,null,null,null,null,null,null,null,null,null,null,null,null,null,null,null,null,null,null,null,null,null,null,null,null,null,null,null,null,null,null,222,{"$error":"#N/A"},"","","","","",{"$error":"#N/A"}]
[null,null,null,null,null,null,null,null,null,null,null,null,null,null,null,null,null,null,null,null,null,null,null,null,null,null,null,null,null,null,null,null,null,null,null,null,null,null,null,null,223,"","","",null,null,null,null,null,null,null,null,null,null,null,null,{"$f":"IF($O$51=\"\",\"\",$O$51)","v":""},null,null,null,null,null,null,null,null,null,null,null,null,null,null,null,null,null,null,null,null,null,null,null,null,null,null,null,null,null,null,null,null,null,null,null,null,null,null,null,null,null,null,null,null,223,{"$error":"#N/A"},"","","","","",{"$error":"#N/A"}]
[null,null,null,null,null,null,null,null,null,null,null,null,null,null,null,null,null,null,null,null,null,null,null,null,null,null,null,null,null,null,null,null,null,null,null,null,null,null,null,null,224,"","","",null,null,null,null,null,null,null,null,null,null,null,null,{"$f":"IF($P$51=\"\",\"\",$P$51)","v":""},null,null,null,null,null,null,null,null,null,null,null,null,null,null,null,null,null,null,null,null,null,null,null,null,null,null,null,null,null,null,null,null,null,null,null,null,null,null,null,null,null,null,null,null,224,{"$error":"#N/A"},"","","","","",{"$error":"#N/A"}]
[null,null,null,null,null,null,null,null,null,null,null,null,null,null,null,null,null,null,null,null,null,null,null,null,null,null,null,null,null,null,null,null,null,null,null,null,null,null,null,null,225,"","","",null,null,null,null,null,null,null,null,null,null,null,null,{"$f":"IF($Q$51=\"\",\"\",$Q$51)","v":""},null,null,null,null,null,null,null,null,null,null,null,null,null,null,null,null,null,null,null,null,null,null,null,null,null,null,null,null,null,null,null,null,null,null,null,null,null,null,null,null,null,null,null,null,225,{"$error":"#N/A"},"","","","","",{"$error":"#N/A"}]
[null,null,null,null,null,null,null,null,null,null,null,null,null,null,null,null,null,null,null,null,null,null,null,null,null,null,null,null,null,null,null,null,null,null,null,null,null,null,null,null,226,"","","",null,null,null,null,null,null,null,null,null,null,null,"E50",{"$f":"IF($M$52=\"\",\"\",$M$52)","v":""},null,null,null,null,null,null,null,null,null,null,null,null,null,null,null,null,null,null,null,null,null,null,null,null,null,null,null,null,null,null,null,null,null,null,null,null,null,null,null,null,null,null,null,null,226,{"$error":"#N/A"},"","","","","",{"$error":"#N/A"}]
[null,null,null,null,null,null,null,null,null,null,null,null,null,null,null,null,null,null,null,null,null,null,null,null,null,null,null,null,null,null,null,null,null,null,null,null,null,null,null,null,227,"","","",null,null,null,null,null,null,null,null,null,null,null,null,{"$f":"IF($N$52=\"\",\"\",$N$52)","v":""},null,null,null,null,null,null,null,null,null,null,null,null,null,null,null,null,null,null,null,null,null,null,null,null,null,null,null,null,null,null,null,null,null,null,null,null,null,null,null,null,null,null,null,null,227,{"$error":"#N/A"},"","","","","",{"$error":"#N/A"}]
[null,null,null,null,null,null,null,null,null,null,null,null,null,null,null,null,null,null,null,null,null,null,null,null,null,null,null,null,null,null,null,null,null,null,null,null,null,null,null,null,228,"","","",null,null,null,null,null,null,null,null,null,null,null,null,{"$f":"IF($O$52=\"\",\"\",$O$52)","v":""},null,null,null,null,null,null,null,null,null,null,null,null,null,null,null,null,null,null,null,null,null,null,null,null,null,null,null,null,null,null,null,null,null,null,null,null,null,null,null,null,null,null,null,null,228,{"$error":"#N/A"},"","","","","",{"$error":"#N/A"}]
[null,null,null,null,null,null,null,null,null,null,null,null,null,null,null,null,null,null,null,null,null,null,null,null,null,null,null,null,null,null,null,null,null,null,null,null,null,null,null,null,229,"","","",null,null,null,null,null,null,null,null,null,null,null,null,{"$f":"IF($P$52=\"\",\"\",$P$52)","v":""},null,null,null,null,null,null,null,null,null,null,null,null,null,null,null,null,null,null,null,null,null,null,null,null,null,null,null,null,null,null,null,null,null,null,null,null,null,null,null,null,null,null,null,null,229,{"$error":"#N/A"},"","","","","",{"$error":"#N/A"}]
[null,null,null,null,null,null,null,null,null,null,null,null,null,null,null,null,null,null,null,null,null,null,null,null,null,null,null,null,null,null,null,null,null,null,null,null,null,null,null,null,230,"","","",null,null,null,null,null,null,null,null,null,null,null,null,{"$f":"IF($Q$52=\"\",\"\",$Q$52)","v":""},null,null,null,null,null,null,null,null,null,null,null,null,null,null,null,null,null,null,null,null,null,null,null,null,null,null,null,null,null,null,null,null,null,null,null,null,null,null,null,null,null,null,null,null,230,{"$error":"#N/A"},"","","","","",{"$error":"#N/A"}]
[null,null,null,null,null,null,null,null,null,null,null,null,null,null,null,null,null,null,null,null,null,null,null,null,null,null,null,null,null,null,null,null,null,null,null,null,null,null,null,null,231,"","","",null,null,null,null,null,null,null,null,null,null,null,"E51",{"$f":"IF($M$53=\"\",\"\",$M$53)","v":""},null,null,null,null,null,null,null,null,null,null,null,null,null,null,null,null,null,null,null,null,null,null,null,null,null,null,null,null,null,null,null,null,null,null,null,null,null,null,null,null,null,null,null,null,231,{"$error":"#N/A"},"","","","","",{"$error":"#N/A"}]
[null,null,null,null,null,null,null,null,null,null,null,null,null,null,null,null,null,null,null,null,null,null,null,null,null,null,null,null,null,null,null,null,null,null,null,null,null,null,null,null,232,"","","",null,null,null,null,null,null,null,null,null,null,null,null,{"$f":"IF($N$53=\"\",\"\",$N$53)","v":""},null,null,null,null,null,null,null,null,null,null,null,null,null,null,null,null,null,null,null,null,null,null,null,null,null,null,null,null,null,null,null,null,null,null,null,null,null,null,null,null,null,null,null,null,232,{"$error":"#N/A"},{"$f":"IF(AP238=\"\",\"\",1+CZ237)","v":""},"",{"$f":"IF(AP238=\"\",\"\",1-DA238)","v":""},"",{"$f":"IF(AP238=\"\",\"\",(2*CZ238-1)*(LN(DC238)+LN(DA238)))","v":""},{"$error":"#N/A"}]
[null,null,null,null,null,null,null,null,null,null,null,null,null,null,null,null,null,null,null,null,null,null,null,null,null,null,null,null,null,null,null,null,null,null,null,null,null,null,null,null,233,"","","",null,null,null,null,null,null,null,null,null,null,null,null,{"$f":"IF($O$53=\"\",\"\",$O$53)","v":""},null,null,null,null,null,null,null,null,null,null,null,null,null,null,null,null,null,null,null,null,null,null,null,null,null,null,null,null,null,null,null,null,null,null,null,null,null,null,null,null,null,null,null,null,233,{"$error":"#N/A"},{"$f":"IF(AP239=\"\",\"\",1+CZ238)","v":""},"",{"$f":"IF(AP239=\"\",\"\",1-DA239)","v":""},"",{"$f":"IF(AP239=\"\",\"\",(2*CZ239-1)*(LN(DC239)+LN(DA239)))","v":""},{"$error":"#N/A"}]
[null,null,null,null,null,null,null,null,null,null,null,null,null,null,null,null,null,null,null,null,null,null,null,null,null,null,null,null,null,null,null,null,null,null,null,null,null,null,null,null,234,"","","",null,null,null,null,null,null,null,null,null,null,null,null,{"$f":"IF($P$53=\"\",\"\",$P$53)","v":""},null,null,null,null,null,null,null,null,null,null,null,null,null,null,null,null,null,null,null,null,null,null,null,null,null,null,null,null,null,null,null,null,null,null,null,null,null,null,null,null,null,null,null,null,234,{"$error":"#N/A"},{"$f":"IF(AP240=\"\",\"\",1+CZ239)","v":""},"",{"$f":"IF(AP240=\"\",\"\",1-DA240)","v":""},"",{"$f":"IF(AP240=\"\",\"\",(2*CZ240-1)*(LN(DC240)+LN(DA240)))","v":""},{"$error":"#N/A"}]
[null,null,null,null,null,null,null,null,null,null,null,null,null,null,null,null,null,null,null,null,null,null,null,null,null,null,null,null,null,null,null,null,null,null,null,null,null,null,null,null,235,"","","",null,null,null,null,null,null,null,null,null,null,null,null,{"$f":"IF($Q$53=\"\",\"\",$Q$53)","v":""},null,null,null,null,null,null,null,null,null,null,null,null,null,null,null,null,null,null,null,null,null,null,null,null,null,null,null,null,null,null,null,null,null,null,null,null,null,null,null,null,null,null,null,null,235,{"$error":"#N/A"},"","","","","",{"$error":"#N/A"}]
[null,null,null,null,null,null,null,null,null,null,null,null,null,null,null,null,null,null,null,null,null,null,null,null,null,null,null,null,null,null,null,null,null,null,null,null,null,null,null,null,236,"","","",null,null,null,null,null,null,null,null,null,null,null,"E52",{"$f":"IF($M$54=\"\",\"\",$M$54)","v":""},null,null,null,null,null,null,null,null,null,null,null,null,null,null,null,null,null,null,null,null,null,null,null,null,null,null,null,null,null,null,null,null,null,null,null,null,null,null,null,null,null,null,null,null,236,{"$error":"#N/A"},"","","","","",{"$error":"#N/A"}]
[null,null,null,null,null,null,null,null,null,null,null,null,null,null,null,null,null,null,null,null,null,null,null,null,null,null,null,null,null,null,null,null,null,null,null,null,null,null,null,null,237,"","","",null,null,null,null,null,null,null,null,null,null,null,null,{"$f":"IF($N$54=\"\",\"\",$N$54)","v":""},null,null,null,null,null,null,null,null,null,null,null,null,null,null,null,null,null,null,null,null,null,null,null,null,null,null,null,null,null,null,null,null,null,null,null,null,null,null,null,null,null,null,null,null,237,{"$error":"#N/A"},"","","","","",{"$error":"#N/A"}]
[null,null,null,null,null,null,null,null,null,null,null,null,null,null,null,null,null,null,null,null,null,null,null,null,null,null,null,null,null,null,null,null,null,null,null,null,null,null,null,null,238,"","","",null,null,null,null,null,null,null,null,null,null,null,null,{"$f":"IF($O$54=\"\",\"\",$O$54)","v":""},null,null,null,null,null,null,null,null,null,null,null,null,null,null,null,null,null,null,null,null,null,null,null,null,null,null,null,null,null,null,null,null,null,null,null,null,null,null,null,null,null,null,null,null,238,{"$error":"#N/A"},"","","","","",{"$error":"#N/A"}]
[null,null,null,null,null,null,null,null,null,null,null,null,null,null,null,null,null,null,null,null,null,null,null,null,null,null,null,null,null,null,null,null,null,null,null,null,null,null,null,null,239,"","","",null,null,null,null,null,null,null,null,null,null,null,null,{"$f":"IF($P$54=\"\",\"\",$P$54)","v":""},null,null,null,null,null,null,null,null,null,null,null,null,null,null,null,null,null,null,null,null,null,null,null,null,null,null,null,null,null,null,null,null,null,null,null,null,null,null,null,null,null,null,null,null,239,{"$error":"#N/A"},"","","","","",{"$error":"#N/A"}]
[null,null,null,null,null,null,null,null,null,null,null,null,null,null,null,null,null,null,null,null,null,null,null,null,null,null,null,null,null,null,null,null,null,null,null,null,null,null,null,null,240,"","","",null,null,null,null,null,null,null,null,null,null,null,null,{"$f":"IF($Q$54=\"\",\"\",$Q$54)","v":""},null,null,null,null,null,null,null,null,null,null,null,null,null,null,null,null,null,null,null,null,null,null,null,null,null,null,null,null,null,null,null,null,null,null,null,null,null,null,null,null,null,null,null,null,240,{"$error":"#N/A"},"","","","","",{"$error":"#N/A"}]
[null,null,null,null,null,null,null,null,null,null,null,null,null,null,null,null,null,null,null,null,null,null,null,null,null,null,null,null,null,null,null,null,null,null,null,null,null,null,null,null,241,"","","",null,null,null,null,null,null,null,null,null,null,null,"E53",{"$f":"IF($M$55=\"\",\"\",$M$55)","v":""},null,null,null,null,null,null,null,null,null,null,null,null,null,null,null,null,null,null,null,null,null,null,null,null,null,null,null,null,null,null,null,null,null,null,null,null,null,null,null,null,null,null,null,null,241,{"$error":"#N/A"},"","","","","",{"$error":"#N/A"}]
[null,null,null,null,null,null,null,null,null,null,null,null,null,null,null,null,null,null,null,null,null,null,null,null,null,null,null,null,null,null,null,null,null,null,null,null,null,null,null,null,242,"","","",null,null,null,null,null,null,null,null,null,null,null,null,{"$f":"IF($N$55=\"\",\"\",$N$55)","v":""},null,null,null,null,null,null,null,null,null,null,null,null,null,null,null,null,null,null,null,null,null,null,null,null,null,null,null,null,null,null,null,null,null,null,null,null,null,null,null,null,null,null,null,null,242,{"$error":"#N/A"},"","","","","",{"$error":"#N/A"}]
[null,null,null,null,null,null,null,null,null,null,null,null,null,null,null,null,null,null,null,null,null,null,null,null,null,null,null,null,null,null,null,null,null,null,null,null,null,null,null,null,243,"","","",null,null,null,null,null,null,null,null,null,null,null,null,{"$f":"IF($O$55=\"\",\"\",$O$55)","v":""},null,null,null,null,null,null,null,null,null,null,null,null,null,null,null,null,null,null,null,null,null,null,null,null,null,null,null,null,null,null,null,null,null,null,null,null,null,null,null,null,null,null,null,null,243,{"$error":"#N/A"},"","","","","",{"$error":"#N/A"}]
[null,null,null,null,null,null,null,null,null,null,null,null,null,null,null,null,null,null,null,null,null,null,null,null,null,null,null,null,null,null,null,null,null,null,null,null,null,null,null,null,244,"","","",null,null,null,null,null,null,null,null,null,null,null,null,{"$f":"IF($P$55=\"\",\"\",$P$55)","v":""},null,null,null,null,null,null,null,null,null,null,null,null,null,null,null,null,null,null,null,null,null,null,null,null,null,null,null,null,null,null,null,null,null,null,null,null,null,null,null,null,null,null,null,null,244,{"$error":"#N/A"},"","","","","",{"$error":"#N/A"}]
[null,null,null,null,null,null,null,null,null,null,null,null,null,null,null,null,null,null,null,null,null,null,null,null,null,null,null,null,null,null,null,null,null,null,null,null,null,null,null,null,245,"","","",null,null,null,null,null,null,null,null,null,null,null,null,{"$f":"IF($Q$55=\"\",\"\",$Q$55)","v":""},null,null,null,null,null,null,null,null,null,null,null,null,null,null,null,null,null,null,null,null,null,null,null,null,null,null,null,null,null,null,null,null,null,null,null,null,null,null,null,null,null,null,null,null,245,{"$error":"#N/A"},"","","","","",{"$error":"#N/A"}]
[null,null,null,null,null,null,null,null,null,null,null,null,null,null,null,null,null,null,null,null,null,null,null,null,null,null,null,null,null,null,null,null,null,null,null,null,null,null,null,null,246,"","","",null,null,null,null,null,null,null,null,null,null,null,"E54",{"$f":"IF($M$56=\"\",\"\",$M$56)","v":""},null,null,null,null,null,null,null,null,null,null,null,null,null,null,null,null,null,null,null,null,null,null,null,null,null,null,null,null,null,null,null,null,null,null,null,null,null,null,null,null,null,null,null,null,246,{"$error":"#N/A"},"","","","","",{"$error":"#N/A"}]
[null,null,null,null,null,null,null,null,null,null,null,null,null,null,null,null,null,null,null,null,null,null,null,null,null,null,null,null,null,null,null,null,null,null,null,null,null,null,null,null,247,"","","",null,null,null,null,null,null,null,null,null,null,null,null,{"$f":"IF($N$56=\"\",\"\",$N$56)","v":""},null,null,null,null,null,null,null,null,null,null,null,null,null,null,null,null,null,null,null,null,null,null,null,null,null,null,null,null,null,null,null,null,null,null,null,null,null,null,null,null,null,null,null,null,247,{"$error":"#N/A"},"","","","","",{"$error":"#N/A"}]
[null,null,null,null,null,null,null,null,null,null,null,null,null,null,null,null,null,null,null,null,null,null,null,null,null,null,null,null,null,null,null,null,null,null,null,null,null,null,null,null,248,"","","",null,null,null,null,null,null,null,null,null,null,null,null,{"$f":"IF($O$56=\"\",\"\",$O$56)","v":""},null,null,null,null,null,null,null,null,null,null,null,null,null,null,null,null,null,null,null,null,null,null,null,null,null,null,null,null,null,null,null,null,null,null,null,null,null,null,null,null,null,null,null,null,248,{"$error":"#N/A"},"","","","","",{"$error":"#N/A"}]
[null,null,null,null,null,null,null,null,null,null,null,null,null,null,null,null,null,null,null,null,null,null,null,null,null,null,null,null,null,null,null,null,null,null,null,null,null,null,null,null,249,"","","",null,null,null,null,null,null,null,null,null,null,null,null,{"$f":"IF($P$56=\"\",\"\",$P$56)","v":""},null,null,null,null,null,null,null,null,null,null,null,null,null,null,null,null,null,null,null,null,null,null,null,null,null,null,null,null,null,null,null,null,null,null,null,null,null,null,null,null,null,null,null,null,249,{"$error":"#N/A"},"","","","","",{"$error":"#N/A"}]
[null,null,null,null,null,null,null,null,null,null,null,null,null,null,null,null,null,null,null,null,null,null,null,null,null,null,null,null,null,null,null,null,null,null,null,null,null,null,null,null,250,"","","",null,null,null,null,null,null,null,null,null,null,null,null,{"$f":"IF($Q$56=\"\",\"\",$Q$56)","v":""},null,null,null,null,null,null,null,null,null,null,null,null,null,null,null,null,null,null,null,null,null,null,null,null,null,null,null,null,null,null,null,null,null,null,null,null,null,null,null,null,null,null,null,null,250,{"$error":"#N/A"},"","","","","",{"$error":"#N/A"}]
[null,null,null,null,null,null,null,null,null,null,null,null,null,null,null,null,null,null,null,null,null,null,null,null,null,null,null,null,null,null,null,null,null,null,null,null,null,null,null,null,null,null,{"$f":"SUM(AQ7:AQ256)","v":0},{"$f":"SUM(AR7:AR256)","v":0}]

{"sheet":"info_setup","index":3,"n_rows":16,"n_cols":3,"rows_kept":16,"cut":false,"hidden":false,"merged":[]}
[]
[]
[]
[null,{"$f":"language!BC1","v":"Sprache"}]
[null,{"$f":"language!BD1","v":"User -  Email"},"xx@sixsigmablackbelt.de"]
[null,{"$f":"language!BE1","v":"User - key"},"GFRDESX"]
[]
[null,{"$f":"language!BF1","v":"Gültig bis"},{"$f":"calculation!BK52","v":"00:00:00"}]
[null,{"$f":"language!BG1","v":"Notizen"},{"$f":"calculation!BK53","v":" "}]
[null,""]
[null,{"$f":"language!BI1","v":"Bemerkung"},{"$f":"calculation!BK50","v":"ergebnisuservalidieren:user xx@sixsigmablackbelt.de mit ppk in datensatz nicht vorhanden"}]
[]
[]
[null,{"$f":"language!BX1","v":"Gültige Lizenz erwerben"},"mail to roland.schnurr@sixsigmablackbelt.de"]
[null,{"$f":"language!BT1","v":"Kontakt"},"roland.schnurr@sixsigmablackbelt.de"]
[null,{"$f":"language!BU1","v":"homepage"},"www.sixsigmablackbelt.de"]

{"sheet":"language","index":4,"n_rows":15,"n_cols":80,"rows_kept":15,"cut":false,"hidden":false,"merged":[]}
[null,1,{"$f":"VLOOKUP($B$1,$B$4:$CL$15,2,FALSE)","v":"Prozess- und Maschinenfähigkeit"},{"$f":"VLOOKUP($B$1,$B$4:$CL$15,3,FALSE)","v":"Werte können geändert werden"},{"$f":"VLOOKUP($B$1,$B$4:$CL$15,4,FALSE)","v":"Werte werden berechnet (Blatt Berechnung)"},{"$f":"VLOOKUP($B$1,$B$4:$CL$15,5,FALSE)","v":"Artikel:"},{"$f":"VLOOKUP($B$1,$B$4:$CL$15,6,FALSE)","v":"Nummer:"},{"$f":"VLOOKUP($B$1,$B$4:$CL$15,7,FALSE)","v":"Zeichnung:"},{"$f":"VLOOKUP($B$1,$B$4:$CL$15,8,FALSE)","v":"Prüfer:"},{"$f":"VLOOKUP($B$1,$B$4:$CL$15,9,FALSE)","v":"Messmittel:"},{"$f":"VLOOKUP($B$1,$B$4:$CL$15,10,FALSE)","v":"Datum:"},{"$f":"VLOOKUP($B$1,$B$4:$CL$15,11,FALSE)","v":"Merkmal:"},{"$f":"VLOOKUP($B$1,$B$4:$CL$15,12,FALSE)","v":"Maßeinheit:"},{"$f":"VLOOKUP($B$1,$B$4:$CL$15,13,FALSE)","v":"Sollwert msoll ="},{"$f":"VLOOKUP($B$1,$B$4:$CL$15,14,FALSE)","v":"UGW"},{"$f":"VLOOKUP($B$1,$B$4:$CL$15,15,FALSE)","v":"OGW"},{"$f":"VLOOKUP($B$1,$B$4:$CL$15,16,FALSE)","v":"Anzahl Klassen Histogramm"},{"$f":"VLOOKUP($B$1,$B$4:$CL$15,17,FALSE)","v":"Cpk<"},{"$f":"VLOOKUP($B$1,$B$4:$CL$15,18,FALSE)","v":"Cpk"},{"$f":"VLOOKUP($B$1,$B$4:$CL$15,19,FALSE)","v":"Cpk>"},{"$f":"VLOOKUP($B$1,$B$4:$CL$15,20,FALSE)","v":"dazwischen"},{"$f":"VLOOKUP($B$1,$B$4:$CL$15,21,FALSE)","v":"Prozess nicht fähig"},{"$f":"VLOOKUP($B$1,$B$4:$CL$15,22,FALSE)","v":"Prozess bedingt fähig"},{"$f":"VLOOKUP($B$1,$B$4:$CL$15,23,FALSE)","v":"Prozess fähig"},{"$f":"VLOOKUP($B$1,$B$4:$CL$15,24,FALSE)","v":"Stichprobenumfang"},{"$f":"VLOOKUP($B$1,$B$4:$CL$15,25,FALSE)","v":"Mittelwert"},{"$f":"VLOOKUP($B$1,$B$4:$CL$15,26,FALSE)","v":"Standardabweichung"},{"$f":"VLOOKUP($B$1,$B$4:$CL$15,27,FALSE)","v":"Die Werte sind nach Andersson Darling Test"},{"$f":"VLOOKUP($B$1,$B$4:$CL$15,28,FALSE)","v":"normalverteilt"},{"$f":"VLOOKUP($B$1,$B$4:$CL$15,29,FALSE)","v":"nicht normalverteilt"},{"$f":"VLOOKUP($B$1,$B$4:$CL$15,30,FALSE)","v":0},{"$f":"VLOOKUP($B$1,$B$4:$CL$15,31,FALSE)","v":"OGW"},{"$f":"VLOOKUP($B$1,$B$4:$CL$15,32,FALSE)","v":"UGW"},{"$f":"VLOOKUP($B$1,$B$4:$CL$15,33,FALSE)","v":"Stichprobe chronologisch"},{"$f":"VLOOKUP($B$1,$B$4:$CL$15,34,FALSE)","v":"Histogramm"},{"$f":"VLOOKUP($B$1,$B$4:$CL$15,35,FALSE)","v":"Wahrscheinlichkeitsnetz"},{"$f":"VLOOKUP($B$1,$B$4:$CL$15,36,FALSE)","v":0},{"$f":"VLOOKUP($B$1,$B$4:$CL$15,37,FALSE)","v":"Cmu"},{"$f":"VLOOKUP($B$1,$B$4:$CL$15,38,FALSE)","v":"Cmo"},{"$f":"VLOOKUP($B$1,$B$4:$CL$15,39,FALSE)","v":"Cm"},{"$f":"VLOOKUP($B$1,$B$4:$CL$15,40,FALSE)","v":"Cmk"},{"$f":"VLOOKUP($B$1,$B$4:$CL$15,41,FALSE)","v":"Fähigkeits- kennwerte"},{"$f":"VLOOKUP($B$1,$B$4:$CL$15,42,FALSE)","v":"Bewertung cmk =>"},{"$f":"VLOOKUP($B$1,$B$4:$CL$15,43,FALSE)","v":"Median z"},{"$f":"VLOOKUP($B$1,$B$4:$CL$15,44,FALSE)","v":"Spannweite R"},{"$f":"VLOOKUP($B$1,$B$4:$CL$15,45,FALSE)","v":"Minimum"},{"$f":"VLOOKUP($B$1,$B$4:$CL$15,46,FALSE)","v":"Maximum"},{"$f":"VLOOKUP($B$1,$B$4:$CL$15,47,FALSE)","v":"Berechnete Leistung in ppm"},{"$f":"VLOOKUP($B$1,$B$4:$CL$15,48,FALSE)","v":"Über- schreitungs- anteil"},{"$f":"VLOOKUP($B$1,$B$4:$CL$15,49,FALSE)","v":"pUGW"},{"$f":"VLOOKUP($B$1,$B$4:$CL$15,50,FALSE)","v":"pOGW"},{"$f":"VLOOKUP($B$1,$B$4:$CL$15,51,FALSE)","v":"p"},{"$f":"VLOOKUP($B$1,$B$4:$CL$15,52,FALSE)","v":"Beobachtete Leistung in ppm"},{"$f":"VLOOKUP($B$1,$B$4:$CL$15,53,FALSE)","v":0},{"$f":"VLOOKUP($B$1,$B$4:$CL$15,54,FALSE)","v":"Sprache"},{"$f":"VLOOKUP($B$1,$B$4:$CL$15,55,FALSE)","v":"User -  Email"},{"$f":"VLOOKUP($B$1,$B$4:$CL$15,56,FALSE)","v":"User - key"},{"$f":"VLOOKUP($B$1,$B$4:$CL$15,57,FALSE)","v":"Gültig bis"},{"$f":"VLOOKUP($B$1,$B$4:$CL$15,58,FALSE)","v":"Notizen"},{"$f":"VLOOKUP($B$1,$B$4:$CL$15,59,FALSE)","v":""},{"$f":"VLOOKUP($B$1,$B$4:$CL$15,60,FALSE)","v":"Bemerkung"},{"$f":"VLOOKUP($B$1,$B$4:$CL$15,61,FALSE)","v":"Status: Die Werte im Arbeitsblatt sind kalkuliert"},{"$f":"VLOOKUP($B$1,$B$4:$CL$15,62,FALSE)","v":"Status: Sie haben Werte verändert. Zum Kalkulieren den untenstehenden Button drücken."},{"$f":"VLOOKUP($B$1,$B$4:$CL$15,63,FALSE)","v":"Ist Ihr Messwert einseitig begrenzt, so geben Sie nur den entsprechenden oberen oder unteren Grenzwert an. Bei einer einseitigen Grenze wird im industriellen Umfeld nur der Cmk berechnet."},{"$f":"VLOOKUP($B$1,$B$4:$CL$15,64,FALSE)","v":"u-Wert"},{"$f":"VLOOKUP($B$1,$B$4:$CL$15,65,FALSE)","v":"+ 3 Sigma"},{"$f":"VLOOKUP($B$1,$B$4:$CL$15,66,FALSE)","v":"- 3 Sigma"},{"$f":"VLOOKUP($B$1,$B$4:$CL$15,67,FALSE)","v":"Verteilung"},{"$f":"VLOOKUP($B$1,$B$4:$CL$15,68,FALSE)","v":"Hilfe"},{"$f":"VLOOKUP($B$1,$B$4:$CL$15,69,FALSE)","v":"Normalverteilung"},{"$f":"VLOOKUP($B$1,$B$4:$CL$15,70,FALSE)","v":"Betragsverteilung 1. Art"},{"$f":"VLOOKUP($B$1,$B$4:$CL$15,71,FALSE)","v":"Kontakt"},{"$f":"VLOOKUP($B$1,$B$4:$CL$15,72,FALSE)","v":"homepage"},{"$f":"VLOOKUP($B$1,$B$4:$CL$15,73,FALSE)","v":"Ohne valide Lizenz ist keine Berechnung möglich - Mehr Info (z. Bsp. wie Sie eine Volllizenz erhalten können) unter dem Tabellenblatt 'info_setup' "},{"$f":"VLOOKUP($B$1,$B$4:$CL$15,74,FALSE)","v":"Ohne valide Lizenz ist keine Berechnung möglich - Mehr Info (z. Bsp. wie Sie eine Volllizenz erhalten können) unter dem Tabellenblatt 'info_setup' "},{"$f":"VLOOKUP($B$1,$B$4:$CL$15,75,FALSE)","v":"Gültige Lizenz erwerben"},{"$f":"VLOOKUP($B$1,$B$4:$CL$15,76,FALSE)","v":"Dateneingabe"},{"$f":"VLOOKUP($B$1,$B$4:$CL$15,77,FALSE)","v":"Bis zu 50 Stichproben á 2 - 5 Werte"},{"$f":"VLOOKUP($B$1,$B$4:$CL$15,78,FALSE)","v":"Bei jeder Stichprobe muss die gleiche Anzahl an Messerten aufgenommen werden"},{"$f":"VLOOKUP($B$1,$B$4:$CL$15,79,FALSE)","v":"Methode für Schätzung Standardabweichung innerhalb - Rquer"}]
["Sprache","Beschreibung",1,2,3,4,5,6,7,8,9,10,11,12,13,14,15,16,17,18,19,20,21,22,23,24,25,26,27,28,29,30,31,32,33,34,35,36,37,38,39,40,41,42,43,44,45,46,47,48,49,50,51,52,53,54,55,56,57,58,59,61,62,63,63,64,65,66,67,68,69,70,71,72,73,74,75,76,77,78]
["Tabelle",null,"input","input","input","input","input","input","input","input","input","input","input","input","input","input","input","input","input","input","input","input","input","input","input","input","input","input","input","input","input","input","input","input","input","input","input","input","input","input","input","input","input","input","input","input","input","input","input","input","input","input","input",null,"language","language","language","language","language","language","language","input","input","input","input","input","input","input","info_setup","input","input","info_setup","info_setup","input","licence","licence","input","input","input","input"]
[null,"Zelle","O2","O4","O5","N7","N8","N9","N10","N11","N12","N13","N14","N15","N16","N17","N18","N19","N20","N21","O20","P19","P20","P21","N23","N24","N25","N26","P26","P26",null,"Diagramm","Diagramm","Diagramm","Diagramm","Diagramm",null,"O30","O31","O32","O33","N30","N34","N36","N37","N38","N39","N41","N42","O42","O43","O44","N46",null,"B4","B5","B6","B7","B8","B9","B10","AB2","AB2","R48","Diagramm","Diagramm","Diagramm","N22","Verteilung","Verteilung","Verteilung","B19","B20","msgbox","msgbox","msgbox"]
["deutsch",1,"Prozess- und Maschinenfähigkeit","Werte können geändert werden","Werte werden berechnet (Blatt Berechnung)","Artikel:","Nummer:","Zeichnung:","Prüfer:","Messmittel:","Datum:","Merkmal:","Maßeinheit:","Sollwert msoll =","UGW","OGW","Anzahl Klassen Histogramm","Cpk<","Cpk","Cpk>","dazwischen","Prozess nicht fähig","Prozess bedingt fähig","Prozess fähig","Stichprobenumfang","Mittelwert","Standardabweichung","Die Werte sind nach Andersson Darling Test","normalverteilt","nicht normalverteilt",null,"OGW","UGW","Stichprobe chronologisch","Histogramm","Wahrscheinlichkeitsnetz",null,"Cmu","Cmo","Cm","Cmk","Fähigkeits- kennwerte",{"$f":"\"Bewertung cmk =>\"","v":"Bewertung cmk =>"},"Median z","Spannweite R","Minimum","Maximum","Berechnete Leistung in ppm","Über- schreitungs- anteil","pUGW","pOGW","p","Beobachtete Leistung in ppm",null,"Sprache","User -  Email","User - key","Gültig bis","Notizen",{"$f":"\"\"","v":""},"Bemerkung","Status: Die Werte im Arbeitsblatt sind kalkuliert","Status: Sie haben Werte verändert. Zum Kalkulieren den untenstehenden Button drücken.","Ist Ihr Messwert einseitig begrenzt, so geben Sie nur den entsprechenden oberen oder unteren Grenzwert an. Bei einer einseitigen Grenze wird im industriellen Umfeld nur der Cmk berechnet.","u-Wert",{"$f":"\"+ 3 Sigma\"","v":"+ 3 Sigma"},{"$f":"\"- 3 Sigma\"","v":"- 3 Sigma"},"Verteilung","Hilfe","Normalverteilung","Betragsverteilung 1. Art","Kontakt","homepage","Ohne valide Lizenz ist keine Berechnung möglich - Mehr Info (z. Bsp. wie Sie eine Volllizenz erhalten können) unter dem Tabellenblatt 'info_setup' ","Ohne valide Lizenz ist keine Berechnung möglich - Mehr Info (z. Bsp. wie Sie eine Volllizenz erhalten können) unter dem Tabellenblatt 'info_setup' ","Gültige Lizenz erwerben","Dateneingabe","Bis zu 50 Stichproben á 2 - 5 Werte","Bei jeder Stichprobe muss die gleiche Anzahl an Messerten aufgenommen werden","Methode für Schätzung Standardabweichung innerhalb - Rquer"]
["english",2,"process and machine capability","value could be changed","value is calculated","part:","part number:","drawing:","inspector:","measuring dev:","date:","attribute:","measuring unit:","nominal value =","lower spec. limit LSL","upper spec. limit USL","number of classes histogram","Cpk<","Cpk","Cpk>","between","process not capable","process limited capable","process capable","sample size","mid","standard deviation s","values are according Andersson Darling test","normal distributed","not normal distributed",null,"USL","LSL","random sample chronological","histogram","probability plot",null,"Cpkl","Cpku","Cp","Cpk","probability values","evaluation Cpk =>","median","range","minimum","maximum","calculated performance","exceedance","pLSL","pUSL","p","observed performance in ppm",null,"language","user -  email","user - key","valid until","note",{"$f":"\"\"","v":""},"note","The values are calculated","Sie haben Werte verändert. Bitte kalkulieren","If your measured value is one-sided limited, enter only the corresponding upper or lower limit value. With a one-sided limit, in the industrial environment only the Cpk is calclulated","u-value",{"$f":"\"+ 3 sigma\"","v":"+ 3 sigma"},{"$f":"\"- 3 sigma\"","v":"- 3 sigma"},"distribution","help","normal distribution","truncated normal distribution","contact","homepage","No calculation is possible without a valid licence - More information (e.g. how to obtain a full licence) in the 'info_setup' worksheet ","No calculation is possible without a valid licence - More information (e.g. how to obtain a full licence) in the 'info_setup' worksheet ","buy the full licence","data input","Up to 50 samples of 2 -5 values each","The same number of samples must be taken for each sample","Method for estimating standard deviation within - Rquer"]
["italiano",3,"Capacità di processo e macchina","Valore modificabile","Valore calcolato","Articolo:","Codice:","Disegno","Ispettore","Strumento","Data","Attributo:","Unità di misura","Valore nominale =","Limite inferiore di specifica LSM","Limite superiore di specifica LSS","Numero di classi dell'istogramma","Cpk<","Cpk","Cpk>","tra","Processo non capace","Processo capace in modo limitatato","Processo capace","Dimensione del campione","media","Deviazione standard s","Valori in accorso al test Andersson Darling ","Distribuzione normale","Distribuzione non normale",null,"USL","LSL","Campione casuale cronologico","Istogramma","Grafico delle probabilità",null,"Cpkl","Cpku","Cp","Cpk","Valori di probabilità","Vautazione Cpk =>","Media","Range","Minimo","Massimo","Performance calcolata","Eccedenza","pLSL","pUSL","p","Prestazione osservata in ppm",null,"d","user -  Email","user - key","valid until","note",{"$f":"\"\"","v":""},"note","Ihre aktuellen Werte sind kalkuliert","Sie haben Werte verändert. Bitte kalkulieren","Se il valore misurato è limitato da un lato, inserire solo il valore limite superiore o inferiore corrispondente. Se il limite è unilaterale, nell'ambiente industriale viene calcolato solo il Cpk.",null,{"$f":"\"+ 3 sigma\"","v":"+ 3 sigma"},{"$f":"\"- 3 sigma\"","v":"- 3 sigma"},"distribuzione","distribuzione","distribuzione normale","distribuzione normale troncata","NN","NN","Non è possibile effettuare calcoli senza una licenza valida - Maggiori informazioni (ad esempio su come ottenere una licenza completa) nel foglio di lavoro \"info_setup\". ","Non è possibile effettuare calcoli senza una licenza valida - Maggiori informazioni (ad esempio su come ottenere una licenza completa) nel foglio di lavoro \"info_setup\". ","Acquistare la licenza completa","Inserimento dati","Fino a 50 campioni di 2 -5 valori ciascuno","Per ogni campione deve essere prelevato lo stesso numero di campioni.","Metodo per la stima della deviazione standard all'interno di - Rquer"]
["espanol",4,"NN2","NN2","NN2","NN2","NN2","NN2","NN2","NN2","NN2","NN2","NN2","NN2","NN2","NN2","NN2","NN2","NN2","NN2","NN2","NN2","NN2","NN2","NN2","NN2","NN2","NN2","NN2","NN2","NN2","NN2","NN2","NN2","NN2","NN2","NN2","NN2","NN2","NN2","NN2","NN2","NN2","NN2","NN2","NN2","NN2","NN2","NN2","NN2","NN2","NN2","NN2","NN2","NN2","NN2","NN2","NN2","NN2","NN2","NN2","NN2","NN2","NN2","NN2","NN2","NN2","NN2","NN2","NN2","NN2","NN2","NN2","NN2","NN2","NN2","NN2","NN2","NN2","NN2"]
["francais",5,"NN3","NN3","NN3","NN3","NN3","NN3","NN3","NN3","NN3","NN3","NN3","NN3","NN3","NN3","NN3","NN3","NN3","NN3","NN3","NN3","NN3","NN3","NN3","NN3","NN3","NN3","NN3","NN3","NN3","NN3","NN3","NN3","NN3","NN3","NN3","NN3","NN3","NN3","NN3","NN3","NN3","NN3","NN3","NN3","NN3","NN3","NN3","NN3","NN3","NN3","NN3","NN3","NN3","NN3","NN3","NN3","NN3","NN3","NN3","NN3","NN3","NN3","NN3","NN3","NN3","NN3","NN3","NN3","NN3","NN3","NN3","NN3","NN3","NN3","NN3","NN3","NN3","NN3"]
["portugues",6,"NN4","NN4","NN4","NN4","NN4","NN4","NN4","NN4","NN4","NN4","NN4","NN4","NN4","NN4","NN4","NN4","NN4","NN4","NN4","NN4","NN4","NN4","NN4","NN4","NN4","NN4","NN4","NN4","NN4","NN4","NN4","NN4","NN4","NN4","NN4","NN4","NN4","NN4","NN4","NN4","NN4","NN4","NN4","NN4","NN4","NN4","NN4","NN4","NN4","NN4","NN4","NN4","NN4","NN4","NN4","NN4","NN4","NN4","NN4","NN4","NN4","NN4","NN4","NN4","NN4","NN4","NN4","NN4","NN4","NN4","NN4","NN4","NN4","NN4","NN4","NN4","NN4","NN4"]
["mandarin",7,"NN5","NN5","NN5","NN5","NN5","NN5","NN5","NN5","NN5","NN5","NN5","NN5","NN5","NN5","NN5","NN5","NN5","NN5","NN5","NN5","NN5","NN5","NN5","NN5","NN5","NN5","NN5","NN5","NN5","NN5","NN5","NN5","NN5","NN5","NN5","NN5","NN5","NN5","NN5","NN5","NN5","NN5","NN5","NN5","NN5","NN5","NN5","NN5","NN5","NN5","NN5","NN5","NN5","NN5","NN5","NN5","NN5","NN5","NN5","NN5","NN5","NN5","NN5","NN5","NN5","NN5","NN5","NN5","NN5","NN5","NN5","NN5","NN5","NN5","NN5","NN5","NN5","NN5"]
["hindi",8,"NN6","NN6","NN6","NN6","NN6","NN6","NN6","NN6","NN6","NN6","NN6","NN6","NN6","NN6","NN6","NN6","NN6","NN6","NN6","NN6","NN6","NN6","NN6","NN6","NN6","NN6","NN6","NN6","NN6","NN6","NN6","NN6","NN6","NN6","NN6","NN6","NN6","NN6","NN6","NN6","NN6","NN6","NN6","NN6","NN6","NN6","NN6","NN6","NN6","NN6","NN6","NN6","NN6","NN6","NN6","NN6","NN6","NN6","NN6","NN6","NN6","NN6","NN6","NN6","NN6","NN6","NN6","NN6","NN6","NN6","NN6","NN6","NN6","NN6","NN6","NN6","NN6","NN6"]
["arabe",9,"NN7","NN7","NN7","NN7","NN7","NN7","NN7","NN7","NN7","NN7","NN7","NN7","NN7","NN7","NN7","NN7","NN7","NN7","NN7","NN7","NN7","NN7","NN7","NN7","NN7","NN7","NN7","NN7","NN7","NN7","NN7","NN7","NN7","NN7","NN7","NN7","NN7","NN7","NN7","NN7","NN7","NN7","NN7","NN7","NN7","NN7","NN7","NN7","NN7","NN7","NN7","NN7","NN7","NN7","NN7","NN7","NN7","NN7","NN7","NN7","NN7","NN7","NN7","NN7","NN7","NN7","NN7","NN7","NN7","NN7","NN7","NN7","NN7","NN7","NN7","NN7","NN7","NN7"]
["NN8",10,"NN8","NN8","NN8","NN8","NN8","NN8","NN8","NN8","NN8","NN8","NN8","NN8","NN8","NN8","NN8","NN8","NN8","NN8","NN8","NN8","NN8","NN8","NN8","NN8","NN8","NN8","NN8","NN8","NN8","NN8","NN8","NN8","NN8","NN8","NN8","NN8","NN8","NN8","NN8","NN8","NN8","NN8","NN8","NN8","NN8","NN8","NN8","NN8","NN8","NN8","NN8","NN8","NN8","NN8","NN8","NN8","NN8","NN8","NN8","NN8","NN8","NN8","NN8","NN8","NN8","NN8","NN8","NN8","NN8","NN8","NN8","NN8","NN8","NN8","NN8","NN8","NN8","NN8"]
["NN9",11,"NN9","NN9","NN9","NN9","NN9","NN9","NN9","NN9","NN9","NN9","NN9","NN9","NN9","NN9","NN9","NN9","NN9","NN9","NN9","NN9","NN9","NN9","NN9","NN9","NN9","NN9","NN9","NN9","NN9","NN9","NN9","NN9","NN9","NN9","NN9","NN9","NN9","NN9","NN9","NN9","NN9","NN9","NN9","NN9","NN9","NN9","NN9","NN9","NN9","NN9","NN9","NN9","NN9","NN9","NN9","NN9","NN9","NN9","NN9","NN9","NN9","NN9","NN9","NN9","NN9","NN9","NN9","NN9","NN9","NN9","NN9","NN9","NN9","NN9","NN9","NN9","NN9","NN9"]

{"sheet":"examples","index":5,"n_rows":104,"n_cols":7,"rows_kept":104,"cut":false,"hidden":false,"merged":[]}
[null,"Stichprobe","Y1","Y2","Y3","Y4","Y5"]
[null,1,74.03,74.001999999999995,74.019000000000005,73.992000000000004,74.007999999999996]
[null,2,73.995000000000005,73.992000000000004,74.001000000000005,74.010999999999996,74.004000000000005]
[null,3,73.988,74.024000000000001,74.021000000000001,74.004999999999995,74.001999999999995]
[null,4,74.001999999999995,73.995999999999995,73.992999999999995,74.015000000000001,74.009]
[null,5,73.992000000000004,74.007000000000005,74.015000000000001,73.989000000000004,74.013999999999996]
[null,6,74.009,73.994,73.997,73.984999999999999,73.992999999999995]
[null,7,73.995000000000005,74.006,73.994,74,74.004999999999995]
[null,8,73.984999999999999,74.003,73.992999999999995,74.015000000000001,73.988]
[null,9,74.007999999999996,73.995000000000005,74.009,74.004999999999995,74.004000000000005]
[null,10,73.998000000000005,74,73.989999999999995,74.007000000000005,73.995000000000005]
[null,11,73.994,73.998000000000005,73.994,73.995000000000005,73.989999999999995]
[null,12,74.004000000000005,74,74.007000000000005,74,73.995999999999995]
[null,13,73.983000000000004,74.001999999999995,73.998000000000005,73.997,74.012]
[null,14,74.006,73.966999999999999,73.994,74,73.983999999999995]
[null,15,74.012,74.013999999999996,73.998000000000005,73.998999999999995,74.007000000000005]
[null,16,74,73.983999999999995,74.004999999999995,73.998000000000005,73.995999999999995]
[null,17,73.994,74.012,73.986000000000004,74.004999999999995,74.007000000000005]
[null,18,74.006,74.010000000000005,74.018000000000001,74.003,74]
[null,19,73.983999999999995,74.001999999999995,74.003,74.004999999999995,73.997]
[null,20,74,74.010000000000005,74.013000000000005,74.02,74.003]
[null,21,73.981999999999999,74.001000000000005,74.015000000000001,74.004999999999995,73.995999999999995]
[null,22,74.004000000000005,73.998999999999995,73.989999999999995,74.006,74.009]
[null,23,74.010000000000005,73.989000000000004,73.989999999999995,74.009,74.013999999999996]
[null,24,74.015000000000001,74.007999999999996,73.992999999999995,74,74.010000000000005]
[null,25,73.981999999999999,73.983999999999995,73.995000000000005,74.016999999999996,74.013000000000005]
[null,26,74.03,74.001999999999995,74.019000000000005,73.992000000000004,74.007999999999996]
[null,27,73.995000000000005,73.992000000000004,74.001000000000005,74.010999999999996,74.004000000000005]
[null,28,73.988,74.024000000000001,74.021000000000001,74.004999999999995,74.001999999999995]
[null,29,74.001999999999995,73.995999999999995,73.992999999999995,74.015000000000001,74.009]
[null,30,73.992000000000004,74.007000000000005,74.015000000000001,73.989000000000004,74.013999999999996]
[null,31,74.009,73.994,73.997,73.984999999999999,73.992999999999995]
[null,32,73.995000000000005,74.006,73.994,74,74.004999999999995]
[null,33,73.984999999999999,74.003,73.992999999999995,74.015000000000001,73.988]
[null,34,74.007999999999996,73.995000000000005,74.009,74.004999999999995,74.004000000000005]
[null,35,73.998000000000005,74,73.989999999999995,74.007000000000005,73.995000000000005]
[null,36,73.994,73.998000000000005,73.994,73.995000000000005,73.989999999999995]
[null,37,74.004000000000005,74,74.007000000000005,74,73.995999999999995]
[null,38,73.983000000000004,74.001999999999995,73.998000000000005,73.997,74.012]
[null,39,74.006,73.966999999999999,73.994,74,73.983999999999995]
[null,40,74.012,74.013999999999996,73.998000000000005,73.998999999999995,74.007000000000005]
[null,41,74,73.983999999999995,74.004999999999995,73.998000000000005,73.995999999999995]
[null,42,73.994,74.012,73.986000000000004,74.004999999999995,74.007000000000005]
[null,43,74.006,74.010000000000005,74.018000000000001,74.003,74]
[null,44,73.983999999999995,74.001999999999995,74.003,74.004999999999995,73.997]
[null,45,74,74.010000000000005,74.013000000000005,74.02,74.003]
[null,46,73.981999999999999,74.001000000000005,74.015000000000001,74.004999999999995,73.995999999999995]
[null,47,74.004000000000005,73.998999999999995,73.989999999999995,74.006,74.009]
[null,48,74.010000000000005,73.989000000000004,73.989999999999995,74.009,74.013999999999996]
[null,49,74.015000000000001,74.007999999999996,73.992999999999995,74,74.010000000000005]
[null,50,73.981999999999999,73.983999999999995,73.995000000000005,74.016999999999996,74.013000000000005]
[]
[]
[null,"Stichprobe","Y1","Y2","Y3","Y4","Y5"]
[null,1,74.03,74.001999999999995]
[null,2,73.995000000000005,73.992000000000004]
[null,3,73.988,74.024000000000001]
[null,4,74.001999999999995,73.995999999999995]
[null,5,73.992000000000004,74.007000000000005]
[null,6,74.009,73.994]
[null,7,73.995000000000005,74.006]
[null,8,73.984999999999999,74.003]
[null,9,74.007999999999996,73.995000000000005]
[null,10,73.998000000000005,74]
[null,11,73.994,73.998000000000005]
[null,12,74.004000000000005,74]
[null,13,73.983000000000004,74.001999999999995]
[null,14,74.006,73.966999999999999]
[null,15,74.012,74.013999999999996]
[null,16,74,73.983999999999995]
[null,17,73.994,74.012]
[null,18,74.006,74.010000000000005]
[null,19,73.983999999999995,74.001999999999995]
[null,20,74,74.010000000000005]
[null,21,73.981999999999999,74.001000000000005]
[null,22,74.004000000000005,73.998999999999995]
[null,23,74.010000000000005,73.989000000000004]
[null,24,74.015000000000001,74.007999999999996]
[null,25,73.981999999999999,73.983999999999995]
[null,26,74.03,74.001999999999995]
[null,27,73.995000000000005,73.992000000000004]
[null,28,73.988,74.024000000000001]
[null,29,74.001999999999995,73.995999999999995]
[null,30,73.992000000000004,74.007000000000005]
[null,31,74.009,73.994]
[null,32,73.995000000000005,74.006]
[null,33,73.984999999999999,74.003]
[null,34,74.007999999999996,73.995000000000005]
[null,35,73.998000000000005,74]
[null,36,73.994,73.998000000000005]
[null,37]
[null,38]
[null,39]
[null,40]
[null,41]
[null,42]
[null,43]
[null,44]
[null,45]
[null,46]
[null,47]
[null,48]
[null,49]
[null,50]