{"text_format":"1","workbook":"xlsx","n_sheets":5,"sheets":["Start","input","calculation","info_setup","language"],"not_rendered":{"charts":3,"images":9,"macros":1,"external_links":0,"defined_names":39,"comments":0,"pivot_tables":0},"unopened":[],"bounds":{"document_bytes":16777216,"sheet_cells":100000,"rows_first":2000,"rows_last":500,"rows_between":2000,"halvings":0,"cell_chars":16384,"cell_head_chars":4096},"cells_cut":0,"cells_raw":0,"read":"whole","date_system":"1900"}

{"sheet":"Start","index":0,"n_rows":10,"n_cols":2,"rows_kept":10,"cut":false,"hidden":true,"merged":[]}
[]
[]
[]
[null,"Das Makro ist momentan nicht aktiviert"]
[null,"Bitte Aktivieren Sie das Makro"]
[null,"Ohne Makro funktioniert diese Datei nicht"]
[]
[null,"roland.schnurr@sixsigmablackbelt.de"]
[]
[null,"https://www.sixsigmablackbelt.de"]

{"sheet":"input","index":1,"n_rows":55,"n_cols":28,"rows_kept":55,"cut":false,"hidden":false,"merged":[[1,1,1,12],[7,14,7,15],[8,14,8,15],[1,13,1,19],[10,14,10,15],[1,20,1,24],[3,13,3,15],[4,13,4,15],[9,14,9,15],[6,14,6,15],[47,17,53,24],[11,14,11,15],[13,14,13,15],[36,13,36,14],[41,13,41,15],[46,13,46,15],[38,13,38,14],[34,13,34,14],[14,13,14,14],[15,13,15,14],[17,13,17,14],[12,14,12,15],[24,13,24,14],[16,13,16,14],[47,13,49,13],[42,13,44,13],[39,13,39,14],[30,13,33,13],[27,13,28,14],[37,13,37,14],[27,15,28,15],[26,13,26,14],[25,13,25,14],[21,14,21,15],[21,13,22,13],[22,14,22,15]]}
[]
[null,null,null,null,null,null,null,null,null,null,null,null,null,{"$f":"language!C1","v":"process and machine capability"},null,null,null,null,null,null,null,null,null,null,null,null,null,{"$f":"IF(calculation!A210=0,language!BJ1,language!BK1)","v":"The values are calculated"}]
[]
[null,"i","xi",null,"i","xi",null,"i","xi",null,"i","xi",null,{"$f":"language!D1","v":"value could be changed"}]
[null,1,20,null,51,18.8,null,101,16.899999999999999,null,151,null,null,{"$f":"language!E1","v":"value is calculated"}]
[null,2,21,null,52,17.100000000000001,null,102,19.5,null,152]
[null,3,21.5,null,53,18.600000000000001,null,103,20.399999999999999,null,153,null,null,{"$f":"language!F1","v":"part:"},"Halter"]
[null,4,19,null,54,18,null,104,19.100000000000001,null,154,null,null,{"$f":"language!G1","v":"part number:"},"C2G234824ß"]
[null,5,19,null,55,18.7,null,105,null,null,155,null,null,{"$f":"language!H1","v":"drawing:"},"UZT1340124357"]
[null,6,20.399999999999999,null,56,20.3,null,106,null,null,156,null,null,{"$f":"language!I1","v":"inspector:"},"Maier"]
[null,7,18.3,null,57,18.7,null,107,null,null,157,null,null,{"$f":"language!J1","v":"measuring dev:"},"Waage 47.22452"]
[null,8,19.899999999999999,null,58,18.8,null,108,null,null,158,null,null,{"$f":"language!K1","v":"date:"},"2014-12-10"]
[null,9,18.7,null,59,19.399999999999999,null,109,null,null,159,null,null,{"$f":"language!L1","v":"attribute:"},"Länge"]
[null,10,18,null,60,18.5,null,110,null,null,160,null,null,{"$f":"language!M1","v":"measuring unit:"},"mm"]
[null,11,17.7,null,61,18.600000000000001,null,111,null,null,161,null,null,{"$f":"language!N1","v":"nominal value ="},null,20]
[null,12,19.100000000000001,null,62,19.600000000000001,null,112,null,null,162,null,null,{"$f":"language!O1","v":"lower spec. limit LSL"},null,16]
[null,13,19.7,null,63,18.5,null,113,null,null,163,null,null,{"$f":"language!P1","v":"upper spec. limit USL"},null,23]
[null,14,18.100000000000001,null,64,20,null,114,null,null,164,null,null,{"$f":"language!Q1","v":"number of classes histogram"},null,20]
[null,15,18.399999999999999,null,65,17.8,null,115,null,null,165,null,null,{"$f":"language!R1","v":"Cpk<"},1.33,{"$f":"language!V1","v":"process not capable"}]
[null,16,17.5,null,66,19.8,null,116,null,null,166,null,null,{"$f":"language!S1","v":"Cpk"},{"$f":"language!U1","v":"between"},{"$f":"language!W1","v":"process limited capable"}]
[null,17,18.899999999999999,null,67,16.600000000000001,null,117,null,null,167,null,null,{"$f":"language!T1","v":"Cpk>"},1.66,{"$f":"language!X1","v":"process capable"}]
[null,18,19,null,68,19.399999999999999,null,118,null,null,168,null,null,{"$f":"language!BP1","v":"distribution"},{"$f":"language!BR1","v":"normal distribution"}]
[null,19,20.5,null,69,19.3,null,119,null,null,169,null,null,null,{"$f":"language!BS1","v":"truncated normal distribution"}]
[null,20,17.3,null,70,20.100000000000001,null,120,null,null,170]
[null,21,18.3,null,71,20.5,null,121,null,null,171,null,null,{"$f":"language!Y1","v":"sample size"},null,{"$f":"calculation!I25","v":104}]
[null,22,18.399999999999999,null,72,20,null,122,null,null,172,null,null,{"$f":"language!Z1","v":"mid"},null,{"$f":"calculation!I27","v":18.871153846199999}]
[null,23,18.600000000000001,null,73,20.8,null,123,null,null,173,null,null,{"$f":"language!AA1","v":"standard deviation s"},null,{"$f":"Standardabweichung","v":1.1790792094}]
[null,24,19.8,null,74,17.7,null,124,null,null,174,null,null,{"$f":"language!AB1","v":"values are according Andersson Darling test"},null,{"$f":"IF(calculation!I22<0.05,language!AD1,language!AC1)","v":"normal distributed"}]
[null,25,20.2,null,75,18.899999999999999,null,125,null,null,175]
[null,26,18.5,null,76,18.8,null,126,null,null,176]
[null,27,18.5,null,77,16.399999999999999,null,127,null,null,177,null,null,{"$f":"language!AP1","v":"probability values"},{"$f":"language!AL1","v":"Cpkl"},{"$f":"calculation!I31","v":0.8116937984}]
[null,28,18,null,78,18.5,null,128,null,null,178,null,null,null,{"$f":"language!AM1","v":"Cpku"},{"$f":"calculation!I32","v":1.1672515641000001}]
[null,29,20.9,null,79,19,null,129,null,null,179,null,null,null,{"$f":"language!AN1","v":"Cp"},{"$f":"calculation!I30","v":0.98947268123999998}]
[null,30,18.100000000000001,null,80,20.6,null,130,null,null,180,null,null,null,{"$f":"language!AO1","v":"Cpk"},{"$f":"calculation!I33","v":0.8116937984}]
[null,31,19.399999999999999,null,81,19.2,null,131,null,null,181,null,null,{"$f":"language!AQ1","v":"evaluation Cpk =>"},null,{"$f":"IF(P34<O19,P19,IF(P34>O21,P21,P20))","v":"process not capable"}]
[null,32,20.5,null,82,17.100000000000001,null,132,null,null,182]
[null,33,20.399999999999999,null,83,16.3,null,133,null,null,183,null,null,{"$f":"language!AR1","v":"median"},null,{"$f":"Median","v":18.899999999999999}]
[null,34,16.100000000000001,null,84,17.2,null,134,null,null,184,null,null,{"$f":"language!AS1","v":"range"},null,{"$f":"Spannweite","v":5.3999999999999986}]
[null,35,18.7,null,85,17.899999999999999,null,135,null,null,185,null,null,{"$f":"language!AT1","v":"minimum"},null,{"$f":"Minimum","v":16.100000000000001}]
[null,36,18.8,null,86,19.100000000000001,null,136,null,null,186,null,null,{"$f":"language!AU1","v":"maximum"},null,{"$f":"Maximum","v":21.5}]
[null,37,17.3,null,87,17.3,null,137,null,null,187]
[null,38,18.100000000000001,null,88,19.399999999999999,null,138,null,null,188,null,null,{"$f":"language!AV1","v":"calculated performance"}]
[null,39,19.899999999999999,null,89,18.3,null,139,null,null,189,null,null,{"$f":"language!AW1","v":"exceedance"},{"$f":"language!AX1","v":"pLSL"},{"$f":"calculation!I35","v":7444}]
[null,40,19.600000000000001,null,90,19.3,null,140,null,null,190,null,null,null,{"$f":"language!AY1","v":"pUSL"},{"$f":"calculation!I34","v":231}]
[null,41,18.399999999999999,null,91,17.2,null,141,null,null,191,null,null,null,{"$f":"language!AZ1","v":"p"},{"$f":"P43+P44","v":7675}]
[null,42,19.5,null,92,17.5,null,142,null,null,192]
[null,43,16.8,null,93,19.600000000000001,null,143,null,null,193,null,null,{"$f":"language!BA1","v":"observed performance in ppm"}]
[null,44,17.100000000000001,null,94,17.600000000000001,null,144,null,null,194,null,null,{"$f":"language!AW1","v":"exceedance"},{"$f":"language!AX1","v":"pLSL"},{"$f":"BEOBPUGW","v":0},null,{"$f":"language!BL1","v":"If your measured value is one-sided limited, enter only the corresponding upper or lower limit value. With a one-sided limit, in the industrial environment only the Cpk is calclulated"}]
[null,45,18.899999999999999,null,95,20,null,145,null,null,195,null,null,null,{"$f":"language!AY1","v":"pUSL"},{"$f":"BEOBPOGW","v":0}]
[null,46,19.7,null,96,19.899999999999999,null,146,null,null,196,null,null,null,{"$f":"language!AZ1","v":"p"},{"$f":"P49+P48","v":0}]
[null,47,19.7,null,97,16.899999999999999,null,147,null,null,197]
[null,48,19.2,null,98,19.5,null,148,null,null,198]
[null,49,20.6,null,99,20.399999999999999,null,149,null,null,199]
[null,50,20.100000000000001,null,100,19.100000000000001,null,150,null,null,200]
[null,50,56,null,100,22,null,150,6,null,200,33]

{"sheet":"calculation","index":2,"n_rows":210,"n_cols":67,"rows_kept":210,"cut":false,"hidden":true,"merged":[[57,16,57,25]]}
["[\"{\\\"ergebnisuservalidieren\\\":[\\\"user: max.mustermann@sixsigmablackbelt.de -> valid; cmk-> valid; licence key = AAABBB -> valid; date of licence; (2023-12-01) greater than today (2023-10-09) -> valid; calculation at 2023-10-09 22:40:13.802484; note: kostenlos\\\"],\\\"ergebnisuservalidieren_status\\\":[\\\"ja\\\"],\\\"pwertadtest\\\":[\\\"0.3953\\\"],\\\"Verteilung\\\":[\\\"normal\\\"],\\\"summe\\\":[1962.6],\\\"stichprobenumfang\\\":[104],\\\"sd\\\":[1.1790792094],\\\"mittelwert\\\":[18.8711538462],\\\"Lizenzdatum\\\":[\\\"01.12.2023\\\"],\\\"Notiz\\\":[\\\"kostenlos\\\"],\\\"cp\\\":[0.98947268124],\\\"cpu\\\":[0.8116937984],\\\"cpo\\\":[1.1672515641],\\\"cpk\\\":[0.8116937984],\\\"ppmo\\\":[231],\\\"ppmu\\\":[7444],\\\"platz1\\\":[\\\"platz1\\\"],\\\"platz2\\\":[\\\"platz1\\\"],\\\"platz3\\\":[\\\"platz1\\\"],\\\"Verteilung Diagramm\\\":[{\\\"qnorm\\\":15227525,\\\"dnorm\\\":2855},{\\\"qnorm\\\":16128205,\\\"dnorm\\\":22604},{\\\"qnorm\\\":16560201,\\\"dnorm\\\":49568},{\\\"qnorm\\\":16931741,\\\"dnorm\\\":87471},{\\\"qnorm\\\":17360103,\\\"dnorm\\\":148843},{\\\"qnorm\\\":17878815,\\\"dnorm\\\":237441},{\\\"qnorm\\\":18252844,\\\"dnorm\\\":294884},{\\\"qnorm\\\":18572437,\\\"dnorm\\\":327664},{\\\"qnorm\\\":18871153,\\\"dnorm\\\":338350},{\\\"qnorm\\\":19169870,\\\"dnorm\\\":327664},{\\\"qnorm\\\":19489463,\\\"dnorm\\\":294884},{\\\"qnorm\\\":19863491,\\\"dnorm\\\":237441},{\\\"qnorm\\\":20382204,\\\"dnorm\\\":148843},{\\\"qnorm\\\":20810566,\\\"dnorm\\\":87471},{\\\"qnorm\\\":21182106,\\\"dnorm\\\":49568},{\\\"qnorm\\\":21614102,\\\"dnorm\\\":22604},{\\\"qnorm\\\":22514782,\\\"dnorm\\\":2855},{\\\"dnorm\\\":0}]}\"]"]
[{"$f":"IF(B2=C2,0,1)","v":0},"normal",{"$f":"M16","v":"normal"}]
[{"$f":"IF(B3=C3,0,1)","v":0},"23",{"$f":"O16","v":"23"}]
[0,"16",{"$f":"Q16","v":"16"}]
[{"$f":"IF(B5=C5,0,1)","v":0},20,{"$f":"IF(input!C5=\"\",\"\",input!C5)","v":20},"\"",{"$f":"SUBSTITUTE(C5,\",\",\".\")","v":"20"},"\", ",",",null,null,null,null,null,null,null,null,null,null,null,null,null,null,null,null,null,null,null,null,null,null,null,1,{"$f":"IF((Anzahl>AE5),AE5,Anzahl)","v":1},{"$f":"IF(B5<>\"\",B5,#N/A)","v":20},{"$f":"IF(OGW=\"\",#N/A,IF(B5<>\"\",OGW,#N/A))","v":23},{"$f":"IF(UGW=\"\",#N/A,IF(B5<>\"\",UGW,#N/A))","v":16},{"$f":"I27-Standardabweichung","v":17.692074636799997},{"$f":"fxds+Standardabweichung","v":20.0502330556},{"$f":"fxds-2*Standardabweichung","v":16.5129954274},{"$f":"fxds+2*Standardabweichung","v":21.229312264999997},{"$f":"fxds-3*Standardabweichung","v":15.333916217999999},{"$f":"fxds+3*Standardabweichung","v":22.408391474399998},{"$f":"fxds","v":18.871153846199999},null,{"$f":"IF(AND(B5<>\"\",B5<UGW),1,0)","v":0},{"$f":"IF(AND(B5<>\"\",B5>OGW),1,0)","v":0},null,null,null,-6,{"$f":"fxds+AW5*Standardabweichung","v":11.796678589799999},3,{"$f":"AY5*2","v":6},{"$f":"AX5","v":11.796678589799999},null,null,1,{"$f":"IF(B5=\"\",NA(),SMALL(xi,BF5))","v":16.100000000000001},{"$f":"IF(B5=\"\",\"\",1)","v":1},{"$f":"IF(B5=\"\",\"\",NORMSDIST((BE5-fxds)/Standardabweichung))","v":9.3799126104353869E-3},{"$f":"IF(B5=\"\",\"\",1-BG5)","v":0.99062008738956464},{"$f":"IF(IF(B5=\"\",\"\",SMALL(BG,BF5))=0,0.0001,IF(B5=\"\",\"\",SMALL(BG,BF5)))","v":1.2887817915638089E-2},{"$f":"IF(B5=\"\",\"\",(2*BF5-1)*(LN(BI5)+LN(BG5)))","v":-9.0206575940087195},{"$f":"IF(B5=\"\",NA(),NORMSINV((BF5-0.3)/(Anzahl+0.4)))","v":-2.4726921125330161},null,null,{"$f":"Standardabweichung*BO5+fxds","v":22.408391474399998},3]
[{"$f":"IF(B6=C6,0,1)","v":0},21,{"$f":"IF(input!C6=\"\",\"\",input!C6)","v":21},"\"",{"$f":"SUBSTITUTE(C6,\",\",\".\")","v":"21"},"\", ",null,null,null,null,null,null,null,null,null,null,null,null,null,null,null,null,null,null,null,null,null,null,null,null,2,2,{"$f":"IF(B6<>\"\",B6,#N/A)","v":21},23,16,{"$f":"AJ5","v":17.692074636799997},20.0502330556,16.5129954274,21.229312264999997,15.333916217999999,22.408391474399998,18.871153846199999,null,0,0,null,null,null,-5,12.975757799199998,3,{"$f":"AY6*2","v":6},{"$f":"BA5","v":11.796678589799999},null,null,2,16.3,{"$f":"IF(B6=\"\",\"\",1+BF5)","v":2},1.4604821168787736E-2,{"$f":"IF(B6=\"\",\"\",1-BG6)","v":0.9853951788312123},3.5497001889283508E-2,{"$f":"IF(B6=\"\",\"\",(2*BF6-1)*(LN(BI6)+LN(BG6)))","v":-22.694131882882289},-2.1373805779024275,null,null,{"$f":"Standardabweichung*BO6+fxds","v":18.871153846199999},0]
[0,21.5,{"$f":"IF(input!C7=\"\",\"\",input!C7)","v":21.5},"\"","21.5","\", ",null,null,"string nach R",{"$f":"_xlfn.CONCAT(H16:R16,D5:F204,T16)","v":"\"a\":[\"max.mustermann@sixsigmablackbelt.de\",\"AAABBB\",\"normal\",\"23\",\"16\",\"20\", \"21\", \"21.5\", \"19\", \"19\", \"20.4\", \"18.3\", \"19.9\", \"18.7\", \"18\", \"17.7\", \"19.1\", \"19.7\", \"18.1\", \"18.4\", \"17.5\", \"18.9\", \"19\", \"20.5\", \"17.3\", \"18.3\", \"18.4\", \"18.6\", \"19.8\", \"20.2\", \"18.5\", \"18.5\", \"18\", \"20.9\", \"18.1\", \"19.4\", \"20.5\", \"20.4\", \"16.1\", \"18.7\", \"18.8\", \"17.3\", \"18.1\", \"19.9\", \"19.6\", \"18.4\", \"19.5\", \"16.8\", \"17.1\", \"18.9\", \"19.7\", \"19.7\", \"19.2\", \"20.6\", \"20.1\", \"18.8\", \"17.1\", \"18.6\", \"18\", \"18.7\", \"20.3\", \"18.7\", \"18.8\", \"19.4\", \"18.5\", \"18.6\", \"19.6\", \"18.5\", \"20\", \"17.8\", \"19.8\", \"16.6\", \"19.4\", \"19.3\", \"20.1\", \"20.5\", \"20\", \"20.8\", \"17.7\", \"18.9\", \"18.8\", \"16.4\", \"18.5\", \"19\", \"20.6\", \"19.2\", \"17.1\", \"16.3\", \"17.2\", \"17.9\", \"19.1\", \"17.3\", \"19.4\", \"18.3\", \"19.3\", \"17.2\", \"17.5\", \"19.6\", \"17.6\", \"20\", \"19.9\", \"16.9\", \"19.5\", \"20.4\", \"19.1\", \"16.9\", \"19.5\", \"20.4\", \"19.1\", \"\", \"\", \"\", \"\", \"\", \"\", \"\", \"\", \"\", \"\", \"\", \"\", \"\", \"\", \"\", \"\", \"\", \"\", \"\", \"\", \"\", \"\", \"\", \"\", \"\", \"\", \"\", \"\", \"\", \"\", \"\", \"\", \"\", \"\", \"\", \"\", \"\", \"\", \"\", \"\", \"\", \"\", \"\", \"\", \"\", \"\", \"\", \"\", \"\", \"\", \"\", \"\", \"\", \"\", \"\", \"\", \"\", \"\", \"\", \"\", \"\", \"\", \"\", \"\", \"\", \"\", \"\", \"\", \"\", \"\", \"\", \"\", \"\", \"\", \"\", \"\", \"\", \"\", \"\", \"\", \"\", \"\", \"\", \"\", \"\", \"\", \"\", \"\", \"\", \"\", \"\", \"\", \"\", \"\", \"\", \"\"]"},null,null,null,null,null,null,null,null,null,null,null,null,null,null,null,null,null,null,null,null,3,3,21.5,23,16,17.692074636799997,20.0502330556,16.5129954274,21.229312264999997,15.333916217999999,22.408391474399998,18.871153846199999,null,0,0,null,null,null,-4,14.154837008599998,3,6,{"$f":"BA6","v":11.796678589799999},null,null,3,16.399999999999999,{"$f":"IF(B7=\"\",\"\",1+BF6)","v":3},1.8048476477513946E-2,0.98195152352248605,4.2652287260979804E-2,-35.846841906490098,-1.9454225913844103,null,null,{"$f":"Standardabweichung*BO7+fxds","v":15.333916217999999},-3]
[0,19,{"$f":"IF(input!C8=\"\",\"\",input!C8)","v":19},"\"","19","\", ",null,null,null,null,null,null,null,null,null,null,null,null,null,null,null,null,null,null,null,null,null,null,null,null,4,4,19,23,16,17.692074636799997,20.0502330556,16.5129954274,21.229312264999997,15.333916217999999,22.408391474399998,18.871153846199999,null,0,0,null,null,null,-2,16.5129954274,3,6,11.796678589799999,null,null,4,16.600000000000001,4,2.7039095660882723E-2,0.97296090433911731,5.0931104487270229E-2,-46.114270473618518,-1.8062376514496066]
[0,19,{"$f":"IF(input!C9=\"\",\"\",input!C9)","v":19},"\"","19","\", ",null,null,null,null,null,null,null,null,null,null,null,null,null,null,null,null,null,null,null,null,null,null,null,null,5,5,19,23,16,17.692074636799997,20.0502330556,16.5129954274,21.229312264999997,15.333916217999999,22.408391474399998,18.871153846199999,null,0,0,null,null,null,-1,17.692074636799997,3,6,11.796678589799999,null,null,5,16.8,5,3.9494213942666945E-2,0.96050578605733306,7.1287640253945739E-2,-52.85370073796345,-1.695195637736439]
[0,20.399999999999999,{"$f":"IF(input!C10=\"\",\"\",input!C10)","v":20.399999999999999},"\"","20.4","\", ",null,null,null,null,null,null,null,null,null,null,null,null,null,null,null,null,null,null,null,null,null,null,null,null,6,6,20.399999999999999,23,16,17.692074636799997,20.0502330556,16.5129954274,21.229312264999997,15.333916217999999,22.408391474399998,18.871153846199999,null,0,0,null,null,null,1,20.0502330556,3,6,11.796678589799999,null,null,6,16.899999999999999,6,4.7284457849939822E-2,0.95271554215006016,7.1287640253945739E-2,-62.618665331455141,-1.6018200758463057]
[0,18.3,{"$f":"IF(input!C11=\"\",\"\",input!C11)","v":18.3},"\"","18.3","\", ",null,null,null,null,null,null,null,null,null,null,null,null,null,null,null,null,null,null,null,null,null,null,null,null,7,7,18.3,23,16,17.692074636799997,20.0502330556,16.5129954274,21.229312264999997,15.333916217999999,22.408391474399998,18.871153846199999,null,0,0,null,null,null,2,21.229312264999997,3,6,11.796678589799999,null,null,7,16.899999999999999,7,4.7284457849939822E-2,0.95271554215006016,8.3569385079585112E-2,-71.937471544983438,-1.5206308904123664]
[0,19.899999999999999,{"$f":"IF(input!C12=\"\",\"\",input!C12)","v":19.899999999999999},"\"","19.9","\", ",null,null,null,null,null,null,null,null,null,null,null,null,null,null,null,null,null,null,null,null,null,null,null,null,8,8,19.899999999999999,23,16,17.692074636799997,20.0502330556,16.5129954274,21.229312264999997,15.333916217999999,22.408391474399998,18.871153846199999,null,0,0,null,null,null,4,23.587470683799999,3,6,11.796678589799999,null,null,8,17.100000000000001,8,6.6529185899208282E-2,0.93347081410079169,8.3569385079585112E-2,-77.882888625657159,-1.4483843879989091]
[0,18.7,{"$f":"IF(input!C13=\"\",\"\",input!C13)","v":18.7},"\"","18.7","\", ",null,null,null,null,null,null,null,null,null,null,null,null,null,null,null,null,null,null,null,null,null,null,null,null,9,9,18.7,23,16,17.692074636799997,20.0502330556,16.5129954274,21.229312264999997,15.333916217999999,22.408391474399998,18.871153846199999,null,0,0,null,null,null,5,24.766549893200001,3,6,11.796678589799999,null,null,9,17.100000000000001,9,6.6529185899208282E-2,0.93347081410079169,8.3569385079585112E-2,-88.267273775744769,-1.3829941271006392]
[0,18,{"$f":"IF(input!C14=\"\",\"\",input!C14)","v":18},"\"","18","\", ",null,null,null,null,null,null,null,null,null,null,null,null,null,null,null,null,null,null,null,null,null,null,null,null,10,10,18,23,16,17.692074636799997,20.0502330556,16.5129954274,21.229312264999997,15.333916217999999,22.408391474399998,18.871153846199999,null,0,0,null,null,null,6,25.945629102599998,3,6,11.796678589799999,null,null,10,17.100000000000001,10,6.6529185899208282E-2,0.93347081410079169,9.7376827854143588E-2,-95.746349366015679,-1.3230349517479669]
[0,17.7,{"$f":"IF(input!C15=\"\",\"\",input!C15)","v":17.7},"\"","17.7","\", ",null,null,"userapiname",null,"userapikey",null,"verteilung",null,"\"OGW:",null,"\"UGW:",null,null,null,null,null,null,null,null,null,null,null,null,null,11,11,17.7,23,16,17.692074636799997,20.0502330556,16.5129954274,21.229312264999997,15.333916217999999,22.408391474399998,18.871153846199999,null,0,0,null,null,null,-3,15.333916217999999,3,6,11.796678589799999,null,null,11,17.2,11,7.8192055442790898E-2,0.92180794455720916,9.7376827854143588E-2,-102.43283889456701,-1.2674880246380946]
[0,19.100000000000001,{"$f":"IF(input!C16=\"\",\"\",input!C16)","v":19.100000000000001},"\"","19.1","\", ",null,"\"a\":[\"",{"$f":"info_setup!C5","v":"max.mustermann@sixsigmablackbelt.de"},"\",\"",{"$f":"info_setup!C6","v":"AAABBB"},"\",\"","normal","\",\"",{"$f":"IF(OGW=\"\",\"\",SUBSTITUTE(OGW,\",\",\".\"))","v":"23"},"\",\"",{"$f":"IF(UGW=\"\",\"\",SUBSTITUTE(UGW,\",\",\".\"))","v":"16"},"\",",null,"]",null,null,null,null,null,null,null,null,null,null,12,12,19.100000000000001,23,16,17.692074636799997,20.0502330556,16.5129954274,21.229312264999997,15.333916217999999,22.408391474399998,18.871153846199999,null,0,0,null,null,null,3,22.408391474399998,3,6,11.796678589799999,null,null,12,17.2,12,7.8192055442790898E-2,0.92180794455720916,9.7376827854143588E-2,-112.18834736071625,-1.2155984339134935]
[0,19.7,{"$f":"IF(input!C17=\"\",\"\",input!C17)","v":19.7},"\"","19.7","\", ",null,null,null,null,null,null,null,null,null,null,null,null,null,null,null,null,null,null,null,null,null,null,null,null,13,13,19.7,23,16,17.692074636799997,20.0502330556,16.5129954274,21.229312264999997,15.333916217999999,22.408391474399998,18.871153846199999,null,0,0,null,null,null,null,null,null,null,null,null,null,13,17.3,13,9.1343681805393748E-2,0.90865631819460624,9.7376827854143588E-2,-118.05732917304215,-1.1667904140077117]
[0,18.100000000000001,{"$f":"IF(input!C18=\"\",\"\",input!C18)","v":18.100000000000001},"\"","18.1","\", ",null,null,null,null,null,null,null,null,null,null,null,null,null,null,null,null,null,null,null,null,null,null,null,null,14,14,18.100000000000001,23,16,17.692074636799997,20.0502330556,16.5129954274,21.229312264999997,15.333916217999999,22.408391474399998,18.871153846199999,null,0,0,null,null,"Mittelwert",{"$f":"Mittelwert","v":18.871153846199999},3,null,null,null,null,null,14,17.3,14,9.1343681805393748E-2,0.90865631819460624,0.11278830959385033,-123.53495616585225,-1.120614225092825]
[0,18.399999999999999,{"$f":"IF(input!C19=\"\",\"\",input!C19)","v":18.399999999999999},"\"","18.4","\", ",null,null,null,null,null,null,null,null,null,null,null,null,null,null,null,null,null,null,null,null,null,null,null,null,15,15,18.399999999999999,23,16,17.692074636799997,20.0502330556,16.5129954274,21.229312264999997,15.333916217999999,22.408391474399998,18.871153846199999,null,0,0,null,null,"OGW",{"$f":"OGW","v":23},3,null,null,null,null,null,15,17.3,15,9.1343681805393748E-2,0.90865631819460624,0.12986695817512262,-128.59675651909171,-1.0767114501536124]
[0,17.5,{"$f":"IF(input!C20=\"\",\"\",input!C20)","v":17.5},"\"","17.5","\", ",null,"ergebnisuservalidieren:user: max.mustermann@sixsigmablackbelt.de -> valid; cmk-> valid; licence key = AAABBB -> valid; date of licence; (2023-12-01) greater than today (2023-10-09) -> valid; calculation at 2023-10-09 22:40:13.802484; note: kostenlos",null,null,null,null,null,null,null,null,null,null,null,null,null,null,null,null,null,null,null,null,null,null,16,16,17.5,23,16,17.692074636799997,20.0502330556,16.5129954274,21.229312264999997,15.333916217999999,22.408391474399998,18.871153846199999,null,0,0,null,null,"UGW",{"$f":"UGW","v":16},3,null,null,null,null,null,16,17.5,16,0.12243458555160616,0.87756541444839387,0.1486575548575324,-124.19493713958413,-1.0347915210595791]
[0,18.899999999999999,{"$f":"IF(input!C21=\"\",\"\",input!C21)","v":18.899999999999999},"\"","18.9","\", ",null,"ja",{"$f":"H21","v":"ja"},null,null,null,null,null,null,null,null,null,null,null,null,null,null,null,null,null,null,null,null,null,17,17,18.899999999999999,23,16,17.692074636799997,20.0502330556,16.5129954274,21.229312264999997,15.333916217999999,22.408391474399998,18.871153846199999,null,0,0,null,null,"Sollwert",{"$f":"Sollwert","v":20},3,null,null,null,null,null,17,17.5,17,0.12243458555160616,0.87756541444839387,0.1486575548575324,-132.20751372923471,-0.99461536503340842]
[0,19,{"$f":"IF(input!C22=\"\",\"\",input!C22)","v":19},"\"","19","\", ",null,0.39529999999999998,{"$f":"H22","v":0.39529999999999998},null,null,null,null,null,null,null,null,null,null,null,null,null,null,null,null,null,null,null,null,null,18,18,19,23,16,{"$f":"AJ21","v":17.692074636799997},20.0502330556,16.5129954274,21.229312264999997,15.333916217999999,22.408391474399998,18.871153846199999,null,0,0,null,null,null,null,null,null,null,null,null,null,18,17.600000000000001,18,0.14049673234564525,0.85950326765435481,0.16918361524228509,-130.87696023267827,-0.95598371956347172]
[0,20.5,{"$f":"IF(input!C23=\"\",\"\",input!C23)","v":20.5},"\"","20.5","\", ",null,"normal","normal",null,null,null,null,null,null,null,null,{"$f":"Maßeinheit","v":"mm"},{"$f":"Merkmal","v":"Länge"},{"$f":"IF(UGW<>\"\",six_cmu(Mittelwert,UGW,Standardabweichung),\"\")","v":0.81169379837821287},{"$f":"MEDIAN(xi)","v":18.899999999999999},{"$f":"IF(UGW<>0,NORMDIST(UGW,Mittelwert,Standardabweichung,1)*1000000,0)","v":7444.2200981329479},{"$f":"IF(UGW<>\"\",AR205/S24*1000000,0)","v":0},null,null,null,null,null,null,null,19,19,20.5,23,16,17.692074636799997,20.0502330556,16.5129954274,21.229312264999997,15.333916217999999,22.408391474399998,18.871153846199999,null,0,0,null,null,null,null,null,null,null,null,null,null,19,17.7,19,0.1602871637216656,0.83971283627833437,0.16918361524228509,-133.4796819750041,-0.91872859748633251]
[0,17.3,{"$f":"IF(input!C24=\"\",\"\",input!C24)","v":17.3},"\"","17.3","\", ",null,1962.6,1962.6,null,null,null,null,null,null,null,null,{"$f":"Sollwert","v":20},{"$f":"six_a(xi)","v":104},{"$f":"IF(OGW<>\"\",six_cmo(OGW,Mittelwert,Standardabweichung),\"\")","v":1.167251564012411},{"$f":"Maximum-Minimum","v":5.3999999999999986},{"$f":"IF(OGW<>\"\",(1-NORMDIST(OGW,Mittelwert,Standardabweichung,1))*1000000,0)","v":231.10248297775195},{"$f":"IF(OGW<>\"\",AS205/S24*1000000,0)","v":0},null,null,null,null,null,null,null,20,20,17.3,23,16,17.692074636799997,20.0502330556,16.5129954274,21.229312264999997,15.333916217999999,22.408391474399998,18.871153846199999,null,0,0,null,null,null,null,null,null,null,null,null,null,20,17.7,20,0.1602871637216656,0.83971283627833437,0.16918361524228509,-140.69479991959892,-0.8827069316566255]
[0,18.3,{"$f":"IF(input!C25=\"\",\"\",input!C25)","v":18.3},"\"","18.3","\", ",null,104,104,null,null,null,null,null,null,null,null,{"$f":"UGW","v":16},{"$f":"six_m(xi)","v":18.871153846153842},{"$f":"IF(OR(UGW=\"\",OGW=\"\"),\"\",six_cm(OGW,UGW,Standardabweichung))","v":0.98947268119531195},{"$f":"MIN(xi)","v":16.100000000000001},{"$f":"BERPOGW+BERPUGW","v":7675},{"$f":"W24+W23","v":0},null,null,null,null,null,null,null,21,21,18.3,23,16,17.692074636799997,20.0502330556,16.5129954274,21.229312264999997,15.333916217999999,22.408391474399998,18.871153846199999,null,0,0,null,null,null,null,null,null,null,null,null,null,21,17.8,21,0.18181592868493668,0.81818407131506332,0.16918361524228509,-142.74277746473905,-0.84779576122809619]
[0,18.399999999999999,{"$f":"IF(input!C26=\"\",\"\",input!C26)","v":18.399999999999999},"\"","18.4","\", ",null,1.1790792094,1.1790792094,null,null,null,null,null,null,null,null,{"$f":"OGW","v":23},{"$f":"six_st(xi)","v":1.1790792093522857},{"$f":"IF(OGW=\"\",CMU,IF(UGW=\"\",CMO,six_ck(CMO,CMU)))","v":0.8116937984},{"$f":"MAX(xi)","v":21.5},null,null,null,null,null,null,null,null,null,22,22,18.399999999999999,23,16,17.692074636799997,20.0502330556,16.5129954274,21.229312264999997,15.333916217999999,22.408391474399998,18.871153846199999,null,0,0,null,null,null,null,null,null,null,null,null,null,22,17.899999999999999,22,0.20506796190974538,0.79493203809025459,0.19144481649824696,-139.21548891549648,-0.81388852978076354]
[0,18.600000000000001,{"$f":"IF(input!C27=\"\",\"\",input!C27)","v":18.600000000000001},"\"","18.6","\", ",null,18.871153846199999,18.871153846199999,null,"normal",null,null,null,null,null,null,null,"Stichprobe chronologisch","OGW",null,null,null,null,null,null,null,null,null,null,23,23,18.600000000000001,23,16,17.692074636799997,20.0502330556,16.5129954274,21.229312264999997,15.333916217999999,22.408391474399998,18.871153846199999,null,0,0,null,null,null,null,null,null,null,null,null,null,23,18,23,0.23000131665046941,0.76999868334953059,0.19144481649824696,-140.52716648535997,-0.78089219941060251]
[0,19.8,{"$f":"IF(input!C28=\"\",\"\",input!C28)","v":19.8},"\"","19.8","\", ",null,"01.12.2023","01.12.2023",null,"betrag1",null,null,null,null,null,null,null,"Wahrscheinlichkeitsnetz","UGW",null,null,null,null,null,null,null,null,null,null,24,24,19.8,23,16,17.692074636799997,20.0502330556,16.5129954274,21.229312264999997,15.333916217999999,22.408391474399998,18.871153846199999,null,0,0,null,null,null,null,null,null,null,null,null,null,24,18,24,0.23000131665046941,0.76999868334953059,0.19144481649824696,-146.77281832915375,-0.74872497306338015]
[0,20.2,{"$f":"IF(input!C29=\"\",\"\",input!C29)","v":20.2},"\"","20.2","\", ",null,"kostenlos","kostenlos",null,null,null,null,null,null,null,null,null,"Test auf Normalverteilung (Anderson Darling)",{"$f":"\"+ 3 Sigma\"","v":"+ 3 Sigma"},null,null,null,null,null,null,null,null,null,null,25,25,20.2,23,16,17.692074636799997,20.0502330556,16.5129954274,21.229312264999997,15.333916217999999,22.408391474399998,18.871153846199999,null,0,0,null,null,null,null,null,null,null,null,null,null,25,18,25,0.23000131665046941,0.76999868334953059,0.21541490030458266,-147.23811976867972,-0.71731447670819293]
[0,18.5,{"$f":"IF(input!C30=\"\",\"\",input!C30)","v":18.5},"\"","18.5","\", ",null,0.98947268123999998,{"$f":"IF(H30=\"\",\"\",H30)","v":0.98947268123999998},null,null,null,null,null,null,null,null,null,"Prozess- und Maschinenfähigkeit",{"$f":"\"- 3 Sigma\"","v":"- 3 Sigma"},null,null,null,null,null,null,null,null,null,null,26,26,18.5,23,16,17.692074636799997,20.0502330556,16.5129954274,21.229312264999997,15.333916217999999,22.408391474399998,18.871153846199999,null,0,0,null,null,null,null,null,null,null,null,null,null,26,18.100000000000001,26,0.25654605568410882,0.74345394431589118,0.21541490030458266,-147.67745730642778,-0.68659629362666075]
[0,18.5,{"$f":"IF(input!C31=\"\",\"\",input!C31)","v":18.5},"\"","18.5","\", ",null,0.8116937984,{"$f":"IF(H31=\"\",\"\",H31)","v":0.8116937984},null,null,null,null,null,null,null,null,null,null,"Mittelwert",null,null,null,null,null,null,null,null,null,null,27,27,18.5,23,16,17.692074636799997,20.0502330556,16.5129954274,21.229312264999997,15.333916217999999,22.408391474399998,18.871153846199999,null,0,0,null,null,null,null,null,null,null,null,null,null,27,18.100000000000001,27,0.25654605568410882,0.74345394431589118,0.24104017158691693,-147.5116536686364,-0.65651277148568221]
[0,18,{"$f":"IF(input!C32=\"\",\"\",input!C32)","v":18},"\"","18","\", ",null,1.1672515641000001,1.1672515641000001,null,null,null,null,null,null,null,null,null,null,"Sollwert",null,null,null,null,null,null,null,null,null,null,28,28,18,23,16,17.692074636799997,20.0502330556,16.5129954274,21.229312264999997,15.333916217999999,22.408391474399998,18.871153846199999,null,0,0,null,null,null,null,null,null,null,null,null,null,28,18.100000000000001,28,0.25654605568410882,0.74345394431589118,0.24104017158691693,-153.07813116556608,-0.62701204299456692]
[0,20.9,{"$f":"IF(input!C33=\"\",\"\",input!C33)","v":20.9},"\"","20.9","\", ",null,0.8116937984,0.8116937984,null,null,null,null,null,null,null,null,"OGW","UGW",{"$f":"\" - 1 Sigma\"","v":" - 1 Sigma"},{"$f":"\" + 1 Sigma\"","v":" + 1 Sigma"},{"$f":"\"-  2 Sigma\"","v":"-  2 Sigma"},{"$f":"\" + 2 Sigma\"","v":" + 2 Sigma"},{"$f":"\" - 3 Sigma\"","v":" - 3 Sigma"},{"$f":"\" + 3 Sigma\"","v":" + 3 Sigma"},{"$f":"\" Mittelwert\"","v":" Mittelwert"},null,null,null,null,29,29,20.9,23,16,17.692074636799997,20.0502330556,16.5129954274,21.229312264999997,15.333916217999999,22.408391474399998,18.871153846199999,null,0,0,null,null,null,null,null,null,null,null,null,null,29,18.3,29,0.31404863901841629,0.68595136098158371,0.24104017158691693,-147.11694733410374,-0.59804721543276562]
[0,18.100000000000001,{"$f":"IF(input!C34=\"\",\"\",input!C34)","v":18.100000000000001},"\"","18.1","\", ",null,231,{"$f":"H34","v":231},null,null,null,null,null,null,null,null,{"$f":"IF(OGW<>\"\",\"OGW\",\"\")","v":"OGW"},{"$f":"IF(UGW<>\"\",\"UGW\",\"\")","v":"UGW"},null,null,null,null,null,null,null,null,null,null,null,30,30,18.100000000000001,23,16,17.692074636799997,20.0502330556,16.5129954274,21.229312264999997,15.333916217999999,22.408391474399998,18.871153846199999,null,0,0,null,null,null,null,null,null,null,null,null,null,30,18.3,30,0.31404863901841629,0.68595136098158371,0.26823869667811306,-145.97104092244663,-0.56957569489642701]
[0,19.399999999999999,{"$f":"IF(input!C35=\"\",\"\",input!C35)","v":19.399999999999999},"\"","19.4","\", ",null,7444,{"$f":"H35","v":7444},null,null,null,null,null,null,null,null,null,null,null,null,null,null,null,null,null,null,null,null,null,31,31,19.399999999999999,23,16,17.692074636799997,20.0502330556,16.5129954274,21.229312264999997,15.333916217999999,22.408391474399998,18.871153846199999,null,0,0,null,null,null,null,null,null,null,null,null,null,31,18.3,31,0.31404863901841629,0.68595136098158371,0.26823869667811306,-150.91921180117362,-0.54155861890836698]
[0,20.5,{"$f":"IF(input!C36=\"\",\"\",input!C36)","v":20.5},"\"","20.5","\", ",null,"platz1:platz1",{"$f":"H36/1000000","v":{"$error":"#VALUE!"}},null,null,null,null,null,null,null,null,null,null,null,null,null,null,null,null,null,null,null,null,null,32,32,20.5,23,16,17.692074636799997,20.0502330556,16.5129954274,21.229312264999997,15.333916217999999,22.408391474399998,18.871153846199999,null,0,0,null,null,null,null,null,null,null,null,null,null,32,18.399999999999999,32,0.34472751686435588,0.65527248313564412,0.26823869667811306,-149.9953779971932,-0.51396037685665386]
[0,20.399999999999999,{"$f":"IF(input!C37=\"\",\"\",input!C37)","v":20.399999999999999},"\"","20.4","\", ",null,"platz2:platz1",{"$error":"#VALUE!"},null,null,null,null,null,null,null,null,null,null,null,null,null,null,null,null,null,null,null,null,null,33,{"$f":"IF((Anzahl>AE37),AE37,Anzahl)","v":33},20.399999999999999,{"$f":"IF(OGW=\"\",#N/A,IF(B37<>\"\",OGW,#N/A))","v":23},{"$f":"IF(UGW=\"\",#N/A,IF(B37<>\"\",UGW,#N/A))","v":16},17.692074636799997,20.0502330556,16.5129954274,21.229312264999997,15.333916217999999,22.408391474399998,18.871153846199999,null,{"$f":"IF(AND(B37<>\"\",B37<UGW),1,0)","v":0},{"$f":"IF(AND(B37<>\"\",B37>OGW),1,0)","v":0},null,null,null,null,null,null,null,null,null,null,33,{"$f":"IF(B37=\"\",NA(),SMALL(xi,BF37))","v":18.399999999999999},33,{"$f":"IF(B37=\"\",\"\",NORMSDIST((BE37-fxds)/Standardabweichung))","v":0.34472751686435588},0.65527248313564412,{"$f":"IF(IF(B37=\"\",\"\",SMALL(BG,BF37))=0,0.0001,IF(B37=\"\",\"\",SMALL(BG,BF37)))","v":0.2969002813953876},-148.15839542639327,{"$f":"IF(B37=\"\",NA(),NORMSINV((BF37-0.3)/(Anzahl+0.4)))","v":-0.48674820211837072}]
[0,16.100000000000001,{"$f":"IF(input!C38=\"\",\"\",input!C38)","v":16.100000000000001},"\"","16.1","\", ",null,"platz3:platz1",{"$error":"#VALUE!"},null,null,null,null,null,null,null,null,null,null,null,null,null,null,null,null,null,null,null,null,null,34,34,16.100000000000001,23,16,{"$f":"AJ37","v":17.692074636799997},20.0502330556,16.5129954274,21.229312264999997,15.333916217999999,22.408391474399998,18.871153846199999,null,0,0,null,null,null,null,null,null,null,null,null,null,34,18.399999999999999,34,0.34472751686435588,0.65527248313564412,0.2969002813953876,-152.71711528566689,-0.45989182307066268]
[0,18.7,{"$f":"IF(input!C39=\"\",\"\",input!C39)","v":18.7},"\"","18.7","\", ",null,15227525,15.227525,null,null,null,null,null,null,null,null,null,null,null,null,null,null,null,null,null,null,null,null,null,35,35,18.7,23,16,17.692074636799997,20.0502330556,16.5129954274,21.229312264999997,15.333916217999999,22.408391474399998,18.871153846199999,null,0,0,null,null,null,null,null,null,null,null,null,null,35,18.5,35,0.37646328879802982,0.62353671120197018,0.2969002813953876,-151.19926477858991,-0.43336316276311609]
[0,18.8,{"$f":"IF(input!C40=\"\",\"\",input!C40)","v":18.8},"\"","18.8","\", ",null,2855,2.8549999999999999E-3,null,null,null,null,null,null,null,null,null,null,null,null,null,null,null,null,null,null,null,null,null,36,36,18.8,23,16,17.692074636799997,20.0502330556,16.5129954274,21.229312264999997,15.333916217999999,22.408391474399998,18.871153846199999,null,0,0,null,null,null,null,null,null,null,null,null,null,36,18.5,36,0.37646328879802982,0.62353671120197018,0.32688728054814331,-148.75029790092682,-0.40713607901947585]
[0,17.3,{"$f":"IF(input!C41=\"\",\"\",input!C41)","v":17.3},"\"","17.3","\", ",null,16128205,16.128205000000001,null,null,null,null,null,null,null,null,null,null,null,null,null,null,null,null,null,null,null,null,null,37,37,17.3,23,16,17.692074636799997,20.0502330556,16.5129954274,21.229312264999997,15.333916217999999,22.408391474399998,18.871153846199999,null,0,0,null,null,null,null,null,null,null,null,null,null,37,18.5,37,0.37646328879802982,0.62353671120197018,0.32688728054814331,-152.94044713757268,-0.38118613829468895]
[0,18.100000000000001,{"$f":"IF(input!C42=\"\",\"\",input!C42)","v":18.100000000000001},"\"","18.1","\", ",null,22604,2.2603999999999999E-2,null,null,null,null,null,null,null,null,null,null,null,null,null,null,null,null,null,null,null,null,null,38,38,18.100000000000001,23,16,17.692074636799997,20.0502330556,16.5129954274,21.229312264999997,15.333916217999999,22.408391474399998,18.871153846199999,null,0,0,null,null,null,null,null,null,null,null,null,null,38,18.5,38,0.37646328879802982,0.62353671120197018,0.32688728054814331,-157.1305963742185,-0.35549041783953095]
[0,19.899999999999999,{"$f":"IF(input!C43=\"\",\"\",input!C43)","v":19.899999999999999},"\"","19.9","\", ",null,16560201,16.560200999999999,null,null,null,null,null,null,null,null,null,null,null,null,null,null,null,null,null,null,null,null,null,39,39,19.899999999999999,23,16,17.692074636799997,20.0502330556,16.5129954274,21.229312264999997,15.333916217999999,22.408391474399998,18.871153846199999,null,0,0,null,null,null,null,null,null,null,null,null,null,39,18.5,39,0.37646328879802982,0.62353671120197018,0.32688728054814331,-161.32074561086432,-0.33002733169669207]
[0,19.600000000000001,{"$f":"IF(input!C44=\"\",\"\",input!C44)","v":19.600000000000001},"\"","19.6","\", ",null,49568,4.9568000000000001E-2,null,null,null,null,null,null,null,null,null,null,null,null,null,null,null,null,null,null,null,null,null,40,40,19.600000000000001,23,16,17.692074636799997,20.0502330556,16.5129954274,21.229312264999997,15.333916217999999,22.408391474399998,18.871153846199999,null,0,0,null,null,null,null,null,null,null,null,null,null,40,18.600000000000001,40,0.40905721109836302,0.59094278890163698,0.3580362568803549,-151.76068062964796,-0.30477647682692849]
[0,18.399999999999999,{"$f":"IF(input!C45=\"\",\"\",input!C45)","v":18.399999999999999},"\"","18.4","\", ",null,16931741,16.931740999999999,null,null,null,null,null,null,null,null,null,null,null,null,null,null,null,null,null,null,null,null,null,41,41,18.399999999999999,23,16,17.692074636799997,20.0502330556,16.5129954274,21.229312264999997,15.333916217999999,22.408391474399998,18.871153846199999,null,0,0,null,null,null,null,null,null,null,null,null,null,41,18.600000000000001,41,0.40905721109836302,0.59094278890163698,0.3580362568803549,-155.602723177234,-0.27971849628504075]
[0,19.5,{"$f":"IF(input!C46=\"\",\"\",input!C46)","v":19.5},"\"","19.5","\", ",null,87471,8.7470999999999993E-2,null,null,null,null,null,null,null,null,null,null,null,null,null,null,null,null,null,null,null,null,null,42,42,19.5,23,16,17.692074636799997,20.0502330556,16.5129954274,21.229312264999997,15.333916217999999,22.408391474399998,18.871153846199999,null,0,0,null,null,null,null,null,null,null,null,null,null,42,18.600000000000001,42,0.40905721109836302,0.59094278890163698,0.39016047109586838,-152.31308523118386,-0.25483495686606245]
[0,16.8,{"$f":"IF(input!C47=\"\",\"\",input!C47)","v":16.8},"\"","16.8","\", ",null,17360103,17.360102999999999,null,null,null,null,null,null,null,null,null,null,null,null,null,null,null,null,null,null,null,null,null,43,43,16.8,23,16,17.692074636799997,20.0502330556,16.5129954274,21.229312264999997,15.333916217999999,22.408391474399998,18.871153846199999,null,0,0,null,null,null,null,null,null,null,null,null,null,43,18.7,43,0.44229270588226322,0.55770729411773678,0.39016047109586838,-149.34334638600853,-0.23010823904727501]
[0,17.100000000000001,{"$f":"IF(input!C48=\"\",\"\",input!C48)","v":17.100000000000001},"\"","17.1","\", ",null,148843,0.148843,null,null,null,null,null,null,null,null,null,null,null,null,null,null,null,null,null,null,null,null,null,44,44,17.100000000000001,23,16,17.692074636799997,20.0502330556,16.5129954274,21.229312264999997,15.333916217999999,22.408391474399998,18.871153846199999,null,0,0,null,null,null,null,null,null,null,null,null,null,44,18.7,44,0.44229270588226322,0.55770729411773678,0.42305314738699917,-145.81555390362405,-0.20552143738092812]
[0,18.899999999999999,{"$f":"IF(input!C49=\"\",\"\",input!C49)","v":18.899999999999999},"\"","18.9","\", ",null,17878815,17.878814999999999,null,null,null,null,null,null,null,null,null,null,null,null,null,null,null,null,null,null,null,null,null,45,45,18.899999999999999,23,16,17.692074636799997,20.0502330556,16.5129954274,21.229312264999997,15.333916217999999,22.408391474399998,18.871153846199999,null,0,0,null,null,null,null,null,null,null,null,null,null,45,18.7,45,0.44229270588226322,0.55770729411773678,0.42305314738699917,-149.16763560255794,-0.18105826976082212]
[0,19.7,{"$f":"IF(input!C50=\"\",\"\",input!C50)","v":19.7},"\"","19.7","\", ",null,237441,0.23744100000000001,null,null,null,null,null,null,null,null,null,null,null,null,null,null,null,null,null,null,null,null,null,46,46,19.7,23,16,17.692074636799997,20.0502330556,16.5129954274,21.229312264999997,15.333916217999999,22.408391474399998,18.871153846199999,null,0,0,null,null,null,null,null,null,null,null,null,null,46,18.7,46,0.44229270588226322,0.55770729411773678,0.42305314738699917,-152.51971730149182,-0.15670299420489808]
[0,19.7,{"$f":"IF(input!C51=\"\",\"\",input!C51)","v":19.7},"\"","19.7","\", ",null,18252844,18.252844,null,null,null,null,null,null,null,null,null,null,null,null,null,null,null,null,null,null,null,null,null,47,47,19.7,23,16,17.692074636799997,20.0502330556,16.5129954274,21.229312264999997,15.333916217999999,22.408391474399998,18.871153846199999,null,0,0,null,null,null,null,null,null,null,null,null,null,47,18.8,47,0.47593965059385313,0.52406034940614687,0.42305314738699917,-149.05311634627515,-0.13244033197477662]
[0,19.2,{"$f":"IF(input!C52=\"\",\"\",input!C52)","v":19.2},"\"","19.2","\", ",null,294884,0.29488399999999998,null,null,null,null,null,null,null,null,null,null,null,null,null,null,null,null,null,null,null,null,null,48,48,19.2,23,16,17.692074636799997,20.0502330556,16.5129954274,21.229312264999997,15.333916217999999,22.408391474399998,18.871153846199999,null,0,0,null,null,null,null,null,null,null,null,null,null,48,18.8,48,0.47593965059385313,0.52406034940614687,0.45649142291393963,-145.03171059175529,-0.10825539599895463]
[0,20.6,{"$f":"IF(input!C53=\"\",\"\",input!C53)","v":20.6},"\"","20.6","\", ",null,18572437,18.572437000000001,null,null,null,null,null,null,null,null,null,null,null,null,null,null,null,null,null,null,null,null,null,49,49,20.6,23,16,17.692074636799997,20.0502330556,16.5129954274,21.229312264999997,15.333916217999999,22.408391474399998,18.871153846199999,null,0,0,null,null,null,null,null,null,null,null,null,null,49,18.8,49,0.47593965059385313,0.52406034940614687,0.45649142291393963,-148.085009762108,-8.4133623684707962E-2]
[0,20.100000000000001,{"$f":"IF(input!C54=\"\",\"\",input!C54)","v":20.100000000000001},"\"","20.1","\", ",null,327664,0.32766400000000001,null,null,null,null,null,null,null,null,null,null,null,null,null,null,null,null,null,null,null,null,null,50,50,20.100000000000001,23,16,{"$f":"AJ53","v":17.692074636799997},20.0502330556,16.5129954274,21.229312264999997,15.333916217999999,22.408391474399998,18.871153846199999,null,0,0,null,null,null,null,null,null,null,null,null,null,50,18.8,50,0.47593965059385313,0.52406034940614687,0.45649142291393963,-151.13830893246075,-6.0060713299041946E-2]
[0,18.8,{"$f":"IF(input!F5=\"\",\"\",input!F5)","v":18.8},"\"","18.8","\", ",null,18871153,18.871153,null,null,null,null,null,null,null,null,null,null,null,null,null,null,null,null,null,null,null,null,null,51,51,18.8,23,16,17.692074636799997,20.0502330556,16.5129954274,21.229312264999997,15.333916217999999,22.408391474399998,18.871153846199999,null,0,0,null,null,null,null,null,null,null,null,null,null,51,18.899999999999999,51,0.50975914289989444,0.49024085710010556,0.45649142291393963,-147.25823245783025,-3.6022563174729849E-2]
[0,17.100000000000001,{"$f":"IF(input!F6=\"\",\"\",input!F6)","v":17.100000000000001},"\"","17.1","\", ",null,338350,0.33834999999999998,null,null,null,null,null,null,null,null,null,null,null,null,null,null,null,null,null,null,null,null,null,52,52,17.100000000000001,23,16,17.692074636799997,20.0502330556,16.5129954274,21.229312264999997,15.333916217999999,22.408391474399998,18.871153846199999,null,0,0,null,null,null,null,null,null,null,null,null,null,52,18.899999999999999,52,0.50975914289989444,0.49024085710010556,0.49024085710010556,-142.82756591010394,-1.2005213056198949E-2]
[0,18.600000000000001,{"$f":"IF(input!F7=\"\",\"\",input!F7)","v":18.600000000000001},"\"","18.6","\", ",null,19169870,19.16987,null,null,null,null,null,null,null,null,null,null,null,null,null,null,null,null,null,null,null,null,null,53,53,18.600000000000001,23,16,17.692074636799997,20.0502330556,16.5129954274,21.229312264999997,15.333916217999999,22.408391474399998,18.871153846199999,null,0,0,null,null,null,null,null,null,null,null,null,null,53,18.899999999999999,53,0.50975914289989444,0.49024085710010556,0.49024085710010556,-145.60091670447488,1.2005213056199089E-2]
[0,18,{"$f":"IF(input!F8=\"\",\"\",input!F8)","v":18},"\"","18","\", ",null,327664,0.32766400000000001,null,null,null,null,null,null,null,null,null,null,null,null,null,null,null,null,null,null,null,null,null,54,54,18,23,16,17.692074636799997,20.0502330556,16.5129954274,21.229312264999997,15.333916217999999,22.408391474399998,18.871153846199999,null,0,0,null,null,null,null,null,null,null,null,null,null,54,19,54,0.54350857708606037,0.45649142291393963,0.49024085710010556,-141.51480327239759,3.6022563174729849E-2]
[0,18.7,{"$f":"IF(input!F9=\"\",\"\",input!F9)","v":18.7},"\"","18.7","\", ",null,19489463,19.489463000000001,null,null,null,null,null,null,null,null,null,null,null,null,null,null,null,null,null,null,null,null,null,55,55,18.7,23,16,17.692074636799997,20.0502330556,16.5129954274,21.229312264999997,15.333916217999999,22.408391474399998,18.871153846199999,null,0,0,null,null,null,null,null,null,null,null,null,null,55,19,55,0.54350857708606037,0.45649142291393963,0.52406034940614687,-136.88854619893701,6.0060713299041946E-2]
[0,20.3,{"$f":"IF(input!F10=\"\",\"\",input!F10)","v":20.3},"\"","20.3","\", ",null,294884,0.29488399999999998,null,null,null,null,null,null,null,null,null,null,null,null,null,null,null,null,null,null,null,null,null,56,56,20.3,23,16,17.692074636799997,20.0502330556,16.5129954274,21.229312264999997,15.333916217999999,22.408391474399998,18.871153846199999,null,0,0,null,null,null,null,null,null,null,null,null,null,56,19,56,0.54350857708606037,0.45649142291393963,0.52406034940614687,-139.4002626429542,8.4133623684707823E-2]
[0,18.7,{"$f":"IF(input!F11=\"\",\"\",input!F11)","v":18.7},"\"","18.7","\", ",null,19863491,19.863491,null,null,null,null,null,null,null,null,null,null,null,null,null,null,null,null,null,null,null,null,null,57,57,18.7,23,16,17.692074636799997,20.0502330556,16.5129954274,21.229312264999997,15.333916217999999,22.408391474399998,18.871153846199999,null,0,0,null,null,null,null,null,null,null,null,null,null,57,19,57,0.54350857708606037,0.45649142291393963,0.52406034940614687,-141.91197908697137,0.10825539599895477]
[0,18.8,{"$f":"IF(input!F12=\"\",\"\",input!F12)","v":18.8},"\"","18.8","\", ",null,237441,0.23744100000000001,null,null,null,null,null,null,null,null,null,null,null,null,null,null,null,null,null,null,null,null,null,58,58,18.8,23,16,17.692074636799997,20.0502330556,16.5129954274,21.229312264999997,15.333916217999999,22.408391474399998,18.871153846199999,null,0,0,null,null,null,null,null,null,null,null,null,null,58,19.100000000000001,58,0.57694685261300083,0.42305314738699917,0.52406034940614687,-137.55765908292958,0.13244033197477662]
[0,19.399999999999999,{"$f":"IF(input!F13=\"\",\"\",input!F13)","v":19.399999999999999},"\"","19.4","\", ",null,20382204,20.382204000000002,null,null,null,null,null,null,null,null,null,null,null,null,null,null,null,null,null,null,null,null,null,59,59,19.399999999999999,23,16,17.692074636799997,20.0502330556,16.5129954274,21.229312264999997,15.333916217999999,22.408391474399998,18.871153846199999,null,0,0,null,null,null,null,null,null,null,null,null,null,59,19.100000000000001,59,0.57694685261300083,0.42305314738699917,0.55770729411773678,-132.66935876814193,0.15670299420489808]
[0,18.5,{"$f":"IF(input!F14=\"\",\"\",input!F14)","v":18.5},"\"","18.5","\", ",null,148843,0.148843,null,null,null,null,null,null,null,1,{"$f":"Minimum","v":16.100000000000001},{"$f":"R64+U64","v":16.37},{"$f":"(S64+R64)/2","v":16.234999999999999},{"$f":"Spannweite/AnzahlKlassenHistogramm","v":0.26999999999999991},{"$f":"FREQUENCY(xi,S64)","v":2},{"$f":"$V64/Anzahl","v":1.9230769230769232E-2},{"$f":"V64","v":2},{"$f":"X64/Anzahl","v":1.9230769230769232E-2},{"$f":"Y64/U64","v":7.1225071225071254E-2},null,null,null,null,60,60,18.5,23,16,17.692074636799997,20.0502330556,16.5129954274,21.229312264999997,15.333916217999999,22.408391474399998,18.871153846199999,null,0,0,null,null,null,null,null,null,null,null,null,null,60,19.100000000000001,60,0.57694685261300083,0.42305314738699917,0.55770729411773678,-134.93721105477684,0.18105826976082223]
[0,18.600000000000001,{"$f":"IF(input!F15=\"\",\"\",input!F15)","v":18.600000000000001},"\"","18.6","\", ",null,20810566,20.810566000000001,null,null,null,null,null,null,null,2,{"$f":"IF(AnzahlKlassenHistogramm<Q65,R64,R64+U65+0.00000001)","v":16.370000010000002},{"$f":"R65+U65","v":16.640000010000001},{"$f":"(S65+R65)/2","v":16.505000010000003},0.26999999999999991,4,3.8461538461538464E-2,{"$f":"V65-V64","v":2},1.9230769230769232E-2,{"$f":"Y65/U65","v":7.1225071225071254E-2},null,null,null,null,61,61,18.600000000000001,23,16,17.692074636799997,20.0502330556,16.5129954274,21.229312264999997,15.333916217999999,22.408391474399998,18.871153846199999,null,0,0,null,null,null,null,null,null,null,null,null,null,61,19.100000000000001,61,0.57694685261300083,0.42305314738699917,0.55770729411773678,-137.20506334141174,0.20552143738092812]
[0,19.600000000000001,{"$f":"IF(input!F16=\"\",\"\",input!F16)","v":19.600000000000001},"\"","19.6","\", ",null,87471,8.7470999999999993E-2,null,null,null,null,null,null,null,3,16.640000020000002,{"$f":"R66+U66","v":16.910000020000002},{"$f":"(S66+R66)/2","v":16.77500002},0.26999999999999991,7,6.7307692307692304E-2,{"$f":"V66-V65","v":3},2.8846153846153848E-2,0.10683760683760687,null,null,null,null,62,62,19.600000000000001,23,16,17.692074636799997,20.0502330556,16.5129954274,21.229312264999997,15.333916217999999,22.408391474399998,18.871153846199999,null,0,0,null,null,null,null,null,null,null,null,null,null,62,19.2,62,0.60983952890413162,0.39016047109586838,0.55770729411773678,-132.65309418620313,0.23010823904727501]
[0,18.5,{"$f":"IF(input!F17=\"\",\"\",input!F17)","v":18.5},"\"","18.5","\", ",null,21182106,21.182106000000001,null,null,null,null,null,null,null,4,16.910000030000003,17.180000030000002,17.045000030000004,0.26999999999999991,10,9.6153846153846159E-2,3,2.8846153846153848E-2,0.10683760683760687,null,null,null,null,63,63,18.5,23,16,17.692074636799997,20.0502330556,16.5129954274,21.229312264999997,15.333916217999999,22.408391474399998,18.871153846199999,null,0,0,null,null,null,null,null,null,null,null,null,null,63,19.2,63,0.60983952890413162,0.39016047109586838,0.59094278890163698,-127.57443674301541,0.25483495686606233]
[0,20,{"$f":"IF(input!F18=\"\",\"\",input!F18)","v":20},"\"","20","\", ",null,49568,4.9568000000000001E-2,null,null,null,null,null,null,null,5,17.180000040000003,17.450000040000003,17.315000040000001,0.26999999999999991,15,0.14423076923076922,5,4.807692307692308E-2,0.17806267806267814,null,null,null,null,64,64,20,23,16,17.692074636799997,20.0502330556,16.5129954274,21.229312264999997,15.333916217999999,22.408391474399998,18.871153846199999,null,0,0,null,null,null,null,null,null,null,null,null,null,64,19.3,64,0.6419637431196451,0.3580362568803549,0.59094278890163698,-123.09595928501322,0.27971849628504092]
[0,17.8,{"$f":"IF(input!F19=\"\",\"\",input!F19)","v":17.8},"\"","17.8","\", ",null,21614102,21.614101999999999,null,null,null,null,null,null,null,6,17.450000050000003,17.720000050000003,17.585000050000005,0.26999999999999991,20,0.19230769230769232,5,4.807692307692308E-2,0.17806267806267814,null,null,null,null,65,{"$f":"IF((Anzahl>AE69),AE69,Anzahl)","v":65},17.8,{"$f":"IF(OGW=\"\",#N/A,IF(B69<>\"\",OGW,#N/A))","v":23},{"$f":"IF(UGW=\"\",#N/A,IF(B69<>\"\",UGW,#N/A))","v":16},17.692074636799997,20.0502330556,16.5129954274,21.229312264999997,15.333916217999999,22.408391474399998,18.871153846199999,null,{"$f":"IF(AND(B69<>\"\",B69<UGW),1,0)","v":0},{"$f":"IF(AND(B69<>\"\",B69>OGW),1,0)","v":0},null,null,null,null,null,null,null,null,null,null,65,{"$f":"IF(B69=\"\",NA(),SMALL(xi,BF69))","v":19.3},65,{"$f":"IF(B69=\"\",\"\",NORMSDIST((BE69-fxds)/Standardabweichung))","v":0.6419637431196451},0.3580362568803549,{"$f":"IF(IF(B69=\"\",\"\",SMALL(BG,BF69))=0,0.0001,IF(B69=\"\",\"\",SMALL(BG,BF69)))","v":0.59094278890163698},-125.03447832887169,{"$f":"IF(B69=\"\",NA(),NORMSINV((BF69-0.3)/(Anzahl+0.4)))","v":0.30477647682692849}]
[{"$f":"IF(B70=C70,0,1)","v":0},19.8,{"$f":"IF(input!F20=\"\",\"\",input!F20)","v":19.8},"\"",{"$f":"SUBSTITUTE(C70,\",\",\".\")","v":"19.8"},"\", ",null,22604,2.2603999999999999E-2,null,null,null,null,null,null,null,7,17.720000060000004,17.990000060000003,17.855000060000002,0.26999999999999991,22,0.21153846153846154,2,1.9230769230769232E-2,7.1225071225071254E-2,null,null,null,null,66,66,{"$f":"IF(B70<>\"\",B70,#N/A)","v":19.8},23,16,{"$f":"AJ69","v":17.692074636799997},20.0502330556,16.5129954274,21.229312264999997,15.333916217999999,22.408391474399998,18.871153846199999,null,0,0,null,null,null,null,null,null,null,null,null,null,66,19.399999999999999,66,0.67311271945185669,{"$f":"IF(B70=\"\",\"\",1-BG70)","v":0.32688728054814331},0.62353671120197018,{"$f":"IF(B70=\"\",\"\",(2*BF70-1)*(LN(BI70)+LN(BG70)))","v":-113.73290463042338},0.33002733169669207]
[0,16.600000000000001,{"$f":"IF(input!F21=\"\",\"\",input!F21)","v":16.600000000000001},"\"","16.6","\", ",null,22514782,22.514782,null,null,null,null,null,null,null,8,17.990000070000004,18.260000070000004,18.125000070000006,0.26999999999999991,28,0.26923076923076922,6,5.7692307692307696E-2,0.21367521367521375,null,null,null,null,67,67,16.600000000000001,23,16,17.692074636799997,20.0502330556,16.5129954274,21.229312264999997,15.333916217999999,22.408391474399998,18.871153846199999,null,0,0,null,null,null,null,null,null,null,null,null,null,67,19.399999999999999,{"$f":"IF(B71=\"\",\"\",1+BF70)","v":67},0.67311271945185669,0.32688728054814331,0.62353671120197018,-115.46928485378862,0.35549041783953067]
[0,19.399999999999999,{"$f":"IF(input!F22=\"\",\"\",input!F22)","v":19.399999999999999},"\"","19.4","\", ",null,2855,2.8549999999999999E-3,null,null,null,null,null,null,null,9,18.260000080000005,18.530000080000004,18.395000080000003,0.26999999999999991,39,0.375,11,0.10576923076923077,0.39173789173789186,null,null,null,null,68,68,19.399999999999999,23,16,17.692074636799997,20.0502330556,16.5129954274,21.229312264999997,15.333916217999999,22.408391474399998,18.871153846199999,null,0,0,null,null,null,null,null,null,null,null,null,null,68,19.399999999999999,68,0.67311271945185669,0.32688728054814331,0.62353671120197018,-117.20566507715385,0.38118613829468911]
[0,19.3,{"$f":"IF(input!F23=\"\",\"\",input!F23)","v":19.3},"\"","19.3","\", ",null,0,0,null,null,null,null,null,null,null,10,18.530000090000005,18.800000090000005,18.665000090000007,0.26999999999999991,50,0.48076923076923078,11,0.10576923076923077,0.39173789173789186,null,null,null,null,69,69,19.3,23,16,17.692074636799997,20.0502330556,16.5129954274,21.229312264999997,15.333916217999999,22.408391474399998,18.871153846199999,null,0,0,null,null,null,null,null,null,null,null,null,null,69,19.399999999999999,69,0.67311271945185669,0.32688728054814331,0.62353671120197018,-118.9420453005191,0.40713607901947585]
[0,20.100000000000001,{"$f":"IF(input!F24=\"\",\"\",input!F24)","v":20.100000000000001},"\"","20.1","\", ",null,null,null,null,null,null,null,null,null,null,11,18.800000100000005,19.070000100000005,18.935000100000003,0.26999999999999991,57,0.54807692307692313,7,6.7307692307692304E-2,0.24928774928774936,null,null,null,null,70,70,20.100000000000001,23,16,17.692074636799997,20.0502330556,16.5129954274,21.229312264999997,15.333916217999999,22.408391474399998,18.871153846199999,null,0,0,null,null,null,null,null,null,null,null,null,null,70,19.5,70,0.7030997186046124,0.2969002813953876,0.62353671120197018,-114.61998190406123,0.43336316276311609]
[0,20.5,{"$f":"IF(input!F25=\"\",\"\",input!F25)","v":20.5},"\"","20.5","\", ",null,null,null,null,null,null,null,null,null,null,12,19.070000110000006,19.340000110000005,19.205000110000007,0.26999999999999991,65,0.625,8,7.6923076923076927E-2,0.28490028490028502,null,null,null,null,71,71,20.5,23,16,17.692074636799997,20.0502330556,16.5129954274,21.229312264999997,15.333916217999999,22.408391474399998,18.871153846199999,null,0,0,null,null,null,null,null,null,null,null,null,null,71,19.5,71,0.7030997186046124,0.2969002813953876,0.65527248313564412,-109.26945518398851,0.45989182307066245]
[0,20,{"$f":"IF(input!F26=\"\",\"\",input!F26)","v":20},"\"","20","\", ",null,null,null,null,null,null,null,null,null,null,13,19.340000120000006,19.610000120000006,19.475000120000004,0.26999999999999991,75,0.72115384615384615,10,9.6153846153846159E-2,0.35612535612535628,null,null,null,null,72,72,20,23,16,17.692074636799997,20.0502330556,16.5129954274,21.229312264999997,15.333916217999999,22.408391474399998,18.871153846199999,null,0,0,null,null,null,null,null,null,null,null,null,null,72,19.5,72,0.7030997186046124,0.2969002813953876,0.65527248313564412,-110.81937653411602,0.48674820211837083]
[0,20.8,{"$f":"IF(input!F27=\"\",\"\",input!F27)","v":20.8},"\"","20.8","\", ",null,null,null,null,null,null,null,null,null,null,14,19.610000130000007,19.880000130000006,19.745000130000008,0.26999999999999991,80,0.76923076923076927,5,4.807692307692308E-2,0.17806267806267814,null,null,null,null,73,73,20.8,23,16,17.692074636799997,20.0502330556,16.5129954274,21.229312264999997,15.333916217999999,22.408391474399998,18.871153846199999,null,0,0,null,null,null,null,null,null,null,null,null,null,73,19.600000000000001,73,0.73176130332188694,0.26823869667811306,0.65527248313564412,-106.57572958532285,0.51396037685665374]
[0,17.7,{"$f":"IF(input!F28=\"\",\"\",input!F28)","v":17.7},"\"","17.7","\", ",null,null,null,null,null,null,null,null,null,null,15,19.880000140000007,20.150000140000007,20.015000140000005,0.26999999999999991,89,0.85576923076923073,9,8.6538461538461536E-2,0.3205128205128206,null,null,null,null,74,74,17.7,23,16,17.692074636799997,20.0502330556,16.5129954274,21.229312264999997,15.333916217999999,22.408391474399998,18.871153846199999,null,0,0,null,null,null,null,null,null,null,null,null,null,74,19.600000000000001,74,0.73176130332188694,0.26823869667811306,0.68595136098158371,-101.31967101490422,0.54155861890836687]
[0,18.899999999999999,{"$f":"IF(input!F29=\"\",\"\",input!F29)","v":18.899999999999999},"\"","18.9","\", ",null,null,null,null,null,null,null,null,null,null,16,20.150000150000007,20.420000150000007,20.285000150000009,0.26999999999999991,95,0.91346153846153844,6,5.7692307692307696E-2,0.21367521367521375,null,null,null,null,75,75,18.899999999999999,23,16,17.692074636799997,20.0502330556,16.5129954274,21.229312264999997,15.333916217999999,22.408391474399998,18.871153846199999,null,0,0,null,null,null,null,null,null,null,null,null,null,75,19.600000000000001,75,0.73176130332188694,0.26823869667811306,0.68595136098158371,-102.69816994027707,0.56957569489642701]
[0,18.8,{"$f":"IF(input!F30=\"\",\"\",input!F30)","v":18.8},"\"","18.8","\", ",null,null,null,null,null,null,null,null,null,null,17,20.420000160000008,20.690000160000007,20.555000160000006,0.26999999999999991,100,0.96153846153846156,5,4.807692307692308E-2,0.17806267806267814,null,null,null,null,76,76,18.8,23,16,17.692074636799997,20.0502330556,16.5129954274,21.229312264999997,15.333916217999999,22.408391474399998,18.871153846199999,null,0,0,null,null,null,null,null,null,null,null,null,null,76,19.7,76,0.75895982841308307,0.24104017158691693,0.68595136098158371,-98.566002902357155,0.59804721543276562]
[0,16.399999999999999,{"$f":"IF(input!F31=\"\",\"\",input!F31)","v":16.399999999999999},"\"","16.4","\", ",null,null,null,null,null,null,null,null,null,null,18,20.690000170000008,20.960000170000008,20.82500017000001,0.26999999999999991,102,0.98076923076923073,2,1.9230769230769232E-2,7.1225071225071254E-2,null,null,null,null,77,77,16.399999999999999,23,16,17.692074636799997,20.0502330556,16.5129954274,21.229312264999997,15.333916217999999,22.408391474399998,18.871153846199999,null,0,0,null,null,null,null,null,null,null,null,null,null,77,19.7,77,0.75895982841308307,0.24104017158691693,0.74345394431589118,-87.554998079773,0.62701204299456659]
[0,18.5,{"$f":"IF(input!F32=\"\",\"\",input!F32)","v":18.5},"\"","18.5","\", ",null,null,null,null,null,null,null,null,null,null,19,20.960000180000009,21.230000180000008,21.095000180000007,0.26999999999999991,103,0.99038461538461542,1,9.6153846153846159E-3,3.5612535612535627E-2,null,null,null,null,78,78,18.5,23,16,17.692074636799997,20.0502330556,16.5129954274,21.229312264999997,15.333916217999999,22.408391474399998,18.871153846199999,null,0,0,null,null,null,null,null,null,null,null,null,null,78,19.7,78,0.75895982841308307,0.24104017158691693,0.74345394431589118,-88.699507858593563,0.6565127714856821]
[0,19,{"$f":"IF(input!F33=\"\",\"\",input!F33)","v":19},"\"","19","\", ",null,null,null,null,null,null,null,null,null,null,20,21.230000190000009,21.500000190000009,21.365000190000011,0.26999999999999991,104,1,1,9.6153846153846159E-3,3.5612535612535627E-2,null,null,null,null,79,79,19,23,16,17.692074636799997,20.0502330556,16.5129954274,21.229312264999997,15.333916217999999,22.408391474399998,18.871153846199999,null,0,0,null,null,null,null,null,null,null,null,null,null,79,19.8,79,0.78458509969541734,0.21541490030458266,0.74345394431589118,-84.630645236638088,0.68659629362666075]
[0,20.6,{"$f":"IF(input!F34=\"\",\"\",input!F34)","v":20.6},"\"","20.6","\", ",null,null,null,null,null,null,null,null,null,null,null,null,null,null,null,null,null,null,null,null,null,null,null,null,80,80,20.6,23,16,17.692074636799997,20.0502330556,16.5129954274,21.229312264999997,15.333916217999999,22.408391474399998,18.871153846199999,null,0,0,null,null,null,null,null,null,null,null,null,null,80,19.8,80,0.78458509969541734,0.21541490030458266,0.76999868334953059,-80.130706956017278,0.71731447670819293]
[0,19.2,{"$f":"IF(input!F35=\"\",\"\",input!F35)","v":19.2},"\"","19.2","\", ",null,null,null,null,null,null,null,null,null,null,null,null,null,null,null,null,null,null,null,null,null,null,null,null,81,81,19.2,23,16,17.692074636799997,20.0502330556,16.5129954274,21.229312264999997,15.333916217999999,22.408391474399998,18.871153846199999,null,0,0,null,null,null,null,null,null,null,null,null,null,81,19.899999999999999,81,0.80855518350175304,0.19144481649824696,0.76999868334953059,-76.293524372455494,0.74872497306338026]
[0,17.100000000000001,{"$f":"IF(input!F36=\"\",\"\",input!F36)","v":17.100000000000001},"\"","17.1","\", ",null,null,null,null,null,null,null,null,null,null,null,null,null,null,null,null,null,null,null,null,null,null,null,null,82,82,17.100000000000001,23,16,{"$f":"AJ85","v":17.692074636799997},20.0502330556,16.5129954274,21.229312264999997,15.333916217999999,22.408391474399998,18.871153846199999,null,0,0,null,null,null,null,null,null,null,null,null,null,82,19.899999999999999,82,0.80855518350175304,0.19144481649824696,0.76999868334953059,-77.241270016833823,0.78089219941060228]
[0,16.3,{"$f":"IF(input!F37=\"\",\"\",input!F37)","v":16.3},"\"","16.3","\", ",null,null,null,null,null,null,null,null,null,null,null,null,{"$f":"I39","v":15.227525},{"$f":"I40","v":2.8549999999999999E-3},null,null,{"$f":"IF(OGW<>\"\",OGW,#N/A)","v":23},{"$f":"MAX(Häufigkeitsdichte)*1.05","v":0.41132478632478647},null,null,null,null,null,null,83,83,16.3,23,16,17.692074636799997,20.0502330556,16.5129954274,21.229312264999997,15.333916217999999,22.408391474399998,18.871153846199999,null,0,0,null,null,null,null,null,null,null,null,null,null,83,19.899999999999999,83,0.80855518350175304,0.19144481649824696,0.79493203809025459,-72.93082545845995,0.81388852978076354]
[0,17.2,{"$f":"IF(input!F38=\"\",\"\",input!F38)","v":17.2},"\"","17.2","\", ",null,null,null,null,null,null,null,null,null,null,null,null,{"$f":"I41","v":16.128205000000001},{"$f":"I42","v":2.2603999999999999E-2},null,null,{"$f":"IF(UGW<>\"\",UGW,#N/A)","v":16},0.41132478632478647,null,null,null,null,null,null,84,84,17.2,23,16,17.692074636799997,20.0502330556,16.5129954274,21.229312264999997,15.333916217999999,22.408391474399998,18.871153846199999,null,0,0,null,null,null,null,null,null,null,null,null,null,84,20,84,0.83081638475771491,0.16918361524228509,0.81818407131506332,-64.464405993708752,0.84779576122809619]
[0,17.899999999999999,{"$f":"IF(input!F39=\"\",\"\",input!F39)","v":17.899999999999999},"\"","17.9","\", ",null,null,null,null,null,null,null,null,null,null,null,null,{"$f":"I43","v":16.560200999999999},{"$f":"I44","v":4.9568000000000001E-2},null,null,{"$f":"fxds+3*Standardabweichung","v":22.408391474399998},0.41132478632478647,null,null,null,null,null,null,85,85,17.899999999999999,23,16,17.692074636799997,20.0502330556,16.5129954274,21.229312264999997,15.333916217999999,22.408391474399998,18.871153846199999,null,0,0,null,null,null,null,null,null,null,null,null,null,85,20,85,0.83081638475771491,0.16918361524228509,0.83971283627833437,-60.847059582533589,0.88270693165662395]
[0,19.100000000000001,{"$f":"IF(input!F40=\"\",\"\",input!F40)","v":19.100000000000001},"\"","19.1","\", ",null,null,null,null,null,null,null,null,null,null,null,null,{"$f":"I45","v":16.931740999999999},{"$f":"I46","v":8.7470999999999993E-2},null,null,{"$f":"fxds-3*Standardabweichung","v":15.333916217999999},0.41132478632478647,null,null,null,null,null,null,86,86,19.100000000000001,23,16,17.692074636799997,20.0502330556,16.5129954274,21.229312264999997,15.333916217999999,22.408391474399998,18.871153846199999,null,0,0,null,null,null,null,null,null,null,null,null,null,86,20,86,0.83081638475771491,0.16918361524228509,0.83971283627833437,-61.567143127889011,0.91872859748633218]
[0,17.3,{"$f":"IF(input!F41=\"\",\"\",input!F41)","v":17.3},"\"","17.3","\", ",null,null,null,null,null,null,null,null,null,null,null,null,{"$f":"I47","v":17.360102999999999},{"$f":"I48","v":0.148843},null,null,{"$f":"fxds","v":18.871153846199999},0.41132478632478647,null,null,null,null,null,null,87,87,17.3,23,16,17.692074636799997,20.0502330556,16.5129954274,21.229312264999997,15.333916217999999,22.408391474399998,18.871153846199999,null,0,0,null,null,null,null,null,null,null,null,null,null,87,20,87,0.83081638475771491,0.16918361524228509,0.85950326765435481,-58.257251391432959,0.95598371956347172]
[0,19.399999999999999,{"$f":"IF(input!F42=\"\",\"\",input!F42)","v":19.399999999999999},"\"","19.4","\", ",null,null,null,null,null,null,null,null,null,null,null,null,{"$f":"I49","v":17.878814999999999},{"$f":"I50","v":0.23744100000000001},null,null,{"$f":"Sollwert","v":20},0.41132478632478647,null,null,null,null,null,null,88,88,19.399999999999999,23,16,17.692074636799997,20.0502330556,16.5129954274,21.229312264999997,15.333916217999999,22.408391474399998,18.871153846199999,null,0,0,null,null,null,null,null,null,null,null,null,null,88,20.100000000000001,88,0.8513424451424676,0.1486575548575324,0.87756541444839387,-51.02030642961148,0.99461536503340842]
[0,18.3,{"$f":"IF(input!F43=\"\",\"\",input!F43)","v":18.3},"\"","18.3","\", ",null,null,null,null,null,null,null,null,null,null,null,null,{"$f":"I51","v":18.252844},{"$f":"I52","v":0.29488399999999998},null,null,null,null,null,null,null,null,null,null,89,89,18.3,23,16,17.692074636799997,20.0502330556,16.5129954274,21.229312264999997,15.333916217999999,22.408391474399998,18.871153846199999,null,0,0,null,null,null,null,null,null,null,null,null,null,89,20.100000000000001,89,0.8513424451424676,0.1486575548575324,0.87756541444839387,-51.603395645949895,1.0347915210595815]
[0,19.3,{"$f":"IF(input!F44=\"\",\"\",input!F44)","v":19.3},"\"","19.3","\", ",null,null,null,null,null,null,null,null,null,null,null,null,{"$f":"I53","v":18.572437000000001},{"$f":"I54","v":0.32766400000000001},null,null,null,null,null,null,null,null,null,null,90,90,19.3,23,16,17.692074636799997,20.0502330556,16.5129954274,21.229312264999997,15.333916217999999,22.408391474399998,18.871153846199999,null,0,0,null,null,null,null,null,null,null,null,null,null,90,20.2,90,0.87013304182487738,0.12986695817512262,0.90865631819460624,-42.04665276485224,1.0767114501536124]
[0,17.2,{"$f":"IF(input!F45=\"\",\"\",input!F45)","v":17.2},"\"","17.2","\", ",null,null,null,null,null,null,null,null,null,null,null,null,{"$f":"I55","v":18.871153},{"$f":"I56","v":0.33834999999999998},null,null,null,null,null,null,null,null,null,null,91,91,17.2,23,16,17.692074636799997,20.0502330556,16.5129954274,21.229312264999997,15.333916217999999,22.408391474399998,18.871153846199999,null,0,0,null,null,null,null,null,null,null,null,null,null,91,20.3,91,0.88721169040614967,0.11278830959385033,0.90865631819460624,-38.998261879258713,1.120614225092825]
[0,17.5,{"$f":"IF(input!F46=\"\",\"\",input!F46)","v":17.5},"\"","17.5","\", ",null,null,null,null,null,null,null,null,null,null,null,null,{"$f":"I57","v":19.16987},{"$f":"I58","v":0.32766400000000001},null,null,null,null,null,null,null,null,null,null,92,92,17.5,23,16,17.692074636799997,20.0502330556,16.5129954274,21.229312264999997,15.333916217999999,22.408391474399998,18.871153846199999,null,0,0,null,null,null,null,null,null,null,null,null,null,92,20.399999999999999,92,0.90262317214585641,9.7376827854143588E-2,0.90865631819460624,-36.2776387927019,1.1667904140077117]
[0,19.600000000000001,{"$f":"IF(input!F47=\"\",\"\",input!F47)","v":19.600000000000001},"\"","19.6","\", ",null,null,null,null,null,null,null,null,null,null,null,null,{"$f":"I59","v":19.489463000000001},{"$f":"I60","v":0.29488399999999998},null,null,null,null,null,null,null,null,null,null,93,93,19.600000000000001,23,16,17.692074636799997,20.0502330556,16.5129954274,21.229312264999997,15.333916217999999,22.408391474399998,18.871153846199999,null,0,0,null,null,null,null,null,null,null,null,null,null,93,20.399999999999999,93,0.90262317214585641,9.7376827854143588E-2,0.92180794455720916,-34.015672400552639,1.2155984339134929]
[0,17.600000000000001,{"$f":"IF(input!F48=\"\",\"\",input!F48)","v":17.600000000000001},"\"","17.6","\", ",null,null,null,null,null,null,null,null,null,null,null,null,{"$f":"I61","v":19.863491},{"$f":"I62","v":0.23744100000000001},null,null,null,null,null,null,null,null,null,null,94,94,17.600000000000001,23,16,17.692074636799997,20.0502330556,16.5129954274,21.229312264999997,15.333916217999999,22.408391474399998,18.871153846199999,null,0,0,null,null,null,null,null,null,null,null,null,null,94,20.399999999999999,94,0.90262317214585641,9.7376827854143588E-2,0.92180794455720916,-34.383409399477529,1.2674880246380946]
[0,20,{"$f":"IF(input!F49=\"\",\"\",input!F49)","v":20},"\"","20","\", ",null,null,null,null,null,null,null,null,null,null,null,null,{"$f":"I63","v":20.382204000000002},{"$f":"I64","v":0.148843},null,null,null,null,null,null,null,null,null,null,95,95,20,23,16,17.692074636799997,20.0502330556,16.5129954274,21.229312264999997,15.333916217999999,22.408391474399998,18.871153846199999,null,0,0,null,null,null,null,null,null,null,null,null,null,95,20.399999999999999,95,0.90262317214585641,9.7376827854143588E-2,0.93347081410079169,-32.374887445131442,1.3230349517479669]
[0,19.899999999999999,{"$f":"IF(input!F50=\"\",\"\",input!F50)","v":19.899999999999999},"\"","19.9","\", ",null,null,null,null,null,null,null,null,null,null,null,null,{"$f":"I65","v":20.810566000000001},{"$f":"I66","v":8.7470999999999993E-2},null,null,null,null,null,null,null,null,null,null,96,96,19.899999999999999,23,16,17.692074636799997,20.0502330556,16.5129954274,21.229312264999997,15.333916217999999,22.408391474399998,18.871153846199999,null,0,0,null,null,null,null,null,null,null,null,null,null,96,20.5,96,0.91643061492041489,8.3569385079585112E-2,0.93347081410079169,-29.817870007977096,1.3829941271006372]
[0,16.899999999999999,{"$f":"IF(input!F51=\"\",\"\",input!F51)","v":16.899999999999999},"\"","16.9","\", ",null,null,null,null,null,null,null,null,null,null,null,null,{"$f":"I67","v":21.182106000000001},{"$f":"I68","v":4.9568000000000001E-2},null,null,null,null,null,null,null,null,null,null,97,{"$f":"IF((Anzahl>AE101),AE101,Anzahl)","v":97},16.899999999999999,{"$f":"IF(OGW=\"\",#N/A,IF(B101<>\"\",OGW,#N/A))","v":23},{"$f":"IF(UGW=\"\",#N/A,IF(B101<>\"\",UGW,#N/A))","v":16},17.692074636799997,20.0502330556,16.5129954274,21.229312264999997,15.333916217999999,22.408391474399998,18.871153846199999,null,{"$f":"IF(AND(B101<>\"\",B101<UGW),1,0)","v":0},{"$f":"IF(AND(B101<>\"\",B101>OGW),1,0)","v":0},null,null,null,null,null,null,null,null,null,null,97,{"$f":"IF(B101=\"\",NA(),SMALL(xi,BF101))","v":20.5},97,{"$f":"IF(B101=\"\",\"\",NORMSDIST((BE101-fxds)/Standardabweichung))","v":0.91643061492041489},8.3569385079585112E-2,{"$f":"IF(IF(B101=\"\",\"\",SMALL(BG,BF101))=0,0.0001,IF(B101=\"\",\"\",SMALL(BG,BF101)))","v":0.93347081410079169},-30.130099013296228,{"$f":"IF(B101=\"\",NA(),NORMSINV((BF101-0.3)/(Anzahl+0.4)))","v":1.4483843879989089}]
[0,19.5,{"$f":"IF(input!F52=\"\",\"\",input!F52)","v":19.5},"\"","19.5","\", ",null,null,null,null,null,null,null,null,null,null,null,null,{"$f":"I69","v":21.614101999999999},{"$f":"I70","v":2.2603999999999999E-2},null,null,null,null,null,null,null,null,null,null,98,98,19.5,23,16,{"$f":"AJ101","v":17.692074636799997},20.0502330556,16.5129954274,21.229312264999997,15.333916217999999,22.408391474399998,18.871153846199999,null,0,0,null,null,null,null,null,null,null,null,null,null,98,20.5,98,0.91643061492041489,8.3569385079585112E-2,0.95271554215006016,-26.463026412657815,1.5206308904123669]
[0,20.399999999999999,{"$f":"IF(input!F53=\"\",\"\",input!F53)","v":20.399999999999999},"\"","20.4","\", ",null,null,null,null,null,null,null,null,null,null,null,null,{"$f":"I71","v":22.514782},{"$f":"I72","v":2.8549999999999999E-3},null,null,null,null,null,null,null,null,null,null,99,99,20.399999999999999,23,16,17.692074636799997,20.0502330556,16.5129954274,21.229312264999997,15.333916217999999,22.408391474399998,18.871153846199999,null,0,0,null,null,null,null,null,null,null,null,null,null,99,20.6,99,0.92871235974605426,7.1287640253945739E-2,0.95271554215006016,-24.111838294412493,1.6018200758463057]
[0,19.100000000000001,{"$f":"IF(input!F54=\"\",\"\",input!F54)","v":19.100000000000001},"\"","19.1","\", ",null,null,null,null,null,null,null,null,null,null,null,null,null,null,null,null,null,null,null,null,null,null,null,null,100,100,19.100000000000001,23,16,17.692074636799997,20.0502330556,16.5129954274,21.229312264999997,15.333916217999999,22.408391474399998,18.871153846199999,null,0,0,null,null,null,null,null,null,null,null,null,null,100,20.6,100,0.92871235974605426,7.1287640253945739E-2,0.96050578605733306,-22.736045399945596,1.6951956377364383]
[0,16.899999999999999,{"$f":"IF(input!I5=\"\",\"\",input!I5)","v":16.899999999999999},"\"","16.9","\", ",null,null,null,null,null,null,null,null,null,null,null,null,null,null,null,null,null,null,null,null,null,null,null,null,101,101,16.899999999999999,23,16,17.692074636799997,20.0502330556,16.5129954274,21.229312264999997,15.333916217999999,22.408391474399998,18.871153846199999,null,0,0,null,null,null,null,null,null,null,null,null,null,101,20.8,101,0.94906889551272977,5.0931104487270229E-2,0.97296090433911731,-16.016737890082538,1.8062376514496057]
[0,19.5,{"$f":"IF(input!I6=\"\",\"\",input!I6)","v":19.5},"\"","19.5","\", ",null,null,null,null,null,null,null,null,null,null,null,null,null,null,null,null,null,null,null,null,null,null,null,null,102,102,19.5,23,16,17.692074636799997,20.0502330556,16.5129954274,21.229312264999997,15.333916217999999,22.408391474399998,18.871153846199999,null,0,0,null,null,null,null,null,null,null,null,null,null,102,20.9,102,0.9573477127390202,4.2652287260979804E-2,0.98195152352248605,-12.545796706440953,1.9454225913844103]
[0,20.399999999999999,{"$f":"IF(input!I7=\"\",\"\",input!I7)","v":20.399999999999999},"\"","20.4","\", ",null,null,null,null,null,null,null,null,null,null,null,null,null,null,null,null,null,null,null,null,null,null,null,null,103,103,20.399999999999999,23,16,17.692074636799997,20.0502330556,16.5129954274,21.229312264999997,15.333916217999999,22.408391474399998,18.871153846199999,null,0,0,null,null,null,null,null,null,null,null,null,null,103,21,103,0.96450299811071649,3.5497001889283508E-2,0.9853951788312123,-10.425246231345799,2.1373805779024266]
[0,19.100000000000001,{"$f":"IF(input!I8=\"\",\"\",input!I8)","v":19.100000000000001},"\"","19.1","\", ",null,null,null,null,null,null,null,null,null,null,null,null,null,null,null,null,null,null,null,null,null,null,null,null,104,104,19.100000000000001,23,16,17.692074636799997,20.0502330556,16.5129954274,21.229312264999997,15.333916217999999,22.408391474399998,18.871153846199999,null,0,0,null,null,null,null,null,null,null,null,null,null,104,21.5,104,0.98711218208436191,1.2887817915638089E-2,0.99062008738956464,-4.6359238473057909,2.4726921125330135]
[0,"",{"$f":"IF(input!I9=\"\",\"\",input!I9)","v":""},"\"","","\", ",null,null,null,null,null,null,null,null,null,null,null,null,null,null,null,null,null,null,null,null,null,null,null,null,105,104,{"$error":"#N/A"},{"$error":"#N/A"},{"$error":"#N/A"},17.692074636799997,20.0502330556,16.5129954274,21.229312264999997,15.333916217999999,22.408391474399998,18.871153846199999,null,0,0,null,null,null,null,null,null,null,null,null,null,105,{"$error":"#N/A"},"","","","","",{"$error":"#N/A"}]
[0,"",{"$f":"IF(input!I10=\"\",\"\",input!I10)","v":""},"\"","","\", ",null,null,null,null,null,null,null,null,null,null,null,null,null,null,null,null,null,null,null,null,null,null,null,null,106,104,{"$error":"#N/A"},{"$error":"#N/A"},{"$error":"#N/A"},17.692074636799997,20.0502330556,16.5129954274,21.229312264999997,15.333916217999999,22.408391474399998,18.871153846199999,null,0,0,null,null,null,null,null,null,null,null,null,null,106,{"$error":"#N/A"},"","","","","",{"$error":"#N/A"}]
[0,"",{"$f":"IF(input!I11=\"\",\"\",input!I11)","v":""},"\"","","\", ",null,null,null,null,null,null,null,null,null,null,null,null,null,null,null,null,null,null,null,null,null,null,null,null,107,104,{"$error":"#N/A"},{"$error":"#N/A"},{"$error":"#N/A"},17.692074636799997,20.0502330556,16.5129954274,21.229312264999997,15.333916217999999,22.408391474399998,18.871153846199999,null,0,0,null,null,null,null,null,null,null,null,null,null,107,{"$error":"#N/A"},"","","","","",{"$error":"#N/A"}]
[0,"",{"$f":"IF(input!I12=\"\",\"\",input!I12)","v":""},"\"","","\", ",null,null,null,null,null,null,null,null,null,null,null,null,null,null,null,null,null,null,null,null,null,null,null,null,108,104,{"$error":"#N/A"},{"$error":"#N/A"},{"$error":"#N/A"},17.692074636799997,20.0502330556,16.5129954274,21.229312264999997,15.333916217999999,22.408391474399998,18.871153846199999,null,0,0,null,null,null,null,null,null,null,null,null,null,108,{"$error":"#N/A"},"","","","","",{"$error":"#N/A"}]
[0,"",{"$f":"IF(input!I13=\"\",\"\",input!I13)","v":""},"\"","","\", ",null,null,null,null,null,null,null,null,null,null,null,null,null,null,null,null,null,null,null,null,null,null,null,null,109,104,{"$error":"#N/A"},{"$error":"#N/A"},{"$error":"#N/A"},17.692074636799997,20.0502330556,16.5129954274,21.229312264999997,15.333916217999999,22.408391474399998,18.871153846199999,null,0,0,null,null,null,null,null,null,null,null,null,null,109,{"$error":"#N/A"},"","","","","",{"$error":"#N/A"}]
[0,"",{"$f":"IF(input!I14=\"\",\"\",input!I14)","v":""},"\"","","\", ",null,null,null,null,null,null,null,null,null,null,null,null,null,null,null,null,null,null,null,null,null,null,null,null,110,104,{"$error":"#N/A"},{"$error":"#N/A"},{"$error":"#N/A"},17.692074636799997,20.0502330556,16.5129954274,21.229312264999997,15.333916217999999,22.408391474399998,18.871153846199999,null,0,0,null,null,null,null,null,null,null,null,null,null,110,{"$error":"#N/A"},"","","","","",{"$error":"#N/A"}]
[0,"",{"$f":"IF(input!I15=\"\",\"\",input!I15)","v":""},"\"","","\", ",null,null,null,null,null,null,null,null,null,null,null,null,null,null,null,null,null,null,null,null,null,null,null,null,111,104,{"$error":"#N/A"},{"$error":"#N/A"},{"$error":"#N/A"},17.692074636799997,20.0502330556,16.5129954274,21.229312264999997,15.333916217999999,22.408391474399998,18.871153846199999,null,0,0,null,null,null,null,null,null,null,null,null,null,111,{"$error":"#N/A"},"","","","","",{"$error":"#N/A"}]
[0,"",{"$f":"IF(input!I16=\"\",\"\",input!I16)","v":""},"\"","","\", ",null,null,null,null,null,null,null,null,null,null,null,null,null,null,null,null,null,null,null,null,null,null,null,null,112,104,{"$error":"#N/A"},{"$error":"#N/A"},{"$error":"#N/A"},17.692074636799997,20.0502330556,16.5129954274,21.229312264999997,15.333916217999999,22.408391474399998,18.871153846199999,null,0,0,null,null,null,null,null,null,null,null,null,null,112,{"$error":"#N/A"},"","","","","",{"$error":"#N/A"}]
[0,"",{"$f":"IF(input!I17=\"\",\"\",input!I17)","v":""},"\"","","\", ",null,null,null,null,null,null,null,null,null,null,null,null,null,null,null,null,null,null,null,null,null,null,null,null,113,104,{"$error":"#N/A"},{"$error":"#N/A"},{"$error":"#N/A"},17.692074636799997,20.0502330556,16.5129954274,21.229312264999997,15.333916217999999,22.408391474399998,18.871153846199999,null,0,0,null,null,null,null,null,null,null,null,null,null,113,{"$error":"#N/A"},"","","","","",{"$error":"#N/A"}]
[0,"",{"$f":"IF(input!I18=\"\",\"\",input!I18)","v":""},"\"","","\", ",null,null,null,null,null,null,null,null,null,null,null,null,null,null,null,null,null,null,null,null,null,null,null,null,114,104,{"$error":"#N/A"},{"$error":"#N/A"},{"$error":"#N/A"},{"$f":"AJ117","v":17.692074636799997},20.0502330556,16.5129954274,21.229312264999997,15.333916217999999,22.408391474399998,18.871153846199999,null,0,0,null,null,null,null,null,null,null,null,null,null,114,{"$error":"#N/A"},"","","","","",{"$error":"#N/A"}]
[0,"",{"$f":"IF(input!I19=\"\",\"\",input!I19)","v":""},"\"","","\", ",null,null,null,null,null,null,null,null,null,null,null,null,null,null,null,null,null,null,null,null,null,null,null,null,115,104,{"$error":"#N/A"},{"$error":"#N/A"},{"$error":"#N/A"},17.692074636799997,20.0502330556,16.5129954274,21.229312264999997,15.333916217999999,22.408391474399998,18.871153846199999,null,0,0,null,null,null,null,null,null,null,null,null,null,115,{"$error":"#N/A"},"","","","","",{"$error":"#N/A"}]
[0,"",{"$f":"IF(input!I20=\"\",\"\",input!I20)","v":""},"\"","","\", ",null,null,null,null,null,null,null,null,null,null,null,null,null,null,null,null,null,null,null,null,null,null,null,null,116,104,{"$error":"#N/A"},{"$error":"#N/A"},{"$error":"#N/A"},17.692074636799997,20.0502330556,16.5129954274,21.229312264999997,15.333916217999999,22.408391474399998,18.871153846199999,null,0,0,null,null,null,null,null,null,null,null,null,null,116,{"$error":"#N/A"},"","","","","",{"$error":"#N/A"}]
[0,"",{"$f":"IF(input!I21=\"\",\"\",input!I21)","v":""},"\"","","\", ",null,null,null,null,null,null,null,null,null,null,null,null,null,null,null,null,null,null,null,null,null,null,null,null,117,104,{"$error":"#N/A"},{"$error":"#N/A"},{"$error":"#N/A"},17.692074636799997,20.0502330556,16.5129954274,21.229312264999997,15.333916217999999,22.408391474399998,18.871153846199999,null,0,0,null,null,null,null,null,null,null,null,null,null,117,{"$error":"#N/A"},"","","","","",{"$error":"#N/A"}]
[0,"",{"$f":"IF(input!I22=\"\",\"\",input!I22)","v":""},"\"","","\", ",null,null,null,null,null,null,null,null,null,null,null,null,null,null,null,null,null,null,null,null,null,null,null,null,118,104,{"$error":"#N/A"},{"$error":"#N/A"},{"$error":"#N/A"},17.692074636799997,20.0502330556,16.5129954274,21.229312264999997,15.333916217999999,22.408391474399998,18.871153846199999,null,0,0,null,null,null,null,null,null,null,null,null,null,118,{"$error":"#N/A"},"","","","","",{"$error":"#N/A"}]
[0,"",{"$f":"IF(input!I23=\"\",\"\",input!I23)","v":""},"\"","","\", ",null,null,null,null,null,null,null,null,null,null,null,null,null,null,null,null,null,null,null,null,null,null,null,null,119,104,{"$error":"#N/A"},{"$error":"#N/A"},{"$error":"#N/A"},17.692074636799997,20.0502330556,16.5129954274,21.229312264999997,15.333916217999999,22.408391474399998,18.871153846199999,null,0,0,null,null,null,null,null,null,null,null,null,null,119,{"$error":"#N/A"},"","","","","",{"$error":"#N/A"}]
[0,"",{"$f":"IF(input!I24=\"\",\"\",input!I24)","v":""},"\"","","\", ",null,null,null,null,null,null,null,null,null,null,null,null,null,null,null,null,null,null,null,null,null,null,null,null,120,104,{"$error":"#N/A"},{"$error":"#N/A"},{"$error":"#N/A"},17.692074636799997,20.0502330556,16.5129954274,21.229312264999997,15.333916217999999,22.408391474399998,18.871153846199999,null,0,0,null,null,null,null,null,null,null,null,null,null,120,{"$error":"#N/A"},"","","","","",{"$error":"#N/A"}]
[0,"",{"$f":"IF(input!I25=\"\",\"\",input!I25)","v":""},"\"","","\", ",null,null,null,null,null,null,null,null,null,null,null,null,null,null,null,null,null,null,null,null,null,null,null,null,121,104,{"$error":"#N/A"},{"$error":"#N/A"},{"$error":"#N/A"},17.692074636799997,20.0502330556,16.5129954274,21.229312264999997,15.333916217999999,22.408391474399998,18.871153846199999,null,0,0,null,null,null,null,null,null,null,null,null,null,121,{"$error":"#N/A"},"","","","","",{"$error":"#N/A"}]
[0,"",{"$f":"IF(input!I26=\"\",\"\",input!I26)","v":""},"\"","","\", ",null,null,null,null,null,null,null,null,null,null,null,null,null,null,null,null,null,null,null,null,null,null,null,null,122,104,{"$error":"#N/A"},{"$error":"#N/A"},{"$error":"#N/A"},17.692074636799997,20.0502330556,16.5129954274,21.229312264999997,15.333916217999999,22.408391474399998,18.871153846199999,null,0,0,null,null,null,null,null,null,null,null,null,null,122,{"$error":"#N/A"},"","","","","",{"$error":"#N/A"}]
[0,"",{"$f":"IF(input!I27=\"\",\"\",input!I27)","v":""},"\"","","\", ",null,null,null,null,null,null,null,null,null,null,null,null,null,null,null,null,null,null,null,null,null,null,null,null,123,104,{"$error":"#N/A"},{"$error":"#N/A"},{"$error":"#N/A"},17.692074636799997,20.0502330556,16.5129954274,21.229312264999997,15.333916217999999,22.408391474399998,18.871153846199999,null,0,0,null,null,null,null,null,null,null,null,null,null,123,{"$error":"#N/A"},"","","","","",{"$error":"#N/A"}]
[0,"",{"$f":"IF(input!I28=\"\",\"\",input!I28)","v":""},"\"","","\", ",null,null,null,null,null,null,null,null,null,null,null,null,null,null,null,null,null,null,null,null,null,null,null,null,124,104,{"$error":"#N/A"},{"$error":"#N/A"},{"$error":"#N/A"},17.692074636799997,20.0502330556,16.5129954274,21.229312264999997,15.333916217999999,22.408391474399998,18.871153846199999,null,0,0,null,null,null,null,null,null,null,null,null,null,124,{"$error":"#N/A"},"","","","","",{"$error":"#N/A"}]
[0,"",{"$f":"IF(input!I29=\"\",\"\",input!I29)","v":""},"\"","","\", ",null,null,null,null,null,null,null,null,null,null,null,null,null,null,null,null,null,null,null,null,null,null,null,null,125,104,{"$error":"#N/A"},{"$error":"#N/A"},{"$error":"#N/A"},17.692074636799997,20.0502330556,16.5129954274,21.229312264999997,15.333916217999999,22.408391474399998,18.871153846199999,null,0,0,null,null,null,null,null,null,null,null,null,null,125,{"$error":"#N/A"},"","","","","",{"$error":"#N/A"}]
[0,"",{"$f":"IF(input!I30=\"\",\"\",input!I30)","v":""},"\"","","\", ",null,null,null,null,null,null,null,null,null,null,null,null,null,null,null,null,null,null,null,null,null,null,null,null,126,104,{"$error":"#N/A"},{"$error":"#N/A"},{"$error":"#N/A"},17.692074636799997,20.0502330556,16.5129954274,21.229312264999997,15.333916217999999,22.408391474399998,18.871153846199999,null,0,0,null,null,null,null,null,null,null,null,null,null,126,{"$error":"#N/A"},"","","","","",{"$error":"#N/A"}]
[0,"",{"$f":"IF(input!I31=\"\",\"\",input!I31)","v":""},"\"","","\", ",null,null,null,null,null,null,null,null,null,null,null,null,null,null,null,null,null,null,null,null,null,null,null,null,127,104,{"$error":"#N/A"},{"$error":"#N/A"},{"$error":"#N/A"},17.692074636799997,20.0502330556,16.5129954274,21.229312264999997,15.333916217999999,22.408391474399998,18.871153846199999,null,0,0,null,null,null,null,null,null,null,null,null,null,127,{"$error":"#N/A"},"","","","","",{"$error":"#N/A"}]
[0,"",{"$f":"IF(input!I32=\"\",\"\",input!I32)","v":""},"\"","","\", ",null,null,null,null,null,null,null,null,null,null,null,null,null,null,null,null,null,null,null,null,null,null,null,null,128,104,{"$error":"#N/A"},{"$error":"#N/A"},{"$error":"#N/A"},17.692074636799997,20.0502330556,16.5129954274,21.229312264999997,15.333916217999999,22.408391474399998,18.871153846199999,null,0,0,null,null,null,null,null,null,null,null,null,null,128,{"$error":"#N/A"},"","","","","",{"$error":"#N/A"}]
[0,"",{"$f":"IF(input!I33=\"\",\"\",input!I33)","v":""},"\"","","\", ",null,null,null,null,null,null,null,null,null,null,null,null,null,null,null,null,null,null,null,null,null,null,null,null,129,{"$f":"IF((Anzahl>AE133),AE133,Anzahl)","v":104},{"$error":"#N/A"},{"$f":"IF(OGW=\"\",#N/A,IF(B133<>\"\",OGW,#N/A))","v":{"$error":"#N/A"}},{"$f":"IF(UGW=\"\",#N/A,IF(B133<>\"\",UGW,#N/A))","v":{"$error":"#N/A"}},17.692074636799997,20.0502330556,16.5129954274,21.229312264999997,15.333916217999999,22.408391474399998,18.871153846199999,null,{"$f":"IF(AND(B133<>\"\",B133<UGW),1,0)","v":0},{"$f":"IF(AND(B133<>\"\",B133>OGW),1,0)","v":0},null,null,null,null,null,null,null,null,null,null,129,{"$f":"IF(B133=\"\",NA(),SMALL(xi,BF133))","v":{"$error":"#N/A"}},"",{"$f":"IF(B133=\"\",\"\",NORMSDIST((BE133-fxds)/Standardabweichung))","v":""},"",{"$f":"IF(IF(B133=\"\",\"\",SMALL(BG,BF133))=0,0.0001,IF(B133=\"\",\"\",SMALL(BG,BF133)))","v":""},"",{"$f":"IF(B133=\"\",NA(),NORMSINV((BF133-0.3)/(Anzahl+0.4)))","v":{"$error":"#N/A"}}]
[{"$f":"IF(B134=C134,0,1)","v":0},"",{"$f":"IF(input!I34=\"\",\"\",input!I34)","v":""},"\"",{"$f":"SUBSTITUTE(C134,\",\",\".\")","v":""},"\", ",null,null,null,null,null,null,null,null,null,null,null,null,null,null,null,null,null,null,null,null,null,null,null,null,130,104,{"$f":"IF(B134<>\"\",B134,#N/A)","v":{"$error":"#N/A"}},{"$error":"#N/A"},{"$error":"#N/A"},{"$f":"AJ133","v":17.692074636799997},20.0502330556,16.5129954274,21.229312264999997,15.333916217999999,22.408391474399998,18.871153846199999,null,0,0,null,null,null,null,null,null,null,null,null,null,130,{"$error":"#N/A"},"","",{"$f":"IF(B134=\"\",\"\",1-BG134)","v":""},"",{"$f":"IF(B134=\"\",\"\",(2*BF134-1)*(LN(BI134)+LN(BG134)))","v":""},{"$error":"#N/A"}]
[0,"",{"$f":"IF(input!I35=\"\",\"\",input!I35)","v":""},"\"","","\", ",null,null,null,null,null,null,null,null,null,null,null,null,null,null,null,null,null,null,null,null,null,null,null,null,131,104,{"$error":"#N/A"},{"$error":"#N/A"},{"$error":"#N/A"},17.692074636799997,20.0502330556,16.5129954274,21.229312264999997,15.333916217999999,22.408391474399998,18.871153846199999,null,0,0,null,null,null,null,null,null,null,null,null,null,131,{"$error":"#N/A"},{"$f":"IF(B135=\"\",\"\",1+BF134)","v":""},"","","","",{"$error":"#N/A"}]
[0,"",{"$f":"IF(input!I36=\"\",\"\",input!I36)","v":""},"\"","","\", ",null,null,null,null,null,null,null,null,null,null,null,null,null,null,null,null,null,null,null,null,null,null,null,null,132,104,{"$error":"#N/A"},{"$error":"#N/A"},{"$error":"#N/A"},17.692074636799997,20.0502330556,16.5129954274,21.229312264999997,15.333916217999999,22.408391474399998,18.871153846199999,null,0,0,null,null,null,null,null,null,null,null,null,null,132,{"$error":"#N/A"},"","","","","",{"$error":"#N/A"}]
[0,"",{"$f":"IF(input!I37=\"\",\"\",input!I37)","v":""},"\"","","\", ",null,null,null,null,null,null,null,null,null,null,null,null,null,null,null,null,null,null,null,null,null,null,null,null,133,104,{"$error":"#N/A"},{"$error":"#N/A"},{"$error":"#N/A"},17.692074636799997,20.0502330556,16.5129954274,21.229312264999997,15.333916217999999,22.408391474399998,18.871153846199999,null,0,0,null,null,null,null,null,null,null,null,null,null,133,{"$error":"#N/A"},"","","","","",{"$error":"#N/A"}]
[0,"",{"$f":"IF(input!I38=\"\",\"\",input!I38)","v":""},"\"","","\", ",null,null,null,null,null,null,null,null,null,null,null,null,null,null,null,null,null,null,null,null,null,null,null,null,134,104,{"$error":"#N/A"},{"$error":"#N/A"},{"$error":"#N/A"},17.692074636799997,20.0502330556,16.5129954274,21.229312264999997,15.333916217999999,22.408391474399998,18.871153846199999,null,0,0,null,null,null,null,null,null,null,null,null,null,134,{"$error":"#N/A"},"","","","","",{"$error":"#N/A"}]
[0,"",{"$f":"IF(input!I39=\"\",\"\",input!I39)","v":""},"\"","","\", ",null,null,null,null,null,null,null,null,null,null,null,null,null,null,null,null,null,null,null,null,null,null,null,null,135,104,{"$error":"#N/A"},{"$error":"#N/A"},{"$error":"#N/A"},17.692074636799997,20.0502330556,16.5129954274,21.229312264999997,15.333916217999999,22.408391474399998,18.871153846199999,null,0,0,null,null,null,null,null,null,null,null,null,null,135,{"$error":"#N/A"},"","","","","",{"$error":"#N/A"}]
[0,"",{"$f":"IF(input!I40=\"\",\"\",input!I40)","v":""},"\"","","\", ",null,null,null,null,null,null,null,null,null,null,null,null,null,null,null,null,null,null,null,null,null,null,null,null,136,104,{"$error":"#N/A"},{"$error":"#N/A"},{"$error":"#N/A"},17.692074636799997,20.0502330556,16.5129954274,21.229312264999997,15.333916217999999,22.408391474399998,18.871153846199999,null,0,0,null,null,null,null,null,null,null,null,null,null,136,{"$error":"#N/A"},"","","","","",{"$error":"#N/A"}]
[0,"",{"$f":"IF(input!I41=\"\",\"\",input!I41)","v":""},"\"","","\", ",null,null,null,null,null,null,null,null,null,null,null,null,null,null,null,null,null,null,null,null,null,null,null,null,137,104,{"$error":"#N/A"},{"$error":"#N/A"},{"$error":"#N/A"},17.692074636799997,20.0502330556,16.5129954274,21.229312264999997,15.333916217999999,22.408391474399998,18.871153846199999,null,0,0,null,null,null,null,null,null,null,null,null,null,137,{"$error":"#N/A"},"","","","","",{"$error":"#N/A"}]
[0,"",{"$f":"IF(input!I42=\"\",\"\",input!I42)","v":""},"\"","","\", ",null,null,null,null,null,null,null,null,null,null,null,null,null,null,null,null,null,null,null,null,null,null,null,null,138,104,{"$error":"#N/A"},{"$error":"#N/A"},{"$error":"#N/A"},17.692074636799997,20.0502330556,16.5129954274,21.229312264999997,15.333916217999999,22.408391474399998,18.871153846199999,null,0,0,null,null,null,null,null,null,null,null,null,null,138,{"$error":"#N/A"},"","","","","",{"$error":"#N/A"}]
[0,"",{"$f":"IF(input!I43=\"\",\"\",input!I43)","v":""},"\"","","\", ",null,null,null,null,null,null,null,null,null,null,null,null,null,null,null,null,null,null,null,null,null,null,null,null,139,104,{"$error":"#N/A"},{"$error":"#N/A"},{"$error":"#N/A"},17.692074636799997,20.0502330556,16.5129954274,21.229312264999997,15.333916217999999,22.408391474399998,18.871153846199999,null,0,0,null,null,null,null,null,null,null,null,null,null,139,{"$error":"#N/A"},"","","","","",{"$error":"#N/A"}]
[0,"",{"$f":"IF(input!I44=\"\",\"\",input!I44)","v":""},"\"","","\", ",null,null,null,null,null,null,null,null,null,null,null,null,null,null,null,null,null,null,null,null,null,null,null,null,140,104,{"$error":"#N/A"},{"$error":"#N/A"},{"$error":"#N/A"},17.692074636799997,20.0502330556,16.5129954274,21.229312264999997,15.333916217999999,22.408391474399998,18.871153846199999,null,0,0,null,null,null,null,null,null,null,null,null,null,140,{"$error":"#N/A"},"","","","","",{"$error":"#N/A"}]
[0,"",{"$f":"IF(input!I45=\"\",\"\",input!I45)","v":""},"\"","","\", ",null,null,null,null,null,null,null,null,null,null,null,null,null,null,null,null,null,null,null,null,null,null,null,null,141,104,{"$error":"#N/A"},{"$error":"#N/A"},{"$error":"#N/A"},17.692074636799997,20.0502330556,16.5129954274,21.229312264999997,15.333916217999999,22.408391474399998,18.871153846199999,null,0,0,null,null,null,null,null,null,null,null,null,null,141,{"$error":"#N/A"},"","","","","",{"$error":"#N/A"}]
[0,"",{"$f":"IF(input!I46=\"\",\"\",input!I46)","v":""},"\"","","\", ",null,null,null,null,null,null,null,null,null,null,null,null,null,null,null,null,null,null,null,null,null,null,null,null,142,104,{"$error":"#N/A"},{"$error":"#N/A"},{"$error":"#N/A"},17.692074636799997,20.0502330556,16.5129954274,21.229312264999997,15.333916217999999,22.408391474399998,18.871153846199999,null,0,0,null,null,null,null,null,null,null,null,null,null,142,{"$error":"#N/A"},"","","","","",{"$error":"#N/A"}]
[0,"",{"$f":"IF(input!I47=\"\",\"\",input!I47)","v":""},"\"","","\", ",null,null,null,null,null,null,null,null,null,null,null,null,null,null,null,null,null,null,null,null,null,null,null,null,143,104,{"$error":"#N/A"},{"$error":"#N/A"},{"$error":"#N/A"},17.692074636799997,20.0502330556,16.5129954274,21.229312264999997,15.333916217999999,22.408391474399998,18.871153846199999,null,0,0,null,null,null,null,null,null,null,null,null,null,143,{"$error":"#N/A"},"","","","","",{"$error":"#N/A"}]
[0,"",{"$f":"IF(input!I48=\"\",\"\",input!I48)","v":""},"\"","","\", ",null,null,null,null,null,null,null,null,null,null,null,null,null,null,null,null,null,null,null,null,null,null,null,null,144,104,{"$error":"#N/A"},{"$error":"#N/A"},{"$error":"#N/A"},17.692074636799997,20.0502330556,16.5129954274,21.229312264999997,15.333916217999999,22.408391474399998,18.871153846199999,null,0,0,null,null,null,null,null,null,null,null,null,null,144,{"$error":"#N/A"},"","","","","",{"$error":"#N/A"}]
[0,"",{"$f":"IF(input!I49=\"\",\"\",input!I49)","v":""},"\"","","\", ",null,null,null,null,null,null,null,null,null,null,null,null,null,null,null,null,null,null,null,null,null,null,null,null,145,104,{"$error":"#N/A"},{"$error":"#N/A"},{"$error":"#N/A"},17.692074636799997,20.0502330556,16.5129954274,21.229312264999997,15.333916217999999,22.408391474399998,18.871153846199999,null,0,0,null,null,null,null,null,null,null,null,null,null,145,{"$error":"#N/A"},"","","","","",{"$error":"#N/A"}]
[0,"",{"$f":"IF(input!I50=\"\",\"\",input!I50)","v":""},"\"","","\", ",null,null,null,null,null,null,null,null,null,null,null,null,null,null,null,null,null,null,null,null,null,null,null,null,146,104,{"$error":"#N/A"},{"$error":"#N/A"},{"$error":"#N/A"},{"$f":"AJ149","v":17.692074636799997},20.0502330556,16.5129954274,21.229312264999997,15.333916217999999,22.408391474399998,18.871153846199999,null,0,0,null,null,null,null,null,null,null,null,null,null,146,{"$error":"#N/A"},"","","","","",{"$error":"#N/A"}]
[0,"",{"$f":"IF(input!I51=\"\",\"\",input!I51)","v":""},"\"","","\", ",null,null,null,null,null,null,null,null,null,null,null,null,null,null,null,null,null,null,null,null,null,null,null,null,147,104,{"$error":"#N/A"},{"$error":"#N/A"},{"$error":"#N/A"},17.692074636799997,20.0502330556,16.5129954274,21.229312264999997,15.333916217999999,22.408391474399998,18.871153846199999,null,0,0,null,null,null,null,null,null,null,null,null,null,147,{"$error":"#N/A"},"","","","","",{"$error":"#N/A"}]
[0,"",{"$f":"IF(input!I52=\"\",\"\",input!I52)","v":""},"\"","","\", ",null,null,null,null,null,null,null,null,null,null,null,null,null,null,null,null,null,null,null,null,null,null,null,null,148,104,{"$error":"#N/A"},{"$error":"#N/A"},{"$error":"#N/A"},17.692074636799997,20.0502330556,16.5129954274,21.229312264999997,15.333916217999999,22.408391474399998,18.871153846199999,null,0,0,null,null,null,null,null,null,null,null,null,null,148,{"$error":"#N/A"},"","","","","",{"$error":"#N/A"}]
[0,"",{"$f":"IF(input!I53=\"\",\"\",input!I53)","v":""},"\"","","\", ",null,null,null,null,null,null,null,null,null,null,null,null,null,null,null,null,null,null,null,null,null,null,null,null,149,104,{"$error":"#N/A"},{"$error":"#N/A"},{"$error":"#N/A"},17.692074636799997,20.0502330556,16.5129954274,21.229312264999997,15.333916217999999,22.408391474399998,18.871153846199999,null,0,0,null,null,null,null,null,null,null,null,null,null,149,{"$error":"#N/A"},"","","","","",{"$error":"#N/A"}]
[0,"",{"$f":"IF(input!I54=\"\",\"\",input!I54)","v":""},"\"","","\", ",null,null,null,null,null,null,null,null,null,null,null,null,null,null,null,null,null,null,null,null,null,null,null,null,150,104,{"$error":"#N/A"},{"$error":"#N/A"},{"$error":"#N/A"},17.692074636799997,20.0502330556,16.5129954274,21.229312264999997,15.333916217999999,22.408391474399998,18.871153846199999,null,0,0,null,null,null,null,null,null,null,null,null,null,150,{"$error":"#N/A"},"","","","","",{"$error":"#N/A"}]
[0,"",{"$f":"IF(input!L5=\"\",\"\",input!L5)","v":""},"\"","","\", ",null,null,null,null,null,null,null,null,null,null,null,null,null,null,null,null,null,null,null,null,null,null,null,null,151,104,{"$error":"#N/A"},{"$error":"#N/A"},{"$error":"#N/A"},17.692074636799997,20.0502330556,16.5129954274,21.229312264999997,15.333916217999999,22.408391474399998,18.871153846199999,null,0,0,null,null,null,null,null,null,null,null,null,null,151,{"$error":"#N/A"},"","","","","",{"$error":"#N/A"}]
[0,"",{"$f":"IF(input!L6=\"\",\"\",input!L6)","v":""},"\"","","\", ",null,null,null,null,null,null,null,null,null,null,null,null,null,null,null,null,null,null,null,null,null,null,null,null,152,104,{"$error":"#N/A"},{"$error":"#N/A"},{"$error":"#N/A"},17.692074636799997,20.0502330556,16.5129954274,21.229312264999997,15.333916217999999,22.408391474399998,18.871153846199999,null,0,0,null,null,null,null,null,null,null,null,null,null,152,{"$error":"#N/A"},"","","","","",{"$error":"#N/A"}]
[0,"",{"$f":"IF(input!L7=\"\",\"\",input!L7)","v":""},"\"","","\", ",null,null,null,null,null,null,null,null,null,null,null,null,null,null,null,null,null,null,null,null,null,null,null,null,153,104,{"$error":"#N/A"},{"$error":"#N/A"},{"$error":"#N/A"},17.692074636799997,20.0502330556,16.5129954274,21.229312264999997,15.333916217999999,22.408391474399998,18.871153846199999,null,0,0,null,null,null,null,null,null,null,null,null,null,153,{"$error":"#N/A"},"","","","","",{"$error":"#N/A"}]
[0,"",{"$f":"IF(input!L8=\"\",\"\",input!L8)","v":""},"\"","","\", ",null,null,null,null,null,null,null,null,null,null,null,null,null,null,null,null,null,null,null,null,null,null,null,null,154,104,{"$error":"#N/A"},{"$error":"#N/A"},{"$error":"#N/A"},17.692074636799997,20.0502330556,16.5129954274,21.229312264999997,15.333916217999999,22.408391474399998,18.871153846199999,null,0,0,null,null,null,null,null,null,null,null,null,null,154,{"$error":"#N/A"},"","","","","",{"$error":"#N/A"}]
[0,"",{"$f":"IF(input!L9=\"\",\"\",input!L9)","v":""},"\"","","\", ",null,null,null,null,null,null,null,null,null,null,null,null,null,null,null,null,null,null,null,null,null,null,null,null,155,104,{"$error":"#N/A"},{"$error":"#N/A"},{"$error":"#N/A"},17.692074636799997,20.0502330556,16.5129954274,21.229312264999997,15.333916217999999,22.408391474399998,18.871153846199999,null,0,0,null,null,null,null,null,null,null,null,null,null,155,{"$error":"#N/A"},"","","","","",{"$error":"#N/A"}]
[0,"",{"$f":"IF(input!L10=\"\",\"\",input!L10)","v":""},"\"","","\", ",null,null,null,null,null,null,null,null,null,null,null,null,null,null,null,null,null,null,null,null,null,null,null,null,156,104,{"$error":"#N/A"},{"$error":"#N/A"},{"$error":"#N/A"},17.692074636799997,20.0502330556,16.5129954274,21.229312264999997,15.333916217999999,22.408391474399998,18.871153846199999,null,0,0,null,null,null,null,null,null,null,null,null,null,156,{"$error":"#N/A"},"","","","","",{"$error":"#N/A"}]
[0,"",{"$f":"IF(input!L11=\"\",\"\",input!L11)","v":""},"\"","","\", ",null,null,null,null,null,null,null,null,null,null,null,null,null,null,null,null,null,null,null,null,null,null,null,null,157,104,{"$error":"#N/A"},{"$error":"#N/A"},{"$error":"#N/A"},17.692074636799997,20.0502330556,16.5129954274,21.229312264999997,15.333916217999999,22.408391474399998,18.871153846199999,null,0,0,null,null,null,null,null,null,null,null,null,null,157,{"$error":"#N/A"},"","","","","",{"$error":"#N/A"}]
[0,"",{"$f":"IF(input!L12=\"\",\"\",input!L12)","v":""},"\"","","\", ",null,null,null,null,null,null,null,null,null,null,null,null,null,null,null,null,null,null,null,null,null,null,null,null,158,104,{"$error":"#N/A"},{"$error":"#N/A"},{"$error":"#N/A"},17.692074636799997,20.0502330556,16.5129954274,21.229312264999997,15.333916217999999,22.408391474399998,18.871153846199999,null,0,0,null,null,null,null,null,null,null,null,null,null,158,{"$error":"#N/A"},"","","","","",{"$error":"#N/A"}]
[0,"",{"$f":"IF(input!L13=\"\",\"\",input!L13)","v":""},"\"","","\", ",null,null,null,null,null,null,null,null,null,null,null,null,null,null,null,null,null,null,null,null,null,null,null,null,159,104,{"$error":"#N/A"},{"$error":"#N/A"},{"$error":"#N/A"},17.692074636799997,20.0502330556,16.5129954274,21.229312264999997,15.333916217999999,22.408391474399998,18.871153846199999,null,0,0,null,null,null,null,null,null,null,null,null,null,159,{"$error":"#N/A"},"","","","","",{"$error":"#N/A"}]
[0,"",{"$f":"IF(input!L14=\"\",\"\",input!L14)","v":""},"\"","","\", ",null,null,null,null,null,null,null,null,null,null,null,null,null,null,null,null,null,null,null,null,null,null,null,null,160,104,{"$error":"#N/A"},{"$error":"#N/A"},{"$error":"#N/A"},17.692074636799997,20.0502330556,16.5129954274,21.229312264999997,15.333916217999999,22.408391474399998,18.871153846199999,null,0,0,null,null,null,null,null,null,null,null,null,null,160,{"$error":"#N/A"},"","","","","",{"$error":"#N/A"}]
[0,"",{"$f":"IF(input!L15=\"\",\"\",input!L15)","v":""},"\"","","\", ",null,null,null,null,null,null,null,null,null,null,null,null,null,null,null,null,null,null,null,null,null,null,null,null,161,{"$f":"IF((Anzahl>AE165),AE165,Anzahl)","v":104},{"$error":"#N/A"},{"$f":"IF(OGW=\"\",#N/A,IF(B165<>\"\",OGW,#N/A))","v":{"$error":"#N/A"}},{"$f":"IF(UGW=\"\",#N/A,IF(B165<>\"\",UGW,#N/A))","v":{"$error":"#N/A"}},17.692074636799997,20.0502330556,16.5129954274,21.229312264999997,15.333916217999999,22.408391474399998,18.871153846199999,null,{"$f":"IF(AND(B165<>\"\",B165<UGW),1,0)","v":0},{"$f":"IF(AND(B165<>\"\",B165>OGW),1,0)","v":0},null,null,null,null,null,null,null,null,null,null,161,{"$f":"IF(B165=\"\",NA(),SMALL(xi,BF165))","v":{"$error":"#N/A"}},"",{"$f":"IF(B165=\"\",\"\",NORMSDIST((BE165-fxds)/Standardabweichung))","v":""},"",{"$f":"IF(IF(B165=\"\",\"\",SMALL(BG,BF165))=0,0.0001,IF(B165=\"\",\"\",SMALL(BG,BF165)))","v":""},"",{"$f":"IF(B165=\"\",NA(),NORMSINV((BF165-0.3)/(Anzahl+0.4)))","v":{"$error":"#N/A"}}]
[0,"",{"$f":"IF(input!L16=\"\",\"\",input!L16)","v":""},"\"","","\", ",null,null,null,null,null,null,null,null,null,null,null,null,null,null,null,null,null,null,null,null,null,null,null,null,162,104,{"$error":"#N/A"},{"$error":"#N/A"},{"$error":"#N/A"},{"$f":"AJ165","v":17.692074636799997},20.0502330556,16.5129954274,21.229312264999997,15.333916217999999,22.408391474399998,18.871153846199999,null,0,0,null,null,null,null,null,null,null,null,null,null,162,{"$error":"#N/A"},"","","","","",{"$error":"#N/A"}]
[0,"",{"$f":"IF(input!L17=\"\",\"\",input!L17)","v":""},"\"","","\", ",null,null,null,null,null,null,null,null,null,null,null,null,null,null,null,null,null,null,null,null,null,null,null,null,163,104,{"$error":"#N/A"},{"$error":"#N/A"},{"$error":"#N/A"},17.692074636799997,20.0502330556,16.5129954274,21.229312264999997,15.333916217999999,22.408391474399998,18.871153846199999,null,0,0,null,null,null,null,null,null,null,null,null,null,163,{"$error":"#N/A"},"","","","","",{"$error":"#N/A"}]
[0,"",{"$f":"IF(input!L18=\"\",\"\",input!L18)","v":""},"\"","","\", ",null,null,null,null,null,null,null,null,null,null,null,null,null,null,null,null,null,null,null,null,null,null,null,null,164,104,{"$error":"#N/A"},{"$error":"#N/A"},{"$error":"#N/A"},17.692074636799997,20.0502330556,16.5129954274,21.229312264999997,15.333916217999999,22.408391474399998,18.871153846199999,null,0,0,null,null,null,null,null,null,null,null,null,null,164,{"$error":"#N/A"},"","","","","",{"$error":"#N/A"}]
[0,"",{"$f":"IF(input!L19=\"\",\"\",input!L19)","v":""},"\"","","\", ",null,null,null,null,null,null,null,null,null,null,null,null,null,null,null,null,null,null,null,null,null,null,null,null,165,104,{"$error":"#N/A"},{"$error":"#N/A"},{"$error":"#N/A"},17.692074636799997,20.0502330556,16.5129954274,21.229312264999997,15.333916217999999,22.408391474399998,18.871153846199999,null,0,0,null,null,null,null,null,null,null,null,null,null,165,{"$error":"#N/A"},"","","","","",{"$error":"#N/A"}]
[0,"",{"$f":"IF(input!L20=\"\",\"\",input!L20)","v":""},"\"","","\", ",null,null,null,null,null,null,null,null,null,null,null,null,null,null,null,null,null,null,null,null,null,null,null,null,166,104,{"$error":"#N/A"},{"$error":"#N/A"},{"$error":"#N/A"},17.692074636799997,20.0502330556,16.5129954274,21.229312264999997,15.333916217999999,22.408391474399998,18.871153846199999,null,0,0,null,null,null,null,null,null,null,null,null,null,166,{"$error":"#N/A"},"","","","","",{"$error":"#N/A"}]
[0,"",{"$f":"IF(input!L21=\"\",\"\",input!L21)","v":""},"\"","","\", ",null,null,null,null,null,null,null,null,null,null,null,null,null,null,null,null,null,null,null,null,null,null,null,null,167,104,{"$error":"#N/A"},{"$error":"#N/A"},{"$error":"#N/A"},17.692074636799997,20.0502330556,16.5129954274,21.229312264999997,15.333916217999999,22.408391474399998,18.871153846199999,null,0,0,null,null,null,null,null,null,null,null,null,null,167,{"$error":"#N/A"},"","","","","",{"$error":"#N/A"}]
[0,"",{"$f":"IF(input!L22=\"\",\"\",input!L22)","v":""},"\"","","\", ",null,null,null,null,null,null,null,null,null,null,null,null,null,null,null,null,null,null,null,null,null,null,null,null,168,104,{"$error":"#N/A"},{"$error":"#N/A"},{"$error":"#N/A"},17.692074636799997,20.0502330556,16.5129954274,21.229312264999997,15.333916217999999,22.408391474399998,18.871153846199999,null,0,0,null,null,null,null,null,null,null,null,null,null,168,{"$error":"#N/A"},"","","","","",{"$error":"#N/A"}]
[0,"",{"$f":"IF(input!L23=\"\",\"\",input!L23)","v":""},"\"","","\", ",null,null,null,null,null,null,null,null,null,null,null,null,null,null,null,null,null,null,null,null,null,null,null,null,169,104,{"$error":"#N/A"},{"$error":"#N/A"},{"$error":"#N/A"},17.692074636799997,20.0502330556,16.5129954274,21.229312264999997,15.333916217999999,22.408391474399998,18.871153846199999,null,0,0,null,null,null,null,null,null,null,null,null,null,169,{"$error":"#N/A"},"","","","","",{"$error":"#N/A"}]
[0,"",{"$f":"IF(input!L24=\"\",\"\",input!L24)","v":""},"\"","","\", ",null,null,null,null,null,null,null,null,null,null,null,null,null,null,null,null,null,null,null,null,null,null,null,null,170,104,{"$error":"#N/A"},{"$error":"#N/A"},{"$error":"#N/A"},17.692074636799997,20.0502330556,16.5129954274,21.229312264999997,15.333916217999999,22.408391474399998,18.871153846199999,null,0,0,null,null,null,null,null,null,null,null,null,null,170,{"$error":"#N/A"},"","","","","",{"$error":"#N/A"}]
[0,"",{"$f":"IF(input!L25=\"\",\"\",input!L25)","v":""},"\"","","\", ",null,null,null,null,null,null,null,null,null,null,null,null,null,null,null,null,null,null,null,null,null,null,null,null,171,104,{"$error":"#N/A"},{"$error":"#N/A"},{"$error":"#N/A"},17.692074636799997,20.0502330556,16.5129954274,21.229312264999997,15.333916217999999,22.408391474399998,18.871153846199999,null,0,0,null,null,null,null,null,null,null,null,null,null,171,{"$error":"#N/A"},"","","","","",{"$error":"#N/A"}]
[0,"",{"$f":"IF(input!L26=\"\",\"\",input!L26)","v":""},"\"","","\", ",null,null,null,null,null,null,null,null,null,null,null,null,null,null,null,null,null,null,null,null,null,null,null,null,172,104,{"$error":"#N/A"},{"$error":"#N/A"},{"$error":"#N/A"},17.692074636799997,20.0502330556,16.5129954274,21.229312264999997,15.333916217999999,22.408391474399998,18.871153846199999,null,0,0,null,null,null,null,null,null,null,null,null,null,172,{"$error":"#N/A"},"","","","","",{"$error":"#N/A"}]
[0,"",{"$f":"IF(input!L27=\"\",\"\",input!L27)","v":""},"\"","","\", ",null,null,null,null,null,null,null,null,null,null,null,null,null,null,null,null,null,null,null,null,null,null,null,null,173,104,{"$error":"#N/A"},{"$error":"#N/A"},{"$error":"#N/A"},17.692074636799997,20.0502330556,16.5129954274,21.229312264999997,15.333916217999999,22.408391474399998,18.871153846199999,null,0,0,null,null,null,null,null,null,null,null,null,null,173,{"$error":"#N/A"},"","","","","",{"$error":"#N/A"}]
[0,"",{"$f":"IF(input!L28=\"\",\"\",input!L28)","v":""},"\"","","\", ",null,null,null,null,null,null,null,null,null,null,null,null,null,null,null,null,null,null,null,null,null,null,null,null,174,104,{"$error":"#N/A"},{"$error":"#N/A"},{"$error":"#N/A"},17.692074636799997,20.0502330556,16.5129954274,21.229312264999997,15.333916217999999,22.408391474399998,18.871153846199999,null,0,0,null,null,null,null,null,null,null,null,null,null,174,{"$error":"#N/A"},"","","","","",{"$error":"#N/A"}]
[0,"",{"$f":"IF(input!L29=\"\",\"\",input!L29)","v":""},"\"","","\", ",null,null,null,null,null,null,null,null,null,null,null,null,null,null,null,null,null,null,null,null,null,null,null,null,175,104,{"$error":"#N/A"},{"$error":"#N/A"},{"$error":"#N/A"},17.692074636799997,20.0502330556,16.5129954274,21.229312264999997,15.333916217999999,22.408391474399998,18.871153846199999,null,0,0,null,null,null,null,null,null,null,null,null,null,175,{"$error":"#N/A"},"","","","","",{"$error":"#N/A"}]
[0,"",{"$f":"IF(input!L30=\"\",\"\",input!L30)","v":""},"\"","","\", ",null,null,null,null,null,null,null,null,null,null,null,null,null,null,null,null,null,null,null,null,null,null,null,null,176,104,{"$error":"#N/A"},{"$error":"#N/A"},{"$error":"#N/A"},17.692074636799997,20.0502330556,16.5129954274,21.229312264999997,15.333916217999999,22.408391474399998,18.871153846199999,null,0,0,null,null,null,null,null,null,null,null,null,null,176,{"$error":"#N/A"},"","","","","",{"$error":"#N/A"}]
[0,"",{"$f":"IF(input!L31=\"\",\"\",input!L31)","v":""},"\"","","\", ",null,null,null,null,null,null,null,null,null,null,null,null,null,null,null,null,null,null,null,null,null,null,null,null,177,104,{"$error":"#N/A"},{"$error":"#N/A"},{"$error":"#N/A"},17.692074636799997,20.0502330556,16.5129954274,21.229312264999997,15.333916217999999,22.408391474399998,18.871153846199999,null,0,0,null,null,null,null,null,null,null,null,null,null,177,{"$error":"#N/A"},"","","","","",{"$error":"#N/A"}]
[0,"",{"$f":"IF(input!L32=\"\",\"\",input!L32)","v":""},"\"","","\", ",null,null,null,null,null,null,null,null,null,null,null,null,null,null,null,null,null,null,null,null,null,null,null,null,178,104,{"$error":"#N/A"},{"$error":"#N/A"},{"$error":"#N/A"},{"$f":"AJ181","v":17.692074636799997},20.0502330556,16.5129954274,21.229312264999997,15.333916217999999,22.408391474399998,18.871153846199999,null,0,0,null,null,null,null,null,null,null,null,null,null,178,{"$error":"#N/A"},"","","","","",{"$error":"#N/A"}]
[0,"",{"$f":"IF(input!L33=\"\",\"\",input!L33)","v":""},"\"","","\", ",null,null,null,null,null,null,null,null,null,null,null,null,null,null,null,null,null,null,null,null,null,null,null,null,179,104,{"$error":"#N/A"},{"$error":"#N/A"},{"$error":"#N/A"},17.692074636799997,20.0502330556,16.5129954274,21.229312264999997,15.333916217999999,22.408391474399998,18.871153846199999,null,0,0,null,null,null,null,null,null,null,null,null,null,179,{"$error":"#N/A"},"","","","","",{"$error":"#N/A"}]
[0,"",{"$f":"IF(input!L34=\"\",\"\",input!L34)","v":""},"\"","","\", ",null,null,null,null,null,null,null,null,null,null,null,null,null,null,null,null,null,null,null,null,null,null,null,null,180,104,{"$error":"#N/A"},{"$error":"#N/A"},{"$error":"#N/A"},17.692074636799997,20.0502330556,16.5129954274,21.229312264999997,15.333916217999999,22.408391474399998,18.871153846199999,null,0,0,null,null,null,null,null,null,null,null,null,null,180,{"$error":"#N/A"},"","","","","",{"$error":"#N/A"}]
[0,"",{"$f":"IF(input!L35=\"\",\"\",input!L35)","v":""},"\"","","\", ",null,null,null,null,null,null,null,null,null,null,null,null,null,null,null,null,null,null,null,null,null,null,null,null,181,104,{"$error":"#N/A"},{"$error":"#N/A"},{"$error":"#N/A"},17.692074636799997,20.0502330556,16.5129954274,21.229312264999997,15.333916217999999,22.408391474399998,18.871153846199999,null,0,0,null,null,null,null,null,null,null,null,null,null,181,{"$error":"#N/A"},"","","","","",{"$error":"#N/A"}]
[0,"",{"$f":"IF(input!L36=\"\",\"\",input!L36)","v":""},"\"","","\", ",null,null,null,null,null,null,null,null,null,null,null,null,null,null,null,null,null,null,null,null,null,null,null,null,182,104,{"$error":"#N/A"},{"$error":"#N/A"},{"$error":"#N/A"},17.692074636799997,20.0502330556,16.5129954274,21.229312264999997,15.333916217999999,22.408391474399998,18.871153846199999,null,0,0,null,null,null,null,null,null,null,null,null,null,182,{"$error":"#N/A"},"","","","","",{"$error":"#N/A"}]
[0,"",{"$f":"IF(input!L37=\"\",\"\",input!L37)","v":""},"\"","","\", ",null,null,null,null,null,null,null,null,null,null,null,null,null,null,null,null,null,null,null,null,null,null,null,null,183,104,{"$error":"#N/A"},{"$error":"#N/A"},{"$error":"#N/A"},17.692074636799997,20.0502330556,16.5129954274,21.229312264999997,15.333916217999999,22.408391474399998,18.871153846199999,null,0,0,null,null,null,null,null,null,null,null,null,null,183,{"$error":"#N/A"},"","","","","",{"$error":"#N/A"}]
[0,"",{"$f":"IF(input!L38=\"\",\"\",input!L38)","v":""},"\"","","\", ",null,null,null,null,null,null,null,null,null,null,null,null,null,null,null,null,null,null,null,null,null,null,null,null,184,104,{"$error":"#N/A"},{"$error":"#N/A"},{"$error":"#N/A"},17.692074636799997,20.0502330556,16.5129954274,21.229312264999997,15.333916217999999,22.408391474399998,18.871153846199999,null,0,0,null,null,null,null,null,null,null,null,null,null,184,{"$error":"#N/A"},"","","","","",{"$error":"#N/A"}]
[0,"",{"$f":"IF(input!L39=\"\",\"\",input!L39)","v":""},"\"","","\", ",null,null,null,null,null,null,null,null,null,null,null,null,null,null,null,null,null,null,null,null,null,null,null,null,185,104,{"$error":"#N/A"},{"$error":"#N/A"},{"$error":"#N/A"},17.692074636799997,20.0502330556,16.5129954274,21.229312264999997,15.333916217999999,22.408391474399998,18.871153846199999,null,0,0,null,null,null,null,null,null,null,null,null,null,185,{"$error":"#N/A"},"","","","","",{"$error":"#N/A"}]
[0,"",{"$f":"IF(input!L40=\"\",\"\",input!L40)","v":""},"\"","","\", ",null,null,null,null,null,null,null,null,null,null,null,null,null,null,null,null,null,null,null,null,null,null,null,null,186,104,{"$error":"#N/A"},{"$error":"#N/A"},{"$error":"#N/A"},17.692074636799997,20.0502330556,16.5129954274,21.229312264999997,15.333916217999999,22.408391474399998,18.871153846199999,null,0,0,null,null,null,null,null,null,null,null,null,null,186,{"$error":"#N/A"},"","","","","",{"$error":"#N/A"}]
[0,"",{"$f":"IF(input!L41=\"\",\"\",input!L41)","v":""},"\"","","\", ",null,null,null,null,null,null,null,null,null,null,null,null,null,null,null,null,null,null,null,null,null,null,null,null,187,104,{"$error":"#N/A"},{"$error":"#N/A"},{"$error":"#N/A"},17.692074636799997,20.0502330556,16.5129954274,21.229312264999997,15.333916217999999,22.408391474399998,18.871153846199999,null,0,0,null,null,null,null,null,null,null,null,null,null,187,{"$error":"#N/A"},"","","","","",{"$error":"#N/A"}]
[0,"",{"$f":"IF(input!L42=\"\",\"\",input!L42)","v":""},"\"","","\", ",null,null,null,null,null,null,null,null,null,null,null,null,null,null,null,null,null,null,null,null,null,null,null,null,188,104,{"$error":"#N/A"},{"$error":"#N/A"},{"$error":"#N/A"},17.692074636799997,20.0502330556,16.5129954274,21.229312264999997,15.333916217999999,22.408391474399998,18.871153846199999,null,0,0,null,null,null,null,null,null,null,null,null,null,188,{"$error":"#N/A"},"","","","","",{"$error":"#N/A"}]
[0,"",{"$f":"IF(input!L43=\"\",\"\",input!L43)","v":""},"\"","","\", ",null,null,null,null,null,null,null,null,null,null,null,null,null,null,null,null,null,null,null,null,null,null,null,null,189,104,{"$error":"#N/A"},{"$error":"#N/A"},{"$error":"#N/A"},17.692074636799997,20.0502330556,16.5129954274,21.229312264999997,15.333916217999999,22.408391474399998,18.871153846199999,null,0,0,null,null,null,null,null,null,null,null,null,null,189,{"$error":"#N/A"},"","","","","",{"$error":"#N/A"}]
[0,"",{"$f":"IF(input!L44=\"\",\"\",input!L44)","v":""},"\"","","\", ",null,null,null,null,null,null,null,null,null,null,null,null,null,null,null,null,null,null,null,null,null,null,null,null,190,104,{"$error":"#N/A"},{"$error":"#N/A"},{"$error":"#N/A"},17.692074636799997,20.0502330556,16.5129954274,21.229312264999997,15.333916217999999,22.408391474399998,18.871153846199999,null,0,0,null,null,null,null,null,null,null,null,null,null,190,{"$error":"#N/A"},"","","","","",{"$error":"#N/A"}]
[0,"",{"$f":"IF(input!L45=\"\",\"\",input!L45)","v":""},"\"","","\", ",null,null,null,null,null,null,null,null,null,null,null,null,null,null,null,null,null,null,null,null,null,null,null,null,191,104,{"$error":"#N/A"},{"$error":"#N/A"},{"$error":"#N/A"},17.692074636799997,20.0502330556,16.5129954274,21.229312264999997,15.333916217999999,22.408391474399998,18.871153846199999,null,0,0,null,null,null,null,null,null,null,null,null,null,191,{"$error":"#N/A"},"","","","","",{"$error":"#N/A"}]
[0,"",{"$f":"IF(input!L46=\"\",\"\",input!L46)","v":""},"\"","","\", ",null,null,null,null,null,null,null,null,null,null,null,null,null,null,null,null,null,null,null,null,null,null,null,null,192,104,{"$error":"#N/A"},{"$error":"#N/A"},{"$error":"#N/A"},17.692074636799997,20.0502330556,16.5129954274,21.229312264999997,15.333916217999999,22.408391474399998,18.871153846199999,null,0,0,null,null,null,null,null,null,null,null,null,null,192,{"$error":"#N/A"},"","","","","",{"$error":"#N/A"}]
[0,"",{"$f":"IF(input!L47=\"\",\"\",input!L47)","v":""},"\"","","\", ",null,null,null,null,null,null,null,null,null,null,null,null,null,null,null,null,null,null,null,null,null,null,null,null,193,{"$f":"IF((Anzahl>AE197),AE197,Anzahl)","v":104},{"$error":"#N/A"},{"$f":"IF(OGW=\"\",#N/A,IF(B197<>\"\",OGW,#N/A))","v":{"$error":"#N/A"}},{"$f":"IF(UGW=\"\",#N/A,IF(B197<>\"\",UGW,#N/A))","v":{"$error":"#N/A"}},17.692074636799997,20.0502330556,16.5129954274,21.229312264999997,15.333916217999999,22.408391474399998,18.871153846199999,null,{"$f":"IF(AND(B197<>\"\",B197<UGW),1,0)","v":0},{"$f":"IF(AND(B197<>\"\",B197>OGW),1,0)","v":0},null,null,null,null,null,null,null,null,null,null,193,{"$f":"IF(B197=\"\",NA(),SMALL(xi,BF197))","v":{"$error":"#N/A"}},"",{"$f":"IF(B197=\"\",\"\",NORMSDIST((BE197-fxds)/Standardabweichung))","v":""},"",{"$f":"IF(IF(B197=\"\",\"\",SMALL(BG,BF197))=0,0.0001,IF(B197=\"\",\"\",SMALL(BG,BF197)))","v":""},"",{"$f":"IF(B197=\"\",NA(),NORMSINV((BF197-0.3)/(Anzahl+0.4)))","v":{"$error":"#N/A"}}]
[{"$f":"IF(B198=C198,0,1)","v":0},"",{"$f":"IF(input!L48=\"\",\"\",input!L48)","v":""},"\"",{"$f":"SUBSTITUTE(C198,\",\",\".\")","v":""},"\", ",null,null,null,null,null,null,null,null,null,null,null,null,null,null,null,null,null,null,null,null,null,null,null,null,194,104,{"$f":"IF(B198<>\"\",B198,#N/A)","v":{"$error":"#N/A"}},{"$error":"#N/A"},{"$error":"#N/A"},{"$f":"AJ197","v":17.692074636799997},20.0502330556,16.5129954274,21.229312264999997,15.333916217999999,22.408391474399998,18.871153846199999,null,0,0,null,null,null,null,null,null,null,null,null,null,194,{"$error":"#N/A"},"","",{"$f":"IF(B198=\"\",\"\",1-BG198)","v":""},"",{"$f":"IF(B198=\"\",\"\",(2*BF198-1)*(LN(BI198)+LN(BG198)))","v":""},{"$error":"#N/A"}]
[0,"",{"$f":"IF(input!L49=\"\",\"\",input!L49)","v":""},"\"","","\", ",null,null,null,null,null,null,null,null,null,null,null,null,null,null,null,null,null,null,null,null,null,null,null,null,195,104,{"$error":"#N/A"},{"$error":"#N/A"},{"$error":"#N/A"},17.692074636799997,20.0502330556,16.5129954274,21.229312264999997,15.333916217999999,22.408391474399998,18.871153846199999,null,0,0,null,null,null,null,null,null,null,null,null,null,195,{"$error":"#N/A"},{"$f":"IF(B199=\"\",\"\",1+BF198)","v":""},"","","","",{"$error":"#N/A"}]
[0,"",{"$f":"IF(input!L50=\"\",\"\",input!L50)","v":""},"\"","","\", ",null,null,null,null,null,null,null,null,null,null,null,null,null,null,null,null,null,null,null,null,null,null,null,null,196,104,{"$error":"#N/A"},{"$error":"#N/A"},{"$error":"#N/A"},17.692074636799997,20.0502330556,16.5129954274,21.229312264999997,15.333916217999999,22.408391474399998,18.871153846199999,null,0,0,null,null,null,null,null,null,null,null,null,null,196,{"$error":"#N/A"},"","","","","",{"$error":"#N/A"}]
[0,"",{"$f":"IF(input!L51=\"\",\"\",input!L51)","v":""},"\"","","\", ",null,null,null,null,null,null,null,null,null,null,null,null,null,null,null,null,null,null,null,null,null,null,null,null,197,104,{"$error":"#N/A"},{"$error":"#N/A"},{"$error":"#N/A"},17.692074636799997,20.0502330556,16.5129954274,21.229312264999997,15.333916217999999,22.408391474399998,18.871153846199999,null,0,0,null,null,null,null,null,null,null,null,null,null,197,{"$error":"#N/A"},"","","","","",{"$error":"#N/A"}]
[0,"",{"$f":"IF(input!L52=\"\",\"\",input!L52)","v":""},"\"","","\", ",null,null,null,null,null,null,null,null,null,null,null,null,null,null,null,null,null,null,null,null,null,null,null,null,198,104,{"$error":"#N/A"},{"$error":"#N/A"},{"$error":"#N/A"},17.692074636799997,20.0502330556,16.5129954274,21.229312264999997,15.333916217999999,22.408391474399998,18.871153846199999,null,0,0,null,null,null,null,null,null,null,null,null,null,198,{"$error":"#N/A"},"","","","","",{"$error":"#N/A"}]
[0,"",{"$f":"IF(input!L53=\"\",\"\",input!L53)","v":""},"\"","","\", ",null,null,null,null,null,null,null,null,null,null,null,null,null,null,null,null,null,null,null,null,null,null,null,null,199,104,{"$error":"#N/A"},{"$error":"#N/A"},{"$error":"#N/A"},17.692074636799997,20.0502330556,16.5129954274,21.229312264999997,15.333916217999999,22.408391474399998,18.871153846199999,null,0,0,null,null,null,null,null,null,null,null,null,null,199,{"$error":"#N/A"},"","","","","",{"$error":"#N/A"}]
[0,"",{"$f":"IF(input!L54=\"\",\"\",input!L54)","v":""},"\"","","\"",null,null,null,null,null,null,null,null,null,null,null,null,null,null,null,null,null,null,null,null,null,null,null,null,200,104,{"$error":"#N/A"},{"$error":"#N/A"},{"$error":"#N/A"},17.692074636799997,20.0502330556,16.5129954274,21.229312264999997,15.333916217999999,22.408391474399998,18.871153846199999,null,0,0,null,null,null,null,null,null,null,null,null,null,200,{"$error":"#N/A"},"","","","","",{"$error":"#N/A"}]
[null,null,null,null,null,null,null,null,null,null,null,null,null,null,null,null,null,null,null,null,null,null,null,null,null,null,null,null,null,null,null,null,null,null,null,null,null,null,null,null,null,null,"Summe",{"$f":"SUM(AR5:AR204)","v":0},{"$f":"SUM(AS5:AS204)","v":0}]
[]
[]
[]
[]
[{"$f":"SUM(A2:A208)","v":0}]

{"sheet":"info_setup","index":3,"n_rows":16,"n_cols":5,"rows_kept":16,"cut":false,"hidden":false,"merged":[]}
[]
[null,{"$f":"language!BX1","v":"buy the full licence"},"via mycommerce","or write to","roland.schnurr@sixsigmablackbelt.de"]
[]
[null,{"$f":"language!BC1","v":"language"}]
[null,{"$f":"language!BD1","v":"user -  email"},"max.mustermann@sixsigmablackbelt.de"]
[null,{"$f":"language!BE1","v":"user - key"},"AAABBB"]
[]
[null,{"$f":"language!BF1","v":"valid until"},{"$f":"calculation!I28","v":"01.12.2023"}]
[null,{"$f":"language!BG1","v":"note"},{"$f":"calculation!I29","v":"kostenlos"}]
[null,{"$f":"language!BH1","v":""}]
[null,{"$f":"language!BI1","v":"note"},{"$f":"calculation!H20","v":"ergebnisuservalidieren:user: max.mustermann@sixsigmablackbelt.de -> valid; cmk-> valid; licence key = AAABBB -> valid; date of licence; (2023-12-01) greater than today (2023-10-09) -> valid; calculation at 2023-10-09 22:40:13.802484; note: kostenlos"}]
[]
[]
[]
[null,{"$f":"language!BT1","v":"contact"},"roland.schnurr@sixsigmablackbelt.de"]
[null,{"$f":"language!BU1","v":"homepage"},"www.sixsigmablackbelt.de"]

{"sheet":"language","index":4,"n_rows":15,"n_cols":76,"rows_kept":15,"cut":false,"hidden":true,"merged":[]}
[null,2,{"$f":"VLOOKUP($B$1,$B$4:$CL$15,2,FALSE)","v":"process and machine capability"},{"$f":"VLOOKUP($B$1,$B$4:$CL$15,3,FALSE)","v":"value could be changed"},{"$f":"VLOOKUP($B$1,$B$4:$CL$15,4,FALSE)","v":"value is calculated"},{"$f":"VLOOKUP($B$1,$B$4:$CL$15,5,FALSE)","v":"part:"},{"$f":"VLOOKUP($B$1,$B$4:$CL$15,6,FALSE)","v":"part number:"},{"$f":"VLOOKUP($B$1,$B$4:$CL$15,7,FALSE)","v":"drawing:"},{"$f":"VLOOKUP($B$1,$B$4:$CL$15,8,FALSE)","v":"inspector:"},{"$f":"VLOOKUP($B$1,$B$4:$CL$15,9,FALSE)","v":"measuring dev:"},{"$f":"VLOOKUP($B$1,$B$4:$CL$15,10,FALSE)","v":"date:"},{"$f":"VLOOKUP($B$1,$B$4:$CL$15,11,FALSE)","v":"attribute:"},{"$f":"VLOOKUP($B$1,$B$4:$CL$15,12,FALSE)","v":"measuring unit:"},{"$f":"VLOOKUP($B$1,$B$4:$CL$15,13,FALSE)","v":"nominal value ="},{"$f":"VLOOKUP($B$1,$B$4:$CL$15,14,FALSE)","v":"lower spec. limit LSL"},{"$f":"VLOOKUP($B$1,$B$4:$CL$15,15,FALSE)","v":"upper spec. limit USL"},{"$f":"VLOOKUP($B$1,$B$4:$CL$15,16,FALSE)","v":"number of classes histogram"},{"$f":"VLOOKUP($B$1,$B$4:$CL$15,17,FALSE)","v":"Cpk<"},{"$f":"VLOOKUP($B$1,$B$4:$CL$15,18,FALSE)","v":"Cpk"},{"$f":"VLOOKUP($B$1,$B$4:$CL$15,19,FALSE)","v":"Cpk>"},{"$f":"VLOOKUP($B$1,$B$4:$CL$15,20,FALSE)","v":"between"},{"$f":"VLOOKUP($B$1,$B$4:$CL$15,21,FALSE)","v":"process not capable"},{"$f":"VLOOKUP($B$1,$B$4:$CL$15,22,FALSE)","v":"process limited capable"},{"$f":"VLOOKUP($B$1,$B$4:$CL$15,23,FALSE)","v":"process capable"},{"$f":"VLOOKUP($B$1,$B$4:$CL$15,24,FALSE)","v":"sample size"},{"$f":"VLOOKUP($B$1,$B$4:$CL$15,25,FALSE)","v":"mid"},{"$f":"VLOOKUP($B$1,$B$4:$CL$15,26,FALSE)","v":"standard deviation s"},{"$f":"VLOOKUP($B$1,$B$4:$CL$15,27,FALSE)","v":"values are according Andersson Darling test"},{"$f":"VLOOKUP($B$1,$B$4:$CL$15,28,FALSE)","v":"normal distributed"},{"$f":"VLOOKUP($B$1,$B$4:$CL$15,29,FALSE)","v":"not normal distributed"},{"$f":"VLOOKUP($B$1,$B$4:$CL$15,30,FALSE)","v":0},{"$f":"VLOOKUP($B$1,$B$4:$CL$15,31,FALSE)","v":"USL"},{"$f":"VLOOKUP($B$1,$B$4:$CL$15,32,FALSE)","v":"LSL"},{"$f":"VLOOKUP($B$1,$B$4:$CL$15,33,FALSE)","v":"random sample chronological"},{"$f":"VLOOKUP($B$1,$B$4:$CL$15,34,FALSE)","v":"histogram"},{"$f":"VLOOKUP($B$1,$B$4:$CL$15,35,FALSE)","v":"probability plot"},{"$f":"VLOOKUP($B$1,$B$4:$CL$15,36,FALSE)","v":0},{"$f":"VLOOKUP($B$1,$B$4:$CL$15,37,FALSE)","v":"Cpkl"},{"$f":"VLOOKUP($B$1,$B$4:$CL$15,38,FALSE)","v":"Cpku"},{"$f":"VLOOKUP($B$1,$B$4:$CL$15,39,FALSE)","v":"Cp"},{"$f":"VLOOKUP($B$1,$B$4:$CL$15,40,FALSE)","v":"Cpk"},{"$f":"VLOOKUP($B$1,$B$4:$CL$15,41,FALSE)","v":"probability values"},{"$f":"VLOOKUP($B$1,$B$4:$CL$15,42,FALSE)","v":"evaluation Cpk =>"},{"$f":"VLOOKUP($B$1,$B$4:$CL$15,43,FALSE)","v":"median"},{"$f":"VLOOKUP($B$1,$B$4:$CL$15,44,FALSE)","v":"range"},{"$f":"VLOOKUP($B$1,$B$4:$CL$15,45,FALSE)","v":"minimum"},{"$f":"VLOOKUP($B$1,$B$4:$CL$15,46,FALSE)","v":"maximum"},{"$f":"VLOOKUP($B$1,$B$4:$CL$15,47,FALSE)","v":"calculated performance"},{"$f":"VLOOKUP($B$1,$B$4:$CL$15,48,FALSE)","v":"exceedance"},{"$f":"VLOOKUP($B$1,$B$4:$CL$15,49,FALSE)","v":"pLSL"},{"$f":"VLOOKUP($B$1,$B$4:$CL$15,50,FALSE)","v":"pUSL"},{"$f":"VLOOKUP($B$1,$B$4:$CL$15,51,FALSE)","v":"p"},{"$f":"VLOOKUP($B$1,$B$4:$CL$15,52,FALSE)","v":"observed performance in ppm"},{"$f":"VLOOKUP($B$1,$B$4:$CL$15,53,FALSE)","v":0},{"$f":"VLOOKUP($B$1,$B$4:$CL$15,54,FALSE)","v":"language"},{"$f":"VLOOKUP($B$1,$B$4:$CL$15,55,FALSE)","v":"user -  email"},{"$f":"VLOOKUP($B$1,$B$4:$CL$15,56,FALSE)","v":"user - key"},{"$f":"VLOOKUP($B$1,$B$4:$CL$15,57,FALSE)","v":"valid until"},{"$f":"VLOOKUP($B$1,$B$4:$CL$15,58,FALSE)","v":"note"},{"$f":"VLOOKUP($B$1,$B$4:$CL$15,59,FALSE)","v":""},{"$f":"VLOOKUP($B$1,$B$4:$CL$15,60,FALSE)","v":"note"},{"$f":"VLOOKUP($B$1,$B$4:$CL$15,61,FALSE)","v":"The values are calculated"},{"$f":"VLOOKUP($B$1,$B$4:$CL$15,62,FALSE)","v":"Sie haben Werte verändert. Bitte kalkulieren"},{"$f":"VLOOKUP($B$1,$B$4:$CL$15,63,FALSE)","v":"If your measured value is one-sided limited, enter only the corresponding upper or lower limit value. With a one-sided limit, in the industrial environment only the Cpk is calclulated"},{"$f":"VLOOKUP($B$1,$B$4:$CL$15,64,FALSE)","v":"u-value"},{"$f":"VLOOKUP($B$1,$B$4:$CL$15,65,FALSE)","v":"+ 3 sigma"},{"$f":"VLOOKUP($B$1,$B$4:$CL$15,66,FALSE)","v":"- 3 sigma"},{"$f":"VLOOKUP($B$1,$B$4:$CL$15,67,FALSE)","v":"distribution"},{"$f":"VLOOKUP($B$1,$B$4:$CL$15,68,FALSE)","v":"help"},{"$f":"VLOOKUP($B$1,$B$4:$CL$15,69,FALSE)","v":"normal distribution"},{"$f":"VLOOKUP($B$1,$B$4:$CL$15,70,FALSE)","v":"truncated normal distribution"},{"$f":"VLOOKUP($B$1,$B$4:$CL$15,71,FALSE)","v":"contact"},{"$f":"VLOOKUP($B$1,$B$4:$CL$15,72,FALSE)","v":"homepage"},{"$f":"VLOOKUP($B$1,$B$4:$CL$15,73,FALSE)","v":"Without a valid licence, the calculation is limited to 20 values - More information (e.g. how to get a full licence) in the spreadsheet 'info_setup'. "},{"$f":"VLOOKUP($B$1,$B$4:$CL$15,74,FALSE)","v":"Licence not valid, the calculation is limited to 20 values - More information (e.g. how to get a full licence) in the spreadsheet 'info_setup'. "},{"$f":"VLOOKUP($B$1,$B$4:$CL$15,75,FALSE)","v":"buy the full licence"}]
["Sprache","Beschreibung",1,2,3,4,5,6,7,8,9,10,11,12,13,14,15,16,17,18,19,20,21,22,23,24,25,26,27,28,29,30,31,32,33,34,35,36,37,38,39,40,41,42,43,44,45,46,47,48,49,50,51,52,53,54,55,56,57,58,59,61,62,63,63,64,65,66,67,68,69,70,71,72,73,74]
["Tabelle",null,"input","input","input","input","input","input","input","input","input","input","input","input","input","input","input","input","input","input","input","input","input","input","input","input","input","input","input","input","input","input","input","input","input","input","input","input","input","input","input","input","input","input","input","input","input","input","input","input","input","input","input",null,"language","language","language","language","language","language","language","input","input","input","input","input","input","input","info_setup","input","input","info_setup","info_setup","input","licence","licence"]
[null,"Zelle","O2","O4","O5","N7","N8","N9","N10","N11","N12","N13","N14","N15","N16","N17","N18","N19","N20","N21","O20","P19","P20","P21","N23","N24","N25","N26","P26","P26",null,"Diagramm","Diagramm","Diagramm","Diagramm","Diagramm",null,"O30","O31","O32","O33","N30","N34","N36","N37","N38","N39","N41","N42","O42","O43","O44","N46",null,"B4","B5","B6","B7","B8","B9","B10","AB2","AB2","R48","Diagramm","Diagramm","Diagramm","N22","Verteilung","Verteilung","Verteilung","B19","B20","msgbox","msgbox","msgbox"]
["deutsch",1,"Prozess- und Maschinenfähigkeit","Werte können geändert werden","Werte werden berechnet (Blatt Berechnung)","Artikel:","Nummer:","Zeichnung:","Prüfer:","Messmittel:","Datum:","Merkmal:","Maßeinheit:","Sollwert msoll =","UGW","OGW","Anzahl Klassen Histogramm","Cpk<","Cpk","Cpk>","dazwischen","Prozess nicht fähig","Prozess bedingt fähig","Prozess fähig","Stichprobenumfang","Mittelwert","Standardabweichung","Die Werte sind nach Andersson Darling Test","normalverteilt","nicht normalverteilt",null,"OGW","UGW","Stichprobe chronologisch","Histogramm","Wahrscheinlichkeitsnetz",null,"Cmu","Cmo","Cm","Cmk","Fähigkeits- kennwerte",{"$f":"\"Bewertung cmk =>\"","v":"Bewertung cmk =>"},"Median z","Spannweite R","Minimum","Maximum","Berechnete Leistung in ppm","Über- schreitungs- anteil","pUGW","pOGW","p","Beobachtete Leistung in ppm",null,"Sprache","User -  Email","User - key","Gültig bis","Notizen",{"$f":"\"\"","v":""},"Bemerkung","Status: Die Werte im Arbeitsblatt sind kalkuliert","Status: Sie haben Werte verändert. Zum Kalkulieren den untenstehenden Button drücken.","Ist Ihr Messwert einseitig begrenzt, so geben Sie nur den entsprechenden oberen oder unteren Grenzwert an. Bei einer einseitigen Grenze wird im industriellen Umfeld nur der Cmk berechnet.","u-Wert",{"$f":"\"+ 3 Sigma\"","v":"+ 3 Sigma"},{"$f":"\"- 3 Sigma\"","v":"- 3 Sigma"},"Verteilung","Hilfe","Normalverteilung","Betragsverteilung 1. Art","Kontakt","homepage","Ohne valide Lizenz ist die Berechnung auf 20 Werte beschränkt - Mehr Info (z. Bsp. wie Sie eine Volllizenz erhalten können) unter dem Tabellenblatt 'info_setup' ","Lizenz nicht gültig - es werden maximal 20 Werte berechnet -Mehr Info (z. Bsp. wie Sie eine Volllizenz erhalten können) unter dem Tabellenblatt 'info_setup' ","Gültige Lizenz erwerben"]
["english",2,"process and machine capability","value could be changed","value is calculated","part:","part number:","drawing:","inspector:","measuring dev:","date:","attribute:","measuring unit:","nominal value =","lower spec. limit LSL","upper spec. limit USL","number of classes histogram","Cpk<","Cpk","Cpk>","between","process not capable","process limited capable","process capable","sample size","mid","standard deviation s","values are according Andersson Darling test","normal distributed","not normal distributed",null,"USL","LSL","random sample chronological","histogram","probability plot",null,"Cpkl","Cpku","Cp","Cpk","probability values","evaluation Cpk =>","median","range","minimum","maximum","calculated performance","exceedance","pLSL","pUSL","p","observed performance in ppm",null,"language","user -  email","user - key","valid until","note",{"$f":"\"\"","v":""},"note","The values are calculated","Sie haben Werte verändert. Bitte kalkulieren","If your measured value is one-sided limited, enter only the corresponding upper or lower limit value. With a one-sided limit, in the industrial environment only the Cpk is calclulated","u-value",{"$f":"\"+ 3 sigma\"","v":"+ 3 sigma"},{"$f":"\"- 3 sigma\"","v":"- 3 sigma"},"distribution","help","normal distribution","truncated normal distribution","contact","homepage","Without a valid licence, the calculation is limited to 20 values - More information (e.g. how to get a full licence) in the spreadsheet 'info_setup'. ","Licence not valid, the calculation is limited to 20 values - More information (e.g. how to get a full licence) in the spreadsheet 'info_setup'. ","buy the full licence"]
["italiano",3,"Capacità di processo e macchina","Valore modificabile","Valore calcolato","Articolo:","Codice:","Disegno","Ispettore","Strumento","Data","Attributo:","Unità di misura","Valore nominale =","Limite inferiore di specifica LSM","Limite superiore di specifica LSS","Numero di classi dell'istogramma","Cpk<","Cpk","Cpk>","tra","Processo non capace","Processo capace in modo limitatato","Processo capace","Dimensione del campione","media","Deviazione standard s","Valori in accorso al test Andersson Darling ","Distribuzione normale","Distribuzione non normale",null,"USL","LSL","Campione casuale cronologico","Istogramma","Grafico delle probabilità",null,"Cpkl","Cpku","Cp","Cpk","Valori di probabilità","Vautazione Cpk =>","Media","Range","Minimo","Massimo","Performance calcolata","Eccedenza","pLSL","pUSL","p","Prestazione osservata in ppm",null,"d","user -  Email","user - key","valid until","note",{"$f":"\"\"","v":""},"note","Ihre aktuellen Werte sind kalkuliert","Sie haben Werte verändert. Bitte kalkulieren","Se il valore misurato è limitato da un lato, inserire solo il valore limite superiore o inferiore corrispondente. Se il limite è unilaterale, nell'ambiente industriale viene calcolato solo il Cpk.",null,{"$f":"\"+ 3 sigma\"","v":"+ 3 sigma"},{"$f":"\"- 3 sigma\"","v":"- 3 sigma"},"distribuzione","distribuzione","distribuzione normale","distribuzione normale troncata","NN","NN","Senza una licenza valida, il calcolo è limitato a 20 valori - Ulteriori informazioni (ad esempio su come ottenere una licenza completa) nel foglio di calcolo \"info_setup\". ","licenz non valida, il calcolo è limitato a 20 valori - Ulteriori informazioni (ad esempio su come ottenere una licenza completa) nel foglio di calcolo \"info_setup\". ","Acquistare la licenza completa"]
["espanol",4,"NN2","NN2","NN2","NN2","NN2","NN2","NN2","NN2","NN2","NN2","NN2","NN2","NN2","NN2","NN2","NN2","NN2","NN2","NN2","NN2","NN2","NN2","NN2","NN2","NN2","NN2","NN2","NN2","NN2","NN2","NN2","NN2","NN2","NN2","NN2","NN2","NN2","NN2","NN2","NN2","NN2","NN2","NN2","NN2","NN2","NN2","NN2","NN2","NN2","NN2","NN2","NN2","NN2","NN2","NN2","NN2","NN2","NN2","NN2","NN2","NN2","NN2","NN2","NN2","NN2","NN2","NN2","NN2","NN2","NN2","NN2","NN2","NN2","NN2"]
["francais",5,"NN3","NN3","NN3","NN3","NN3","NN3","NN3","NN3","NN3","NN3","NN3","NN3","NN3","NN3","NN3","NN3","NN3","NN3","NN3","NN3","NN3","NN3","NN3","NN3","NN3","NN3","NN3","NN3","NN3","NN3","NN3","NN3","NN3","NN3","NN3","NN3","NN3","NN3","NN3","NN3","NN3","NN3","NN3","NN3","NN3","NN3","NN3","NN3","NN3","NN3","NN3","NN3","NN3","NN3","NN3","NN3","NN3","NN3","NN3","NN3","NN3","NN3","NN3","NN3","NN3","NN3","NN3","NN3","NN3","NN3","NN3","NN3","NN3","NN3"]
["portugues",6,"NN4","NN4","NN4","NN4","NN4","NN4","NN4","NN4","NN4","NN4","NN4","NN4","NN4","NN4","NN4","NN4","NN4","NN4","NN4","NN4","NN4","NN4","NN4","NN4","NN4","NN4","NN4","NN4","NN4","NN4","NN4","NN4","NN4","NN4","NN4","NN4","NN4","NN4","NN4","NN4","NN4","NN4","NN4","NN4","NN4","NN4","NN4","NN4","NN4","NN4","NN4","NN4","NN4","NN4","NN4","NN4","NN4","NN4","NN4","NN4","NN4","NN4","NN4","NN4","NN4","NN4","NN4","NN4","NN4","NN4","NN4","NN4","NN4","NN4"]
["mandarin",7,"NN5","NN5","NN5","NN5","NN5","NN5","NN5","NN5","NN5","NN5","NN5","NN5","NN5","NN5","NN5","NN5","NN5","NN5","NN5","NN5","NN5","NN5","NN5","NN5","NN5","NN5","NN5","NN5","NN5","NN5","NN5","NN5","NN5","NN5","NN5","NN5","NN5","NN5","NN5","NN5","NN5","NN5","NN5","NN5","NN5","NN5","NN5","NN5","NN5","NN5","NN5","NN5","NN5","NN5","NN5","NN5","NN5","NN5","NN5","NN5","NN5","NN5","NN5","NN5","NN5","NN5","NN5","NN5","NN5","NN5","NN5","NN5","NN5","NN5"]
["hindi",8,"NN6","NN6","NN6","NN6","NN6","NN6","NN6","NN6","NN6","NN6","NN6","NN6","NN6","NN6","NN6","NN6","NN6","NN6","NN6","NN6","NN6","NN6","NN6","NN6","NN6","NN6","NN6","NN6","NN6","NN6","NN6","NN6","NN6","NN6","NN6","NN6","NN6","NN6","NN6","NN6","NN6","NN6","NN6","NN6","NN6","NN6","NN6","NN6","NN6","NN6","NN6","NN6","NN6","NN6","NN6","NN6","NN6","NN6","NN6","NN6","NN6","NN6","NN6","NN6","NN6","NN6","NN6","NN6","NN6","NN6","NN6","NN6","NN6","NN6"]
["arabe",9,"NN7","NN7","NN7","NN7","NN7","NN7","NN7","NN7","NN7","NN7","NN7","NN7","NN7","NN7","NN7","NN7","NN7","NN7","NN7","NN7","NN7","NN7","NN7","NN7","NN7","NN7","NN7","NN7","NN7","NN7","NN7","NN7","NN7","NN7","NN7","NN7","NN7","NN7","NN7","NN7","NN7","NN7","NN7","NN7","NN7","NN7","NN7","NN7","NN7","NN7","NN7","NN7","NN7","NN7","NN7","NN7","NN7","NN7","NN7","NN7","NN7","NN7","NN7","NN7","NN7","NN7","NN7","NN7","NN7","NN7","NN7","NN7","NN7","NN7"]
["NN8",10,"NN8","NN8","NN8","NN8","NN8","NN8","NN8","NN8","NN8","NN8","NN8","NN8","NN8","NN8","NN8","NN8","NN8","NN8","NN8","NN8","NN8","NN8","NN8","NN8","NN8","NN8","NN8","NN8","NN8","NN8","NN8","NN8","NN8","NN8","NN8","NN8","NN8","NN8","NN8","NN8","NN8","NN8","NN8","NN8","NN8","NN8","NN8","NN8","NN8","NN8","NN8","NN8","NN8","NN8","NN8","NN8","NN8","NN8","NN8","NN8","NN8","NN8","NN8","NN8","NN8","NN8","NN8","NN8","NN8","NN8","NN8","NN8","NN8","NN8"]
["NN9",11,"NN9","NN9","NN9","NN9","NN9","NN9","NN9","NN9","NN9","NN9","NN9","NN9","NN9","NN9","NN9","NN9","NN9","NN9","NN9","NN9","NN9","NN9","NN9","NN9","NN9","NN9","NN9","NN9","NN9","NN9","NN9","NN9","NN9","NN9","NN9","NN9","NN9","NN9","NN9","NN9","NN9","NN9","NN9","NN9","NN9","NN9","NN9","NN9","NN9","NN9","NN9","NN9","NN9","NN9","NN9","NN9","NN9","NN9","NN9","NN9","NN9","NN9","NN9","NN9","NN9","NN9","NN9","NN9","NN9","NN9","NN9","NN9","NN9","NN9"]