{"text_format":"1","workbook":"xlsx","n_sheets":5,"sheets":["Start","Eingabe und Diagramm","Berechnung","Info","translation"],"not_rendered":{"charts":3,"images":0,"macros":1,"external_links":1,"defined_names":67,"comments":0,"pivot_tables":0},"unopened":[],"bounds":{"document_bytes":16777216,"sheet_cells":100000,"rows_first":2000,"rows_last":500,"rows_between":2000,"halvings":0,"cell_chars":16384,"cell_head_chars":4096},"cells_cut":0,"cells_raw":0,"read":"whole","date_system":"1900"}

{"sheet":"Start","index":0,"n_rows":10,"n_cols":2,"rows_kept":10,"cut":false,"hidden":true,"merged":[]}
[]
[]
[]
[null,"Das Makro ist momentan nicht aktiviert"]
[null,"Bitte Aktivieren Sie das Makro"]
[null,"Ohne Makro funktioniert diese Datei nicht"]
[]
[null,"roland.schnurr@sixsigmablackbelt.de"]
[]
[null,"https://www.sixsigmablackbelt.de"]

{"sheet":"Eingabe und Diagramm","index":1,"n_rows":55,"n_cols":28,"rows_kept":55,"cut":false,"hidden":false,"merged":[[1,1,1,12],[7,14,7,15],[8,14,8,15],[1,13,1,19],[1,20,1,24],[3,13,3,15],[4,13,4,15],[47,17,53,24],[11,14,11,15],[13,14,13,15],[35,13,35,14],[36,13,36,14],[40,13,40,15],[45,13,45,15],[46,13,48,13],[41,13,43,13],[38,13,38,14],[29,13,32,13],[33,13,33,14],[25,13,26,14],[1,27,1,30],[22,13,22,14],[23,13,23,14],[24,13,24,14],[37,13,37,14],[25,15,26,15],[14,13,14,14],[15,13,15,14],[16,13,16,14],[17,13,17,14],[12,14,12,15],[9,14,9,15],[6,14,6,15],[10,14,10,15]]}
[]
[null,null,null,null,null,null,null,null,null,null,null,null,null,{"$f":"translation!C1","v":"Prozess- und Maschinenfähigkeit"},null,null,null,null,null,null,null,null,null,null,null,null,null,"Choose your language \nWählen Sie Ihre Sprache"]
[]
[null,"i","xi",null,"i","xi",null,"i","xi",null,"i","xi",null,{"$f":"translation!D1","v":"Werte können geändert werden"}]
[null,1,20,null,51,18.8,null,101,16.899999999999999,null,151,null,null,{"$f":"translation!E1","v":"Werte werden berechnet (Blatt Berechnung)"}]
[null,2,21,null,52,17.100000000000001,null,102,19.5,null,152]
[null,3,21.5,null,53,18.600000000000001,null,103,20.399999999999999,null,153,null,null,{"$f":"translation!F1","v":"Artikel:"},"Halter"]
[null,4,19,null,54,18,null,104,19.100000000000001,null,154,null,null,{"$f":"translation!G1","v":"Nummer:"},"C2G234824ß"]
[null,5,19,null,55,18.7,null,105,null,null,155,null,null,{"$f":"translation!H1","v":"Zeichnung:"},"UZT1340124357"]
[null,6,20.399999999999999,null,56,20.3,null,106,null,null,156,null,null,{"$f":"translation!I1","v":"Prüfer:"},"Maier"]
[null,7,18.3,null,57,18.7,null,107,null,null,157,null,null,{"$f":"translation!J1","v":"Messmittel:"},"Waage 47.22452"]
[null,8,19.899999999999999,null,58,18.8,null,108,null,null,158,null,null,{"$f":"translation!K1","v":"Datum:"},"2014-12-10"]
[null,9,18.7,null,59,19.399999999999999,null,109,null,null,159,null,null,{"$f":"translation!L1","v":"Merkmal:"},"Länge"]
[null,10,18,null,60,18.5,null,110,null,null,160,null,null,{"$f":"translation!M1","v":"Maßeinheit:"},"mm"]
[null,11,17.7,null,61,18.600000000000001,null,111,null,null,161,null,null,{"$f":"translation!N1","v":"Sollwert msoll ="},null,19]
[null,12,19.100000000000001,null,62,19.600000000000001,null,112,null,null,162,null,null,{"$f":"translation!O1","v":"Unterer Grenzwert UGW ="},null,16]
[null,13,19.7,null,63,18.5,null,113,null,null,163,null,null,{"$f":"translation!P1","v":"Oberer Grenzwert OGW ="},null,23]
[null,14,18.100000000000001,null,64,20,null,114,null,null,164,null,null,{"$f":"translation!Q1","v":"Anzahl Klassen Histogramm ="},null,12]
[null,15,18.399999999999999,null,65,17.8,null,115,null,null,165,null,null,{"$f":"translation!R1","v":"Cpk<"},1.33,{"$f":"translation!V1","v":"Prozess nicht fähig"}]
[null,16,17.5,null,66,19.8,null,116,null,null,166,null,null,{"$f":"translation!S1","v":"Cpk"},{"$f":"translation!U1","v":"dazwischen"},{"$f":"translation!W1","v":"Prozess bedingt fähig"}]
[null,17,18.899999999999999,null,67,16.600000000000001,null,117,null,null,167,null,null,{"$f":"translation!T1","v":"Cpk>"},1.66,{"$f":"translation!X1","v":"Prozess fähig"}]
[null,18,19,null,68,19.399999999999999,null,118,null,null,168]
[null,19,20.5,null,69,19.3,null,119,null,null,169,null,null,{"$f":"translation!Y1","v":"Stichprobenumfang"},null,{"$f":"Anzahl","v":104}]
[null,20,17.3,null,70,20.100000000000001,null,120,null,null,170,null,null,{"$f":"translation!Z1","v":"Mittelwert"},null,{"$f":"Mittelwert","v":18.871153846153842}]
[null,21,18.3,null,71,20.5,null,121,null,null,171,null,null,{"$f":"translation!AA1","v":"Standardabweichung"},null,{"$f":"Standardabweichung","v":1.1790792093522857}]
[null,22,18.399999999999999,null,72,20,null,122,null,null,172,null,null,{"$f":"translation!AB1","v":"Die Werte sind nach Andersson Darling Test"},null,{"$f":"IF(Berechnung!BO8<0.05,translation!AD1,translation!AC1)","v":"normalverteilt"}]
[null,23,18.600000000000001,null,73,20.8,null,123,null,null,173]
[null,24,19.8,null,74,17.7,null,124,null,null,174]
[null,25,20.2,null,75,18.899999999999999,null,125,null,null,175]
[null,26,18.5,null,76,18.8,null,126,null,null,176,null,null,{"$f":"translation!AP1","v":"Fähigkeits- kennwerte"},{"$f":"translation!AL1","v":"Cmu"},{"$f":"CMU","v":0.81169379839801115}]
[null,27,18.5,null,77,16.399999999999999,null,127,null,null,177,null,null,null,{"$f":"translation!AM1","v":"Cmo"},{"$f":"CMO","v":1.1672515640726955}]
[null,28,18,null,78,18.5,null,128,null,null,178,null,null,null,{"$f":"translation!AN1","v":"Cm"},{"$f":"CM","v":0.98947268123535337}]
[null,29,20.9,null,79,19,null,129,null,null,179,null,null,null,{"$f":"translation!AO1","v":"Cmk"},{"$f":"CMK","v":0.81169379839801115}]
[null,30,18.100000000000001,null,80,20.6,null,130,null,null,180,null,null,{"$f":"translation!AQ1","v":"Bewertung cmk =>"},null,{"$f":"IF(P33<O19,P19,IF(P33>O21,P21,P20))","v":"Prozess nicht fähig"}]
[null,31,19.399999999999999,null,81,19.2,null,131,null,null,181]
[null,32,20.5,null,82,17.100000000000001,null,132,null,null,182,null,null,{"$f":"translation!AR1","v":"Median z"},null,{"$f":"Median","v":18.899999999999999}]
[null,33,20.399999999999999,null,83,16.3,null,133,null,null,183,null,null,{"$f":"translation!AS1","v":"Spannweite R"},null,{"$f":"Spannweite","v":5.3999999999999986}]
[null,34,16.100000000000001,null,84,17.2,null,134,null,null,184,null,null,{"$f":"translation!AT1","v":"Minimum"},null,{"$f":"Minimum","v":16.100000000000001}]
[null,35,18.7,null,85,17.899999999999999,null,135,null,null,185,null,null,{"$f":"translation!AU1","v":"Maximum"},null,{"$f":"Maximum","v":21.5}]
[null,36,18.8,null,86,19.100000000000001,null,136,null,null,186]
[null,37,17.3,null,87,17.3,null,137,null,null,187,null,null,{"$f":"translation!AV1","v":"Berechnete Leistung in ppm"}]
[null,38,18.100000000000001,null,88,19.399999999999999,null,138,null,null,188,null,null,{"$f":"translation!AW1","v":"Über- schreitungs- anteil"},{"$f":"translation!AX1","v":"pUGW"},{"$f":"BERPUGW","v":7444.2200969109872}]
[null,39,19.899999999999999,null,89,18.3,null,139,null,null,189,null,null,null,{"$f":"translation!AY1","v":"pOGW"},{"$f":"BERPOGW","v":231.10248282087741}]
[null,40,19.600000000000001,null,90,19.3,null,140,null,null,190,null,null,null,{"$f":"translation!AZ1","v":"p"},{"$f":"BERP","v":7675.3225797318646}]
[null,41,18.399999999999999,null,91,17.2,null,141,null,null,191]
[null,42,19.5,null,92,17.5,null,142,null,null,192,null,null,{"$f":"translation!BA1","v":"Beobachtete Leistung in ppm"}]
[null,43,16.8,null,93,19.600000000000001,null,143,null,null,193,null,null,{"$f":"translation!AW1","v":"Über- schreitungs- anteil"},{"$f":"translation!AX1","v":"pUGW"},{"$f":"BEOBPUGW","v":0}]
[null,44,17.100000000000001,null,94,17.600000000000001,null,144,null,null,194,null,null,null,{"$f":"translation!AY1","v":"pOGW"},{"$f":"BEOBPOGW","v":0}]
[null,45,18.899999999999999,null,95,20,null,145,null,null,195,null,null,null,{"$f":"translation!AZ1","v":"p"},{"$f":"BEOBPPM","v":0}]
[null,46,19.7,null,96,19.899999999999999,null,146,null,null,196]
[null,47,19.7,null,97,16.899999999999999,null,147,null,null,197]
[null,48,19.2,null,98,19.5,null,148,null,null,198]
[null,49,20.6,null,99,20.399999999999999,null,149,null,null,199]
[null,50,20.100000000000001,null,100,19.100000000000001,null,150,null,null,200]
[null,null,null,null,null,null,null,null,null,null,null,null,null,null,null,null,null,null,null,null,null,null,null,null,"© roland.schnurr@sixsigmablackbelt.de"]

{"sheet":"Berechnung","index":2,"n_rows":205,"n_cols":68,"rows_kept":205,"cut":false,"hidden":true,"merged":[[57,15,57,24]]}
[]
[]
[]
[]
[null,null,{"$f":"IF('Eingabe und Diagramm'!C5=\"\",\"\",'Eingabe und Diagramm'!C5)","v":20},null,null,{"$f":"IF('Eingabe und Diagramm'!F5=\"\",\"\",'Eingabe und Diagramm'!F5)","v":18.8},null,null,{"$f":"IF('Eingabe und Diagramm'!I5=\"\",\"\",'Eingabe und Diagramm'!I5)","v":16.899999999999999},null,null,{"$f":"IF('Eingabe und Diagramm'!L5=\"\",\"\",'Eingabe und Diagramm'!L5)","v":""},null,null,null,null,null,null,null,null,null,null,null,null,null,null,null,null,null,1,{"$f":"IF((Anzahl>AD5),AD5,Anzahl)","v":1},{"$f":"IF(C5<>\"\",C5,1)","v":20},{"$f":"IF(C5<>\"\",OGW,Q17)","v":23},{"$f":"IF(C5<>\"\",UGW,R17)","v":16},{"$f":"fxds-Standardabweichung","v":17.692074636801557},{"$f":"fxds+Standardabweichung","v":20.050233055506126},{"$f":"fxds-2*Standardabweichung","v":16.512995427449269},{"$f":"fxds+2*Standardabweichung","v":21.229312264858414},{"$f":"fxds-3*Standardabweichung","v":15.333916218096984},{"$f":"fxds+3*Standardabweichung","v":22.408391474210699},{"$f":"fxds","v":18.871153846153842},null,{"$f":"IF(AND(C5<>\"\",C5<UGW),1,0)","v":0},{"$f":"IF(AND(C5<>\"\",C5>OGW),1,0)","v":0},null,null,null,-6,{"$f":"fxds+AV5*Standardabweichung","v":11.796678590040127},3,{"$f":"AX5*2","v":6},{"$f":"AW5","v":11.796678590040127},null,null,1,{"$f":"IF(C5=\"\",NA(),SMALL(xi,BE5))","v":16.100000000000001},{"$f":"IF(C5=\"\",\"\",1)","v":1},{"$f":"IF(C5=\"\",\"\",NORMSDIST((BD5-fxds)/Standardabweichung))","v":9.379912609024996E-3},{"$f":"IF(C5=\"\",\"\",1-BF5)","v":0.99062008739097496},{"$f":"IF(IF(C5=\"\",\"\",SMALL(BG,BE5))=0,0.0001,IF(C5=\"\",\"\",SMALL(BG,BE5)))","v":1.288781791133975E-2},{"$f":"IF(C5=\"\",\"\",(2*BE5-1)*(LN(BH5)+LN(BF5)))","v":-9.0206575944926026},{"$f":"IF(C5=\"\",NA(),NORMSINV((BE5-0.3)/(Anzahl+0.4)))","v":-2.4726921125330161},null,null,{"$f":"Standardabweichung*BN5+fxds","v":22.408391474210699},3,{"$f":"SUM(Normalverteilung_S)","v":-10855.628314530246},{"$f":"IF(AND(BO7<13, BO7>=0.6),EXP(1.2937-5.709*BO7+0.0186*BO7^ 2),0)","v":0}]
[null,null,{"$f":"IF('Eingabe und Diagramm'!C6=\"\",\"\",'Eingabe und Diagramm'!C6)","v":21},null,null,{"$f":"IF('Eingabe und Diagramm'!F6=\"\",\"\",'Eingabe und Diagramm'!F6)","v":17.100000000000001},null,null,{"$f":"IF('Eingabe und Diagramm'!I6=\"\",\"\",'Eingabe und Diagramm'!I6)","v":19.5},null,null,{"$f":"IF('Eingabe und Diagramm'!L6=\"\",\"\",'Eingabe und Diagramm'!L6)","v":""},null,null,null,null,null,null,null,null,null,null,null,null,null,null,null,null,null,2,2,{"$f":"IF(C6<>\"\",C6,AG5)","v":21},{"$f":"IF(C6<>\"\",OGW,AG5)","v":23},{"$f":"IF(C6<>\"\",UGW,AH5)","v":16},{"$f":"AI5","v":17.692074636801557},20.050233055506126,16.512995427449269,21.229312264858414,15.333916218096984,22.408391474210699,18.871153846153842,null,0,0,null,null,null,-5,12.975757799392413,3,{"$f":"AX6*2","v":6},{"$f":"AZ5","v":11.796678590040127},null,null,2,16.3,{"$f":"IF(C6=\"\",\"\",1+BE5)","v":2},1.4604821166970558E-2,0.98539517883302941,{"$f":"IF(C6=\"\",\"\",SMALL(BG,BE6))","v":3.549700188051208E-2},-22.694131883996867,-2.1373805779024275,null,null,{"$f":"Standardabweichung*BN6+fxds","v":18.871153846153842},0,{"$f":"-BO5/Anzahl-Anzahl","v":0.38104148586775466},{"$f":"IF(AND(BO7<0.6,BO7>=0.34),EXP(0.9177-4.279*BO7-1.38*BO7^2),0)","v":0.39525504719462384}]
[null,null,{"$f":"IF('Eingabe und Diagramm'!C7=\"\",\"\",'Eingabe und Diagramm'!C7)","v":21.5},null,null,{"$f":"IF('Eingabe und Diagramm'!F7=\"\",\"\",'Eingabe und Diagramm'!F7)","v":18.600000000000001},null,null,{"$f":"IF('Eingabe und Diagramm'!I7=\"\",\"\",'Eingabe und Diagramm'!I7)","v":20.399999999999999},null,null,{"$f":"IF('Eingabe und Diagramm'!L7=\"\",\"\",'Eingabe und Diagramm'!L7)","v":""},null,null,null,null,{"$f":"Maßeinheit","v":"mm"},{"$f":"Merkmal","v":"Länge"},{"$f":"six_cmu(Mittelwert,UGW,Standardabweichung)","v":0.81169379839801115},{"$f":"MEDIAN(xi)","v":18.899999999999999},{"$f":"NORMDIST(UGW,Mittelwert,Standardabweichung,1)*1000000","v":7444.2200969109872},{"$f":"AQ205/R8*1000000","v":0},null,null,null,null,null,null,null,3,3,{"$f":"IF(C7<>\"\",C7,AG6)","v":21.5},23,16,17.692074636801557,20.050233055506126,16.512995427449269,21.229312264858414,15.333916218096984,22.408391474210699,18.871153846153842,null,0,0,null,null,null,-4,14.1548370087447,3,6,{"$f":"AZ6","v":11.796678590040127},null,null,3,16.399999999999999,3,1.8048476475487747E-2,0.9819515235245122,4.2652287251105148E-2,-35.846841908209001,-1.9454225913844103,null,null,{"$f":"Standardabweichung*BN7+fxds","v":15.333916218096984},-3,{"$f":"BO6*(1+0.75/Anzahl+2.25/Anzahl^2)","v":0.38386864740999654},{"$f":"IF(AND(BO7<0.34,BO7>=0.2),1-EXP(-8.318+42.796*BO7-59.938*BO7^2),0)","v":0}]
[null,null,{"$f":"IF('Eingabe und Diagramm'!C8=\"\",\"\",'Eingabe und Diagramm'!C8)","v":19},null,null,{"$f":"IF('Eingabe und Diagramm'!F8=\"\",\"\",'Eingabe und Diagramm'!F8)","v":18},null,null,{"$f":"IF('Eingabe und Diagramm'!I8=\"\",\"\",'Eingabe und Diagramm'!I8)","v":19.100000000000001},null,null,{"$f":"IF('Eingabe und Diagramm'!L8=\"\",\"\",'Eingabe und Diagramm'!L8)","v":""},null,null,null,null,{"$f":"Sollwert","v":19},{"$f":"six_a(xi)","v":104},{"$f":"six_cmo(OGW,Mittelwert,Standardabweichung)","v":1.1672515640726955},{"$f":"Maximum-Minimum","v":5.3999999999999986},{"$f":"(1-NORMDIST(OGW,Mittelwert,Standardabweichung,1))*1000000","v":231.10248282087741},{"$f":"AR205/R8*1000000","v":0},null,null,null,null,null,null,null,4,4,{"$f":"IF(C8<>\"\",C8,AF7)","v":19},23,16,17.692074636801557,20.050233055506126,16.512995427449269,21.229312264858414,15.333916218096984,22.408391474210699,18.871153846153842,null,0,0,null,null,null,-2,16.512995427449269,3,6,11.796678590040127,null,null,4,16.600000000000001,4,2.7039095658461194E-2,0.97296090434153881,5.0931104476244271E-2,-46.114270475760833,-1.8062376514496066,null,null,null,null,{"$f":"MAX(BP5:BP8)","v":0.39525504719462384},{"$f":"IF(BO7<0.2,1-EXP(-13.436+101.14*BO7-223.73*BO7^2),0)","v":0}]
[null,null,{"$f":"IF('Eingabe und Diagramm'!C9=\"\",\"\",'Eingabe und Diagramm'!C9)","v":19},null,null,{"$f":"IF('Eingabe und Diagramm'!F9=\"\",\"\",'Eingabe und Diagramm'!F9)","v":18.7},null,null,{"$f":"IF('Eingabe und Diagramm'!I9=\"\",\"\",'Eingabe und Diagramm'!I9)","v":""},null,null,{"$f":"IF('Eingabe und Diagramm'!L9=\"\",\"\",'Eingabe und Diagramm'!L9)","v":""},null,null,null,null,{"$f":"UGW","v":16},{"$f":"six_m(xi)","v":18.871153846153842},{"$f":"six_cm(OGW,UGW,Standardabweichung)","v":0.98947268123535337},{"$f":"MIN(xi)","v":16.100000000000001},{"$f":"BERPOGW+BERPUGW","v":7675.3225797318646},{"$f":"V8+V7","v":0},null,null,null,null,null,null,null,5,5,19,23,16,17.692074636801557,20.050233055506126,16.512995427449269,21.229312264858414,15.333916218096984,22.408391474210699,18.871153846153842,null,0,0,null,null,null,-1,17.692074636801557,3,6,11.796678590040127,null,null,5,16.8,5,3.9494213939943082E-2,0.96050578606005688,7.1287640240536021E-2,-52.853700740277134,-1.695195637736439]
[null,null,{"$f":"IF('Eingabe und Diagramm'!C10=\"\",\"\",'Eingabe und Diagramm'!C10)","v":20.399999999999999},null,null,{"$f":"IF('Eingabe und Diagramm'!F10=\"\",\"\",'Eingabe und Diagramm'!F10)","v":20.3},null,null,{"$f":"IF('Eingabe und Diagramm'!I10=\"\",\"\",'Eingabe und Diagramm'!I10)","v":""},null,null,{"$f":"IF('Eingabe und Diagramm'!L10=\"\",\"\",'Eingabe und Diagramm'!L10)","v":""},null,null,null,null,{"$f":"OGW","v":23},{"$f":"six_st(xi)","v":1.1790792093522857},{"$f":"six_ck(CMO,CMU)","v":0.81169379839801115},{"$f":"MAX(xi)","v":21.5},null,null,null,null,null,null,null,null,null,6,6,20.399999999999999,23,16,17.692074636801557,20.050233055506126,16.512995427449269,21.229312264858414,15.333916218096984,22.408391474210699,18.871153846153842,null,0,0,null,null,null,1,20.050233055506126,3,6,11.796678590040127,null,null,6,16.899999999999999,6,4.7284457847128231E-2,0.9527155421528718,7.1287640240536021E-2,-62.618665334178388,-1.6018200758463057]
[null,null,{"$f":"IF('Eingabe und Diagramm'!C11=\"\",\"\",'Eingabe und Diagramm'!C11)","v":18.3},null,null,{"$f":"IF('Eingabe und Diagramm'!F11=\"\",\"\",'Eingabe und Diagramm'!F11)","v":18.7},null,null,{"$f":"IF('Eingabe und Diagramm'!I11=\"\",\"\",'Eingabe und Diagramm'!I11)","v":""},null,null,{"$f":"IF('Eingabe und Diagramm'!L11=\"\",\"\",'Eingabe und Diagramm'!L11)","v":""},null,null,null,null,null,"Stichprobe chronologisch","OGW",null,null,null,null,null,null,null,null,null,null,7,7,18.3,23,16,17.692074636801557,20.050233055506126,16.512995427449269,21.229312264858414,15.333916218096984,22.408391474210699,18.871153846153842,null,0,0,null,null,null,2,21.229312264858414,3,6,11.796678590040127,null,null,7,16.899999999999999,7,4.7284457847128231E-2,0.9527155421528718,8.3569385064981683E-2,-71.937471548028128,-1.5206308904123664]
[null,null,{"$f":"IF('Eingabe und Diagramm'!C12=\"\",\"\",'Eingabe und Diagramm'!C12)","v":19.899999999999999},null,null,{"$f":"IF('Eingabe und Diagramm'!F12=\"\",\"\",'Eingabe und Diagramm'!F12)","v":18.8},null,null,{"$f":"IF('Eingabe und Diagramm'!I12=\"\",\"\",'Eingabe und Diagramm'!I12)","v":""},null,null,{"$f":"IF('Eingabe und Diagramm'!L12=\"\",\"\",'Eingabe und Diagramm'!L12)","v":""},null,null,null,null,null,"Wahrscheinlichkeitsnetz","UGW",null,null,null,null,null,null,null,null,null,null,8,8,19.899999999999999,23,16,17.692074636801557,20.050233055506126,16.512995427449269,21.229312264858414,15.333916218096984,22.408391474210699,18.871153846153842,null,0,0,null,null,null,4,23.587470683562984,3,6,11.796678590040127,null,null,8,17.100000000000001,8,6.6529185896414308E-2,0.93347081410358568,8.3569385064981683E-2,-77.88288862890829,-1.4483843879989091]
[null,null,{"$f":"IF('Eingabe und Diagramm'!C13=\"\",\"\",'Eingabe und Diagramm'!C13)","v":18.7},null,null,{"$f":"IF('Eingabe und Diagramm'!F13=\"\",\"\",'Eingabe und Diagramm'!F13)","v":19.399999999999999},null,null,{"$f":"IF('Eingabe und Diagramm'!I13=\"\",\"\",'Eingabe und Diagramm'!I13)","v":""},null,null,{"$f":"IF('Eingabe und Diagramm'!L13=\"\",\"\",'Eingabe und Diagramm'!L13)","v":""},null,null,null,null,null,"Test auf Normalverteilung (Anderson Darling)",{"$f":"\"+ 3 Sigma\"","v":"+ 3 Sigma"},null,null,null,null,null,null,null,null,null,null,9,9,18.7,23,16,17.692074636801557,20.050233055506126,16.512995427449269,21.229312264858414,15.333916218096984,22.408391474210699,18.871153846153842,null,0,0,null,null,null,5,24.766549892915272,3,6,11.796678590040127,null,null,9,17.100000000000001,9,6.6529185896414308E-2,0.93347081410358568,8.3569385064981683E-2,-88.267273779429388,-1.3829941271006392]
[null,null,{"$f":"IF('Eingabe und Diagramm'!C14=\"\",\"\",'Eingabe und Diagramm'!C14)","v":18},null,null,{"$f":"IF('Eingabe und Diagramm'!F14=\"\",\"\",'Eingabe und Diagramm'!F14)","v":18.5},null,null,{"$f":"IF('Eingabe und Diagramm'!I14=\"\",\"\",'Eingabe und Diagramm'!I14)","v":""},null,null,{"$f":"IF('Eingabe und Diagramm'!L14=\"\",\"\",'Eingabe und Diagramm'!L14)","v":""},null,null,null,null,null,"Prozess- und Maschinenfähigkeit",{"$f":"\"- 3 Sigma\"","v":"- 3 Sigma"},null,null,null,null,null,null,null,null,null,null,10,10,18,23,16,17.692074636801557,20.050233055506126,16.512995427449269,21.229312264858414,15.333916218096984,22.408391474210699,18.871153846153842,null,0,0,null,null,null,6,25.945629102267556,3,6,11.796678590040127,null,null,10,17.100000000000001,10,6.6529185896414308E-2,0.93347081410358568,9.7376827838374425E-2,-95.746349369890467,-1.3230349517479669]
[null,null,{"$f":"IF('Eingabe und Diagramm'!C15=\"\",\"\",'Eingabe und Diagramm'!C15)","v":17.7},null,null,{"$f":"IF('Eingabe und Diagramm'!F15=\"\",\"\",'Eingabe und Diagramm'!F15)","v":18.600000000000001},null,null,{"$f":"IF('Eingabe und Diagramm'!I15=\"\",\"\",'Eingabe und Diagramm'!I15)","v":""},null,null,{"$f":"IF('Eingabe und Diagramm'!L15=\"\",\"\",'Eingabe und Diagramm'!L15)","v":""},null,null,null,null,null,null,"Mittelwert",null,null,null,null,null,null,null,null,null,null,11,11,17.7,23,16,17.692074636801557,20.050233055506126,16.512995427449269,21.229312264858414,15.333916218096984,22.408391474210699,18.871153846153842,null,0,0,null,null,null,-3,15.333916218096984,3,6,11.796678590040127,null,null,11,17.2,11,7.8192055440130179E-2,0.92180794455986981,9.7376827838374425E-2,-102.43283889868233,-1.2674880246380946]
[null,null,{"$f":"IF('Eingabe und Diagramm'!C16=\"\",\"\",'Eingabe und Diagramm'!C16)","v":19.100000000000001},null,null,{"$f":"IF('Eingabe und Diagramm'!F16=\"\",\"\",'Eingabe und Diagramm'!F16)","v":19.600000000000001},null,null,{"$f":"IF('Eingabe und Diagramm'!I16=\"\",\"\",'Eingabe und Diagramm'!I16)","v":""},null,null,{"$f":"IF('Eingabe und Diagramm'!L16=\"\",\"\",'Eingabe und Diagramm'!L16)","v":""},null,null,null,null,null,null,"Sollwert",null,null,null,null,null,null,null,null,null,null,12,12,19.100000000000001,23,16,17.692074636801557,20.050233055506126,16.512995427449269,21.229312264858414,15.333916218096984,22.408391474210699,18.871153846153842,null,0,0,null,null,null,3,22.408391474210699,3,6,11.796678590040127,null,null,12,17.2,12,7.8192055440130179E-2,0.92180794455986981,9.7376827838374425E-2,-112.18834736522351,-1.2155984339134935]
[null,null,{"$f":"IF('Eingabe und Diagramm'!C17=\"\",\"\",'Eingabe und Diagramm'!C17)","v":19.7},null,null,{"$f":"IF('Eingabe und Diagramm'!F17=\"\",\"\",'Eingabe und Diagramm'!F17)","v":18.5},null,null,{"$f":"IF('Eingabe und Diagramm'!I17=\"\",\"\",'Eingabe und Diagramm'!I17)","v":""},null,null,{"$f":"IF('Eingabe und Diagramm'!L17=\"\",\"\",'Eingabe und Diagramm'!L17)","v":""},null,null,null,null,"OGW","UGW",{"$f":"\" - 1 Sigma\"","v":" - 1 Sigma"},{"$f":"\" + 1 Sigma\"","v":" + 1 Sigma"},{"$f":"\"-  2 Sigma\"","v":"-  2 Sigma"},{"$f":"\" + 2 Sigma\"","v":" + 2 Sigma"},{"$f":"\" - 3 Sigma\"","v":" - 3 Sigma"},{"$f":"\" + 3 Sigma\"","v":" + 3 Sigma"},{"$f":"\" Mittelwert\"","v":" Mittelwert"},null,null,null,null,13,13,19.7,23,16,17.692074636801557,20.050233055506126,16.512995427449269,21.229312264858414,15.333916218096984,22.408391474210699,18.871153846153842,null,0,0,null,null,null,null,null,null,null,null,null,null,13,17.3,13,9.1343681802967536E-2,0.90865631819703241,9.7376827838374425E-2,-118.0573291777547,-1.1667904140077117]
[null,null,{"$f":"IF('Eingabe und Diagramm'!C18=\"\",\"\",'Eingabe und Diagramm'!C18)","v":18.100000000000001},null,null,{"$f":"IF('Eingabe und Diagramm'!F18=\"\",\"\",'Eingabe und Diagramm'!F18)","v":20},null,null,{"$f":"IF('Eingabe und Diagramm'!I18=\"\",\"\",'Eingabe und Diagramm'!I18)","v":""},null,null,{"$f":"IF('Eingabe und Diagramm'!L18=\"\",\"\",'Eingabe und Diagramm'!L18)","v":""},null,null,null,null,null,null,null,null,null,null,null,null,null,null,null,null,null,14,14,18.100000000000001,23,16,17.692074636801557,20.050233055506126,16.512995427449269,21.229312264858414,15.333916218096984,22.408391474210699,18.871153846153842,null,0,0,null,null,null,{"$f":"Mittelwert","v":18.871153846153842},3,null,null,null,null,null,14,17.3,14,9.1343681802967536E-2,0.90865631819703241,0.11278830957696839,-123.53495617061071,-1.120614225092825]
[null,null,{"$f":"IF('Eingabe und Diagramm'!C19=\"\",\"\",'Eingabe und Diagramm'!C19)","v":18.399999999999999},null,null,{"$f":"IF('Eingabe und Diagramm'!F19=\"\",\"\",'Eingabe und Diagramm'!F19)","v":17.8},null,null,{"$f":"IF('Eingabe und Diagramm'!I19=\"\",\"\",'Eingabe und Diagramm'!I19)","v":""},null,null,{"$f":"IF('Eingabe und Diagramm'!L19=\"\",\"\",'Eingabe und Diagramm'!L19)","v":""},null,null,null,null,null,null,null,null,null,null,null,null,null,null,null,null,null,15,15,18.399999999999999,23,16,17.692074636801557,20.050233055506126,16.512995427449269,21.229312264858414,15.333916218096984,22.408391474210699,18.871153846153842,null,0,0,null,null,null,{"$f":"OGW","v":23},3,null,null,null,null,null,15,17.3,15,9.1343681802967536E-2,0.90865631819703241,0.12986695815720595,-128.59675652386289,-1.0767114501536124]
[null,null,{"$f":"IF('Eingabe und Diagramm'!C20=\"\",\"\",'Eingabe und Diagramm'!C20)","v":17.5},null,null,{"$f":"IF('Eingabe und Diagramm'!F20=\"\",\"\",'Eingabe und Diagramm'!F20)","v":19.8},null,null,{"$f":"IF('Eingabe und Diagramm'!I20=\"\",\"\",'Eingabe und Diagramm'!I20)","v":""},null,null,{"$f":"IF('Eingabe und Diagramm'!L20=\"\",\"\",'Eingabe und Diagramm'!L20)","v":""},null,null,null,null,null,null,null,null,null,null,null,null,null,null,null,null,null,16,16,17.5,23,16,17.692074636801557,20.050233055506126,16.512995427449269,21.229312264858414,15.333916218096984,22.408391474210699,18.871153846153842,null,0,0,null,null,null,{"$f":"UGW","v":16},3,null,null,null,null,null,16,17.5,16,0.1224345855500007,0.87756541444999936,0.14865755483868492,-124.19493714392094,-1.0347915210595791]
[null,null,{"$f":"IF('Eingabe und Diagramm'!C21=\"\",\"\",'Eingabe und Diagramm'!C21)","v":18.899999999999999},null,null,{"$f":"IF('Eingabe und Diagramm'!F21=\"\",\"\",'Eingabe und Diagramm'!F21)","v":16.600000000000001},null,null,{"$f":"IF('Eingabe und Diagramm'!I21=\"\",\"\",'Eingabe und Diagramm'!I21)","v":""},null,null,{"$f":"IF('Eingabe und Diagramm'!L21=\"\",\"\",'Eingabe und Diagramm'!L21)","v":""},null,null,null,null,null,null,null,null,null,null,null,null,null,null,null,null,null,17,17,18.899999999999999,23,16,17.692074636801557,20.050233055506126,16.512995427449269,21.229312264858414,15.333916218096984,22.408391474210699,18.871153846153842,null,0,0,null,null,null,{"$f":"Sollwert","v":19},3,null,null,null,null,null,17,17.5,17,0.1224345855500007,0.87756541444999936,0.14865755483868492,-132.20751373385133,-0.99461536503340842]
[null,null,{"$f":"IF('Eingabe und Diagramm'!C22=\"\",\"\",'Eingabe und Diagramm'!C22)","v":19},null,null,{"$f":"IF('Eingabe und Diagramm'!F22=\"\",\"\",'Eingabe und Diagramm'!F22)","v":19.399999999999999},null,null,{"$f":"IF('Eingabe und Diagramm'!I22=\"\",\"\",'Eingabe und Diagramm'!I22)","v":""},null,null,{"$f":"IF('Eingabe und Diagramm'!L22=\"\",\"\",'Eingabe und Diagramm'!L22)","v":""},null,null,null,null,null,null,null,null,null,null,null,null,null,null,null,null,null,18,18,19,23,16,{"$f":"AI21","v":17.692074636801557},20.050233055506126,16.512995427449269,21.229312264858414,15.333916218096984,22.408391474210699,18.871153846153842,null,0,0,null,null,null,null,null,null,null,null,null,null,18,17.600000000000001,18,0.14049673234464549,0.85950326765535445,0.16918361522263548,-130.87696023699235,-0.95598371956347172]
[null,null,{"$f":"IF('Eingabe und Diagramm'!C23=\"\",\"\",'Eingabe und Diagramm'!C23)","v":20.5},null,null,{"$f":"IF('Eingabe und Diagramm'!F23=\"\",\"\",'Eingabe und Diagramm'!F23)","v":19.3},null,null,{"$f":"IF('Eingabe und Diagramm'!I23=\"\",\"\",'Eingabe und Diagramm'!I23)","v":""},null,null,{"$f":"IF('Eingabe und Diagramm'!L23=\"\",\"\",'Eingabe und Diagramm'!L23)","v":""},null,null,null,null,null,null,null,null,null,null,null,null,null,null,null,null,null,19,19,20.5,23,16,17.692074636801557,20.050233055506126,16.512995427449269,21.229312264858414,15.333916218096984,22.408391474210699,18.871153846153842,null,0,0,null,null,null,null,null,null,null,null,null,null,19,17.7,19,0.16028716372141005,0.83971283627858995,0.16918361522263548,-133.47968197936041,-0.91872859748633251]
[null,null,{"$f":"IF('Eingabe und Diagramm'!C24=\"\",\"\",'Eingabe und Diagramm'!C24)","v":17.3},null,null,{"$f":"IF('Eingabe und Diagramm'!F24=\"\",\"\",'Eingabe und Diagramm'!F24)","v":20.100000000000001},null,null,{"$f":"IF('Eingabe und Diagramm'!I24=\"\",\"\",'Eingabe und Diagramm'!I24)","v":""},null,null,{"$f":"IF('Eingabe und Diagramm'!L24=\"\",\"\",'Eingabe und Diagramm'!L24)","v":""},null,null,null,null,null,null,null,null,null,null,null,null,null,null,null,null,null,20,20,17.3,23,16,17.692074636801557,20.050233055506126,16.512995427449269,21.229312264858414,15.333916218096984,22.408391474210699,18.871153846153842,null,0,0,null,null,null,null,null,null,null,null,null,null,20,17.7,20,0.16028716372141005,0.83971283627858995,0.16918361522263548,-140.6947999241907,-0.8827069316566255]
[null,null,{"$f":"IF('Eingabe und Diagramm'!C25=\"\",\"\",'Eingabe und Diagramm'!C25)","v":18.3},null,null,{"$f":"IF('Eingabe und Diagramm'!F25=\"\",\"\",'Eingabe und Diagramm'!F25)","v":20.5},null,null,{"$f":"IF('Eingabe und Diagramm'!I25=\"\",\"\",'Eingabe und Diagramm'!I25)","v":""},null,null,{"$f":"IF('Eingabe und Diagramm'!L25=\"\",\"\",'Eingabe und Diagramm'!L25)","v":""},null,null,null,null,null,null,null,null,null,null,null,null,null,null,null,null,null,21,21,18.3,23,16,17.692074636801557,20.050233055506126,16.512995427449269,21.229312264858414,15.333916218096984,22.408391474210699,18.871153846153842,null,0,0,null,null,null,null,null,null,null,null,null,null,21,17.8,21,0.18181592868556593,0.81818407131443405,0.16918361522263548,-142.74277746935903,-0.84779576122809619]
[null,null,{"$f":"IF('Eingabe und Diagramm'!C26=\"\",\"\",'Eingabe und Diagramm'!C26)","v":18.399999999999999},null,null,{"$f":"IF('Eingabe und Diagramm'!F26=\"\",\"\",'Eingabe und Diagramm'!F26)","v":20},null,null,{"$f":"IF('Eingabe und Diagramm'!I26=\"\",\"\",'Eingabe und Diagramm'!I26)","v":""},null,null,{"$f":"IF('Eingabe und Diagramm'!L26=\"\",\"\",'Eingabe und Diagramm'!L26)","v":""},null,null,null,null,null,null,null,null,null,null,null,null,null,null,null,null,null,22,22,18.399999999999999,23,16,17.692074636801557,20.050233055506126,16.512995427449269,21.229312264858414,15.333916218096984,22.408391474210699,18.871153846153842,null,0,0,null,null,null,null,null,null,null,null,null,null,22,17.899999999999999,22,0.20506796191139801,0.79493203808860202,0.19144481647794753,-139.21548891970937,-0.81388852978076354]
[null,null,{"$f":"IF('Eingabe und Diagramm'!C27=\"\",\"\",'Eingabe und Diagramm'!C27)","v":18.600000000000001},null,null,{"$f":"IF('Eingabe und Diagramm'!F27=\"\",\"\",'Eingabe und Diagramm'!F27)","v":20.8},null,null,{"$f":"IF('Eingabe und Diagramm'!I27=\"\",\"\",'Eingabe und Diagramm'!I27)","v":""},null,null,{"$f":"IF('Eingabe und Diagramm'!L27=\"\",\"\",'Eingabe und Diagramm'!L27)","v":""},null,null,null,null,null,null,null,null,null,null,null,null,null,null,null,null,null,23,23,18.600000000000001,23,16,17.692074636801557,20.050233055506126,16.512995427449269,21.229312264858414,15.333916218096984,22.408391474210699,18.871153846153842,null,0,0,null,null,null,null,null,null,null,null,null,null,23,18,23,0.23000131665327744,0.7699986833467225,0.19144481647794753,-140.52716648958207,-0.78089219941060251]
[null,null,{"$f":"IF('Eingabe und Diagramm'!C28=\"\",\"\",'Eingabe und Diagramm'!C28)","v":19.8},null,null,{"$f":"IF('Eingabe und Diagramm'!F28=\"\",\"\",'Eingabe und Diagramm'!F28)","v":17.7},null,null,{"$f":"IF('Eingabe und Diagramm'!I28=\"\",\"\",'Eingabe und Diagramm'!I28)","v":""},null,null,{"$f":"IF('Eingabe und Diagramm'!L28=\"\",\"\",'Eingabe und Diagramm'!L28)","v":""},null,null,null,null,null,null,null,null,null,null,null,null,null,null,null,null,null,24,24,19.8,23,16,17.692074636801557,20.050233055506126,16.512995427449269,21.229312264858414,15.333916218096984,22.408391474210699,18.871153846153842,null,0,0,null,null,null,null,null,null,null,null,null,null,24,18,24,0.23000131665327744,0.7699986833467225,0.19144481647794753,-146.77281833356349,-0.74872497306338015]
[null,null,{"$f":"IF('Eingabe und Diagramm'!C29=\"\",\"\",'Eingabe und Diagramm'!C29)","v":20.2},null,null,{"$f":"IF('Eingabe und Diagramm'!F29=\"\",\"\",'Eingabe und Diagramm'!F29)","v":18.899999999999999},null,null,{"$f":"IF('Eingabe und Diagramm'!I29=\"\",\"\",'Eingabe und Diagramm'!I29)","v":""},null,null,{"$f":"IF('Eingabe und Diagramm'!L29=\"\",\"\",'Eingabe und Diagramm'!L29)","v":""},null,null,null,null,null,null,null,null,null,null,null,null,null,null,null,null,null,25,25,20.2,23,16,17.692074636801557,20.050233055506126,16.512995427449269,21.229312264858414,15.333916218096984,22.408391474210699,18.871153846153842,null,0,0,null,null,null,null,null,null,null,null,null,null,25,18,25,0.23000131665327744,0.7699986833467225,0.2154149002838065,-147.23811977280741,-0.71731447670819293]
[null,null,{"$f":"IF('Eingabe und Diagramm'!C30=\"\",\"\",'Eingabe und Diagramm'!C30)","v":18.5},null,null,{"$f":"IF('Eingabe und Diagramm'!F30=\"\",\"\",'Eingabe und Diagramm'!F30)","v":18.8},null,null,{"$f":"IF('Eingabe und Diagramm'!I30=\"\",\"\",'Eingabe und Diagramm'!I30)","v":""},null,null,{"$f":"IF('Eingabe und Diagramm'!L30=\"\",\"\",'Eingabe und Diagramm'!L30)","v":""},null,null,null,null,null,null,null,null,null,null,null,null,null,null,null,null,null,26,26,18.5,23,16,17.692074636801557,20.050233055506126,16.512995427449269,21.229312264858414,15.333916218096984,22.408391474210699,18.871153846153842,null,0,0,null,null,null,null,null,null,null,null,null,null,26,18.100000000000001,26,0.25654605568819322,0.74345394431180678,0.2154149002838065,-147.67745731053466,-0.68659629362666075]
[null,null,{"$f":"IF('Eingabe und Diagramm'!C31=\"\",\"\",'Eingabe und Diagramm'!C31)","v":18.5},null,null,{"$f":"IF('Eingabe und Diagramm'!F31=\"\",\"\",'Eingabe und Diagramm'!F31)","v":16.399999999999999},null,null,{"$f":"IF('Eingabe und Diagramm'!I31=\"\",\"\",'Eingabe und Diagramm'!I31)","v":""},null,null,{"$f":"IF('Eingabe und Diagramm'!L31=\"\",\"\",'Eingabe und Diagramm'!L31)","v":""},null,null,null,null,null,null,null,null,null,null,null,null,null,null,null,null,null,27,27,18.5,23,16,17.692074636801557,20.050233055506126,16.512995427449269,21.229312264858414,15.333916218096984,22.408391474210699,18.871153846153842,null,0,0,null,null,null,null,null,null,null,null,null,null,27,18.100000000000001,27,0.25654605568819322,0.74345394431180678,0.24104017156585433,-147.51165367242385,-0.65651277148568221]
[null,null,{"$f":"IF('Eingabe und Diagramm'!C32=\"\",\"\",'Eingabe und Diagramm'!C32)","v":18},null,null,{"$f":"IF('Eingabe und Diagramm'!F32=\"\",\"\",'Eingabe und Diagramm'!F32)","v":18.5},null,null,{"$f":"IF('Eingabe und Diagramm'!I32=\"\",\"\",'Eingabe und Diagramm'!I32)","v":""},null,null,{"$f":"IF('Eingabe und Diagramm'!L32=\"\",\"\",'Eingabe und Diagramm'!L32)","v":""},null,null,null,null,null,null,null,null,null,null,null,null,null,null,null,null,null,28,28,18,23,16,17.692074636801557,20.050233055506126,16.512995427449269,21.229312264858414,15.333916218096984,22.408391474210699,18.871153846153842,null,0,0,null,null,null,null,null,null,null,null,null,null,28,18.100000000000001,28,0.25654605568819322,0.74345394431180678,0.24104017156585433,-153.07813116949646,-0.62701204299456692]
[null,null,{"$f":"IF('Eingabe und Diagramm'!C33=\"\",\"\",'Eingabe und Diagramm'!C33)","v":20.9},null,null,{"$f":"IF('Eingabe und Diagramm'!F33=\"\",\"\",'Eingabe und Diagramm'!F33)","v":19},null,null,{"$f":"IF('Eingabe und Diagramm'!I33=\"\",\"\",'Eingabe und Diagramm'!I33)","v":""},null,null,{"$f":"IF('Eingabe und Diagramm'!L33=\"\",\"\",'Eingabe und Diagramm'!L33)","v":""},null,null,null,null,null,null,null,null,null,null,null,null,null,null,null,null,null,29,29,20.9,23,16,17.692074636801557,20.050233055506126,16.512995427449269,21.229312264858414,15.333916218096984,22.408391474210699,18.871153846153842,null,0,0,null,null,null,null,null,null,null,null,null,null,29,18.3,29,0.31404863902535007,0.68595136097464993,0.24104017156585433,-147.11694733782602,-0.59804721543276562]
[null,null,{"$f":"IF('Eingabe und Diagramm'!C34=\"\",\"\",'Eingabe und Diagramm'!C34)","v":18.100000000000001},null,null,{"$f":"IF('Eingabe und Diagramm'!F34=\"\",\"\",'Eingabe und Diagramm'!F34)","v":20.6},null,null,{"$f":"IF('Eingabe und Diagramm'!I34=\"\",\"\",'Eingabe und Diagramm'!I34)","v":""},null,null,{"$f":"IF('Eingabe und Diagramm'!L34=\"\",\"\",'Eingabe und Diagramm'!L34)","v":""},null,null,null,null,null,null,null,null,null,null,null,null,null,null,null,null,null,30,30,18.100000000000001,23,16,17.692074636801557,20.050233055506126,16.512995427449269,21.229312264858414,15.333916218096984,22.408391474210699,18.871153846153842,null,0,0,null,null,null,null,null,null,null,null,null,null,30,18.3,30,0.31404863902535007,0.68595136097464993,0.26823869665696798,-145.97104092579491,-0.56957569489642701]
[null,null,{"$f":"IF('Eingabe und Diagramm'!C35=\"\",\"\",'Eingabe und Diagramm'!C35)","v":19.399999999999999},null,null,{"$f":"IF('Eingabe und Diagramm'!F35=\"\",\"\",'Eingabe und Diagramm'!F35)","v":19.2},null,null,{"$f":"IF('Eingabe und Diagramm'!I35=\"\",\"\",'Eingabe und Diagramm'!I35)","v":""},null,null,{"$f":"IF('Eingabe und Diagramm'!L35=\"\",\"\",'Eingabe und Diagramm'!L35)","v":""},null,null,null,null,null,null,null,null,null,null,null,null,null,null,null,null,null,31,31,19.399999999999999,23,16,17.692074636801557,20.050233055506126,16.512995427449269,21.229312264858414,15.333916218096984,22.408391474210699,18.871153846153842,null,0,0,null,null,null,null,null,null,null,null,null,null,31,18.3,31,0.31404863902535007,0.68595136097464993,0.26823869665696798,-150.91921180463541,-0.54155861890836698]
[null,null,{"$f":"IF('Eingabe und Diagramm'!C36=\"\",\"\",'Eingabe und Diagramm'!C36)","v":20.5},null,null,{"$f":"IF('Eingabe und Diagramm'!F36=\"\",\"\",'Eingabe und Diagramm'!F36)","v":17.100000000000001},null,null,{"$f":"IF('Eingabe und Diagramm'!I36=\"\",\"\",'Eingabe und Diagramm'!I36)","v":""},null,null,{"$f":"IF('Eingabe und Diagramm'!L36=\"\",\"\",'Eingabe und Diagramm'!L36)","v":""},null,null,null,null,null,null,null,null,null,null,null,null,null,null,null,null,null,32,32,20.5,23,16,17.692074636801557,20.050233055506126,16.512995427449269,21.229312264858414,15.333916218096984,22.408391474210699,18.871153846153842,null,0,0,null,null,null,null,null,null,null,null,null,null,32,18.399999999999999,32,0.34472751687281855,0.65527248312718145,0.26823869665696798,-149.99537800061287,-0.51396037685665386]
[null,null,{"$f":"IF('Eingabe und Diagramm'!C37=\"\",\"\",'Eingabe und Diagramm'!C37)","v":20.399999999999999},null,null,{"$f":"IF('Eingabe und Diagramm'!F37=\"\",\"\",'Eingabe und Diagramm'!F37)","v":16.3},null,null,{"$f":"IF('Eingabe und Diagramm'!I37=\"\",\"\",'Eingabe und Diagramm'!I37)","v":""},null,null,{"$f":"IF('Eingabe und Diagramm'!L37=\"\",\"\",'Eingabe und Diagramm'!L37)","v":""},null,null,null,null,null,null,null,null,null,null,null,null,null,null,null,null,null,33,{"$f":"IF((Anzahl>AD37),AD37,Anzahl)","v":33},20.399999999999999,{"$f":"IF(C37<>\"\",OGW,AG36)","v":23},{"$f":"IF(C37<>\"\",UGW,AH36)","v":16},17.692074636801557,20.050233055506126,16.512995427449269,21.229312264858414,15.333916218096984,22.408391474210699,18.871153846153842,null,{"$f":"IF(AND(C37<>\"\",C37<UGW),1,0)","v":0},{"$f":"IF(AND(C37<>\"\",C37>OGW),1,0)","v":0},null,null,null,null,null,null,null,null,null,null,33,{"$f":"IF(C37=\"\",NA(),SMALL(xi,BE37))","v":18.399999999999999},33,{"$f":"IF(C37=\"\",\"\",NORMSDIST((BD37-fxds)/Standardabweichung))","v":0.34472751687281855},{"$f":"IF(C37=\"\",\"\",1-BF37)","v":0.65527248312718145},{"$f":"IF(C37=\"\",\"\",SMALL(BG,BE37))","v":0.29690028137437197},{"$f":"IF(C37=\"\",\"\",(2*BE37-1)*(LN(BH37)+LN(BF37)))","v":-148.15839542939852},{"$f":"IF(C37=\"\",NA(),NORMSINV((BE37-0.3)/(Anzahl+0.4)))","v":-0.48674820211837072}]
[null,null,{"$f":"IF('Eingabe und Diagramm'!C38=\"\",\"\",'Eingabe und Diagramm'!C38)","v":16.100000000000001},null,null,{"$f":"IF('Eingabe und Diagramm'!F38=\"\",\"\",'Eingabe und Diagramm'!F38)","v":17.2},null,null,{"$f":"IF('Eingabe und Diagramm'!I38=\"\",\"\",'Eingabe und Diagramm'!I38)","v":""},null,null,{"$f":"IF('Eingabe und Diagramm'!L38=\"\",\"\",'Eingabe und Diagramm'!L38)","v":""},null,null,null,null,null,null,null,null,null,null,null,null,null,null,null,null,null,34,34,16.100000000000001,23,16,{"$f":"AI37","v":17.692074636801557},20.050233055506126,16.512995427449269,21.229312264858414,15.333916218096984,22.408391474210699,18.871153846153842,null,0,0,null,null,null,null,null,null,null,null,null,null,34,18.399999999999999,{"$f":"IF(C38=\"\",\"\",1+BE37)","v":34},0.34472751687281855,0.65527248312718145,0.29690028137437197,-152.71711528876463,-0.45989182307066268]
[null,null,{"$f":"IF('Eingabe und Diagramm'!C39=\"\",\"\",'Eingabe und Diagramm'!C39)","v":18.7},null,null,{"$f":"IF('Eingabe und Diagramm'!F39=\"\",\"\",'Eingabe und Diagramm'!F39)","v":17.899999999999999},null,null,{"$f":"IF('Eingabe und Diagramm'!I39=\"\",\"\",'Eingabe und Diagramm'!I39)","v":""},null,null,{"$f":"IF('Eingabe und Diagramm'!L39=\"\",\"\",'Eingabe und Diagramm'!L39)","v":""},null,null,null,null,null,null,null,null,null,null,null,null,null,null,null,null,null,35,35,18.7,23,16,17.692074636801557,20.050233055506126,16.512995427449269,21.229312264858414,15.333916218096984,22.408391474210699,18.871153846153842,null,0,0,null,null,null,null,null,null,null,null,null,null,35,18.5,35,0.37646328880805591,0.62353671119194409,0.29690028137437197,-151.19926478163634,-0.43336316276311609]
[null,null,{"$f":"IF('Eingabe und Diagramm'!C40=\"\",\"\",'Eingabe und Diagramm'!C40)","v":18.8},null,null,{"$f":"IF('Eingabe und Diagramm'!F40=\"\",\"\",'Eingabe und Diagramm'!F40)","v":19.100000000000001},null,null,{"$f":"IF('Eingabe und Diagramm'!I40=\"\",\"\",'Eingabe und Diagramm'!I40)","v":""},null,null,{"$f":"IF('Eingabe und Diagramm'!L40=\"\",\"\",'Eingabe und Diagramm'!L40)","v":""},null,null,null,null,null,null,null,null,null,null,null,null,null,null,null,null,null,36,36,18.8,23,16,17.692074636801557,20.050233055506126,16.512995427449269,21.229312264858414,15.333916218096984,22.408391474210699,18.871153846153842,null,0,0,null,null,null,null,null,null,null,null,null,null,36,18.5,36,0.37646328880805591,0.62353671119194409,0.3268872805274724,-148.75029790352565,-0.40713607901947585]
[null,null,{"$f":"IF('Eingabe und Diagramm'!C41=\"\",\"\",'Eingabe und Diagramm'!C41)","v":17.3},null,null,{"$f":"IF('Eingabe und Diagramm'!F41=\"\",\"\",'Eingabe und Diagramm'!F41)","v":17.3},null,null,{"$f":"IF('Eingabe und Diagramm'!I41=\"\",\"\",'Eingabe und Diagramm'!I41)","v":""},null,null,{"$f":"IF('Eingabe und Diagramm'!L41=\"\",\"\",'Eingabe und Diagramm'!L41)","v":""},null,null,null,null,null,null,null,null,null,null,null,null,null,null,null,null,null,37,37,17.3,23,16,17.692074636801557,20.050233055506126,16.512995427449269,21.229312264858414,15.333916218096984,22.408391474210699,18.871153846153842,null,0,0,null,null,null,null,null,null,null,null,null,null,37,18.5,37,0.37646328880805591,0.62353671119194409,0.3268872805274724,-152.94044714024469,-0.38118613829468895]
[null,null,{"$f":"IF('Eingabe und Diagramm'!C42=\"\",\"\",'Eingabe und Diagramm'!C42)","v":18.100000000000001},null,null,{"$f":"IF('Eingabe und Diagramm'!F42=\"\",\"\",'Eingabe und Diagramm'!F42)","v":19.399999999999999},null,null,{"$f":"IF('Eingabe und Diagramm'!I42=\"\",\"\",'Eingabe und Diagramm'!I42)","v":""},null,null,{"$f":"IF('Eingabe und Diagramm'!L42=\"\",\"\",'Eingabe und Diagramm'!L42)","v":""},null,null,null,null,null,null,null,null,null,null,null,null,null,null,null,null,null,38,38,18.100000000000001,23,16,17.692074636801557,20.050233055506126,16.512995427449269,21.229312264858414,15.333916218096984,22.408391474210699,18.871153846153842,null,0,0,null,null,null,null,null,null,null,null,null,null,38,18.5,38,0.37646328880805591,0.62353671119194409,0.3268872805274724,-157.13059637696372,-0.35549041783953095]
[null,null,{"$f":"IF('Eingabe und Diagramm'!C43=\"\",\"\",'Eingabe und Diagramm'!C43)","v":19.899999999999999},null,null,{"$f":"IF('Eingabe und Diagramm'!F43=\"\",\"\",'Eingabe und Diagramm'!F43)","v":18.3},null,null,{"$f":"IF('Eingabe und Diagramm'!I43=\"\",\"\",'Eingabe und Diagramm'!I43)","v":""},null,null,{"$f":"IF('Eingabe und Diagramm'!L43=\"\",\"\",'Eingabe und Diagramm'!L43)","v":""},null,null,null,null,null,null,null,null,null,null,null,null,null,null,null,null,null,39,39,19.899999999999999,23,16,17.692074636801557,20.050233055506126,16.512995427449269,21.229312264858414,15.333916218096984,22.408391474210699,18.871153846153842,null,0,0,null,null,null,null,null,null,null,null,null,null,39,18.5,39,0.37646328880805591,0.62353671119194409,0.3268872805274724,-161.32074561368276,-0.33002733169669207]
[null,null,{"$f":"IF('Eingabe und Diagramm'!C44=\"\",\"\",'Eingabe und Diagramm'!C44)","v":19.600000000000001},null,null,{"$f":"IF('Eingabe und Diagramm'!F44=\"\",\"\",'Eingabe und Diagramm'!F44)","v":19.3},null,null,{"$f":"IF('Eingabe und Diagramm'!I44=\"\",\"\",'Eingabe und Diagramm'!I44)","v":""},null,null,{"$f":"IF('Eingabe und Diagramm'!L44=\"\",\"\",'Eingabe und Diagramm'!L44)","v":""},null,null,null,null,null,null,null,null,null,null,null,null,null,null,null,null,null,40,40,19.600000000000001,23,16,17.692074636801557,20.050233055506126,16.512995427449269,21.229312264858414,15.333916218096984,22.408391474210699,18.871153846153842,null,0,0,null,null,null,null,null,null,null,null,null,null,40,18.600000000000001,40,0.40905721110995685,0.59094278889004315,0.35803625686024121,-151.76068063184695,-0.30477647682692849]
[null,null,{"$f":"IF('Eingabe und Diagramm'!C45=\"\",\"\",'Eingabe und Diagramm'!C45)","v":18.399999999999999},null,null,{"$f":"IF('Eingabe und Diagramm'!F45=\"\",\"\",'Eingabe und Diagramm'!F45)","v":17.2},null,null,{"$f":"IF('Eingabe und Diagramm'!I45=\"\",\"\",'Eingabe und Diagramm'!I45)","v":""},null,null,{"$f":"IF('Eingabe und Diagramm'!L45=\"\",\"\",'Eingabe und Diagramm'!L45)","v":""},null,null,null,null,null,null,null,null,null,null,null,null,null,null,null,null,null,41,41,18.399999999999999,23,16,17.692074636801557,20.050233055506126,16.512995427449269,21.229312264858414,15.333916218096984,22.408391474210699,18.871153846153842,null,0,0,null,null,null,null,null,null,null,null,null,null,41,18.600000000000001,41,0.40905721110995685,0.59094278889004315,0.35803625686024121,-155.60272317948863,-0.27971849628504075]
[null,null,{"$f":"IF('Eingabe und Diagramm'!C46=\"\",\"\",'Eingabe und Diagramm'!C46)","v":19.5},null,null,{"$f":"IF('Eingabe und Diagramm'!F46=\"\",\"\",'Eingabe und Diagramm'!F46)","v":17.5},null,null,{"$f":"IF('Eingabe und Diagramm'!I46=\"\",\"\",'Eingabe und Diagramm'!I46)","v":""},null,null,{"$f":"IF('Eingabe und Diagramm'!L46=\"\",\"\",'Eingabe und Diagramm'!L46)","v":""},null,null,null,null,null,null,null,null,null,null,null,null,null,null,null,null,null,42,42,19.5,23,16,17.692074636801557,20.050233055506126,16.512995427449269,21.229312264858414,15.333916218096984,22.408391474210699,18.871153846153842,null,0,0,null,null,null,null,null,null,null,null,null,null,42,18.600000000000001,42,0.40905721110995685,0.59094278889004315,0.39016047107651608,-152.31308523294828,-0.25483495686606245]
[null,null,{"$f":"IF('Eingabe und Diagramm'!C47=\"\",\"\",'Eingabe und Diagramm'!C47)","v":16.8},null,null,{"$f":"IF('Eingabe und Diagramm'!F47=\"\",\"\",'Eingabe und Diagramm'!F47)","v":19.600000000000001},null,null,{"$f":"IF('Eingabe und Diagramm'!I47=\"\",\"\",'Eingabe und Diagramm'!I47)","v":""},null,null,{"$f":"IF('Eingabe und Diagramm'!L47=\"\",\"\",'Eingabe und Diagramm'!L47)","v":""},null,null,null,null,null,null,null,null,null,null,null,null,null,null,null,null,null,43,43,16.8,23,16,17.692074636801557,20.050233055506126,16.512995427449269,21.229312264858414,15.333916218096984,22.408391474210699,18.871153846153842,null,0,0,null,null,null,null,null,null,null,null,null,null,43,18.7,43,0.44229270589539782,0.55770729410460218,0.39016047107651608,-149.34334638770039,-0.23010823904727501]
[null,null,{"$f":"IF('Eingabe und Diagramm'!C48=\"\",\"\",'Eingabe und Diagramm'!C48)","v":17.100000000000001},null,null,{"$f":"IF('Eingabe und Diagramm'!F48=\"\",\"\",'Eingabe und Diagramm'!F48)","v":17.600000000000001},null,null,{"$f":"IF('Eingabe und Diagramm'!I48=\"\",\"\",'Eingabe und Diagramm'!I48)","v":""},null,null,{"$f":"IF('Eingabe und Diagramm'!L48=\"\",\"\",'Eingabe und Diagramm'!L48)","v":""},null,null,null,null,null,null,null,null,null,null,null,null,null,null,null,null,null,44,44,17.100000000000001,23,16,17.692074636801557,20.050233055506126,16.512995427449269,21.229312264858414,15.333916218096984,22.408391474210699,18.871153846153842,null,0,0,null,null,null,null,null,null,null,null,null,null,44,18.7,44,0.44229270589539782,0.55770729410460218,0.42305314736859834,-145.81555390482453,-0.20552143738092812]
[null,null,{"$f":"IF('Eingabe und Diagramm'!C49=\"\",\"\",'Eingabe und Diagramm'!C49)","v":18.899999999999999},null,null,{"$f":"IF('Eingabe und Diagramm'!F49=\"\",\"\",'Eingabe und Diagramm'!F49)","v":20},null,null,{"$f":"IF('Eingabe und Diagramm'!I49=\"\",\"\",'Eingabe und Diagramm'!I49)","v":""},null,null,{"$f":"IF('Eingabe und Diagramm'!L49=\"\",\"\",'Eingabe und Diagramm'!L49)","v":""},null,null,null,null,null,null,null,null,null,null,null,null,null,null,null,null,null,45,45,18.899999999999999,23,16,17.692074636801557,20.050233055506126,16.512995427449269,21.229312264858414,15.333916218096984,22.408391474210699,18.871153846153842,null,0,0,null,null,null,null,null,null,null,null,null,null,45,18.7,45,0.44229270589539782,0.55770729410460218,0.42305314736859834,-149.16763560378601,-0.18105826976082212]
[null,null,{"$f":"IF('Eingabe und Diagramm'!C50=\"\",\"\",'Eingabe und Diagramm'!C50)","v":19.7},null,null,{"$f":"IF('Eingabe und Diagramm'!F50=\"\",\"\",'Eingabe und Diagramm'!F50)","v":19.899999999999999},null,null,{"$f":"IF('Eingabe und Diagramm'!I50=\"\",\"\",'Eingabe und Diagramm'!I50)","v":""},null,null,{"$f":"IF('Eingabe und Diagramm'!L50=\"\",\"\",'Eingabe und Diagramm'!L50)","v":""},null,null,null,null,null,null,null,null,null,null,null,null,null,null,null,null,null,46,46,19.7,23,16,17.692074636801557,20.050233055506126,16.512995427449269,21.229312264858414,15.333916218096984,22.408391474210699,18.871153846153842,null,0,0,null,null,null,null,null,null,null,null,null,null,46,18.7,46,0.44229270589539782,0.55770729410460218,0.42305314736859834,-152.51971730274749,-0.15670299420489808]
[null,null,{"$f":"IF('Eingabe und Diagramm'!C51=\"\",\"\",'Eingabe und Diagramm'!C51)","v":19.7},null,null,{"$f":"IF('Eingabe und Diagramm'!F51=\"\",\"\",'Eingabe und Diagramm'!F51)","v":16.899999999999999},null,null,{"$f":"IF('Eingabe und Diagramm'!I51=\"\",\"\",'Eingabe und Diagramm'!I51)","v":""},null,null,{"$f":"IF('Eingabe und Diagramm'!L51=\"\",\"\",'Eingabe und Diagramm'!L51)","v":""},null,null,null,null,null,null,null,null,null,null,null,null,null,null,null,null,null,47,47,19.7,23,16,17.692074636801557,20.050233055506126,16.512995427449269,21.229312264858414,15.333916218096984,22.408391474210699,18.871153846153842,null,0,0,null,null,null,null,null,null,null,null,null,null,47,18.8,47,0.47593965060846943,0.52406034939153057,0.42305314736859834,-149.05311634746414,-0.13244033197477662]
[null,null,{"$f":"IF('Eingabe und Diagramm'!C52=\"\",\"\",'Eingabe und Diagramm'!C52)","v":19.2},null,null,{"$f":"IF('Eingabe und Diagramm'!F52=\"\",\"\",'Eingabe und Diagramm'!F52)","v":19.5},null,null,{"$f":"IF('Eingabe und Diagramm'!I52=\"\",\"\",'Eingabe und Diagramm'!I52)","v":""},null,null,{"$f":"IF('Eingabe und Diagramm'!L52=\"\",\"\",'Eingabe und Diagramm'!L52)","v":""},null,null,null,null,null,null,null,null,null,null,null,null,null,null,null,null,null,48,48,19.2,23,16,17.692074636801557,20.050233055506126,16.512995427449269,21.229312264858414,15.333916218096984,22.408391474210699,18.871153846153842,null,0,0,null,null,null,null,null,null,null,null,null,null,48,18.8,48,0.47593965060846943,0.52406034939153057,0.45649142289666167,-145.03171059243346,-0.10825539599895463]
[null,null,{"$f":"IF('Eingabe und Diagramm'!C53=\"\",\"\",'Eingabe und Diagramm'!C53)","v":20.6},null,null,{"$f":"IF('Eingabe und Diagramm'!F53=\"\",\"\",'Eingabe und Diagramm'!F53)","v":20.399999999999999},null,null,{"$f":"IF('Eingabe und Diagramm'!I53=\"\",\"\",'Eingabe und Diagramm'!I53)","v":""},null,null,{"$f":"IF('Eingabe und Diagramm'!L53=\"\",\"\",'Eingabe und Diagramm'!L53)","v":""},null,null,null,null,null,null,null,null,null,null,null,null,null,null,null,null,null,49,49,20.6,23,16,17.692074636801557,20.050233055506126,16.512995427449269,21.229312264858414,15.333916218096984,22.408391474210699,18.871153846153842,null,0,0,null,null,null,null,null,null,null,null,null,null,49,18.8,49,0.47593965060846943,0.52406034939153057,0.45649142289666167,-148.08500976280047,-8.4133623684707962E-2]
[null,null,{"$f":"IF('Eingabe und Diagramm'!C54=\"\",\"\",'Eingabe und Diagramm'!C54)","v":20.100000000000001},null,null,{"$f":"IF('Eingabe und Diagramm'!F54=\"\",\"\",'Eingabe und Diagramm'!F54)","v":19.100000000000001},null,null,{"$f":"IF('Eingabe und Diagramm'!I54=\"\",\"\",'Eingabe und Diagramm'!I54)","v":""},null,null,{"$f":"IF('Eingabe und Diagramm'!L54=\"\",\"\",'Eingabe und Diagramm'!L54)","v":""},null,null,null,null,null,null,null,null,null,null,null,null,null,null,null,null,null,50,50,20.100000000000001,23,16,{"$f":"AI53","v":17.692074636801557},20.050233055506126,16.512995427449269,21.229312264858414,15.333916218096984,22.408391474210699,18.871153846153842,null,0,0,null,null,null,null,null,null,null,null,null,null,50,18.8,50,0.47593965060846943,0.52406034939153057,0.45649142289666167,-151.13830893316748,-6.0060713299041946E-2]
[null,null,{"$f":"IF(F5=\"\",\"\",F5)","v":18.8},null,null,null,null,null,null,null,null,null,null,null,null,null,null,null,null,null,null,null,null,null,null,null,null,null,null,51,51,18.8,23,16,17.692074636801557,20.050233055506126,16.512995427449269,21.229312264858414,15.333916218096984,22.408391474210699,18.871153846153842,null,0,0,null,null,null,null,null,null,null,null,null,null,51,18.899999999999999,51,0.50975914291590185,0.49024085708409815,0.45649142289666167,-147.25823245848144,-3.6022563174729849E-2]
[null,null,{"$f":"IF(F6=\"\",\"\",F6)","v":17.100000000000001},null,null,null,null,null,null,null,null,null,null,null,null,null,null,null,null,null,null,null,null,null,null,null,null,null,null,52,52,17.100000000000001,23,16,17.692074636801557,20.050233055506126,16.512995427449269,21.229312264858414,15.333916218096984,22.408391474210699,18.871153846153842,null,0,0,null,null,null,null,null,null,null,null,null,null,52,18.899999999999999,52,0.50975914291590185,0.49024085708409815,0.49024085708409815,-142.82756591023269,-1.2005213056198949E-2]
[null,null,{"$f":"IF(F7=\"\",\"\",F7)","v":18.600000000000001},null,null,null,null,null,null,null,null,null,null,null,null,null,null,null,null,null,null,null,null,null,null,null,null,null,null,53,53,18.600000000000001,23,16,17.692074636801557,20.050233055506126,16.512995427449269,21.229312264858414,15.333916218096984,22.408391474210699,18.871153846153842,null,0,0,null,null,null,null,null,null,null,null,null,null,53,18.899999999999999,53,0.50975914291590185,0.49024085708409815,0.49024085708409815,-145.60091670460613,1.2005213056199089E-2]
[null,null,{"$f":"IF(F8=\"\",\"\",F8)","v":18},null,null,null,null,null,null,null,null,null,null,null,null,null,null,null,null,null,null,null,null,null,null,null,null,null,null,54,54,18,23,16,17.692074636801557,20.050233055506126,16.512995427449269,21.229312264858414,15.333916218096984,22.408391474210699,18.871153846153842,null,0,0,null,null,null,null,null,null,null,null,null,null,54,19,54,0.54350857710333833,0.45649142289666167,0.49024085708409815,-141.5148032724899,3.6022563174729849E-2]
[null,null,18.7,null,null,null,null,null,null,null,null,null,null,null,null,null,null,null,null,null,null,null,null,null,null,null,null,null,null,55,55,18.7,23,16,17.692074636801557,20.050233055506126,16.512995427449269,21.229312264858414,15.333916218096984,22.408391474210699,18.871153846153842,null,0,0,null,null,null,null,null,null,null,null,null,null,55,19,55,0.54350857710333833,0.45649142289666167,0.52406034939153057,-136.88854619851196,6.0060713299041946E-2]
[null,null,20.3,null,null,null,null,null,null,null,null,null,null,null,null,null,null,null,null,null,null,null,null,null,null,null,null,null,null,56,56,20.3,23,16,17.692074636801557,20.050233055506126,16.512995427449269,21.229312264858414,15.333916218096984,22.408391474210699,18.871153846153842,null,0,0,null,null,null,null,null,null,null,null,null,null,56,19,56,0.54350857710333833,0.45649142289666167,0.52406034939153057,-139.40026264252137,8.4133623684707823E-2]
[null,null,18.7,null,null,null,null,null,null,null,null,null,null,null,null,null,null,null,null,null,null,null,null,null,null,null,null,null,null,57,57,18.7,23,16,17.692074636801557,20.050233055506126,16.512995427449269,21.229312264858414,15.333916218096984,22.408391474210699,18.871153846153842,null,0,0,null,null,null,null,null,null,null,null,null,null,57,19,57,0.54350857710333833,0.45649142289666167,0.52406034939153057,-141.91197908653075,0.10825539599895477]
[null,null,18.8,null,null,null,null,null,null,null,null,null,null,null,null,null,null,null,null,null,null,null,null,null,null,null,null,null,null,58,58,18.8,23,16,17.692074636801557,20.050233055506126,16.512995427449269,21.229312264858414,15.333916218096984,22.408391474210699,18.871153846153842,null,0,0,null,null,null,null,null,null,null,null,null,null,58,19.100000000000001,58,0.57694685263140166,0.42305314736859834,0.52406034939153057,-137.55765908246926,0.13244033197477662]
[null,null,19.399999999999999,null,null,null,null,null,null,null,null,null,null,null,null,null,null,null,null,null,null,null,null,null,null,null,null,null,null,59,59,19.399999999999999,23,16,17.692074636801557,20.050233055506126,16.512995427449269,21.229312264858414,15.333916218096984,22.408391474210699,18.871153846153842,null,0,0,null,null,null,null,null,null,null,null,null,null,59,19.100000000000001,59,0.57694685263140166,0.42305314736859834,0.55770729410460218,-132.66935876716587,0.15670299420489808]
[null,null,18.5,null,null,null,null,null,null,null,null,null,null,null,null,1,{"$f":"Minimum","v":16.100000000000001},{"$f":"Q64+T64","v":16.55},{"$f":"(R64+Q64)/2","v":16.325000000000003},{"$f":"Spannweite/AnzahlKlassenHistogramm","v":0.4499999999999999},{"$f":"FREQUENCY(xi,R64)","v":3},{"$f":"$U64/Anzahl","v":2.8846153846153848E-2},{"$f":"U64","v":3},{"$f":"W64/Anzahl","v":2.8846153846153848E-2},{"$f":"X64/T64","v":6.4102564102564125E-2},null,null,null,null,60,60,18.5,23,16,17.692074636801557,20.050233055506126,16.512995427449269,21.229312264858414,15.333916218096984,22.408391474210699,18.871153846153842,null,0,0,null,null,null,null,null,null,null,null,null,null,60,19.100000000000001,60,0.57694685263140166,0.42305314736859834,0.55770729410460218,-134.9372110537841,0.18105826976082223]
[null,null,18.600000000000001,null,null,null,null,null,null,null,null,null,null,null,null,2,{"$f":"IF(AnzahlKlassenHistogramm<P65,Q64,Q64+T65+0.00000001)","v":16.550000010000002},{"$f":"Q65+T65","v":17.000000010000001},{"$f":"(R65+Q65)/2","v":16.775000009999999},0.4499999999999999,7,6.7307692307692304E-2,{"$f":"U65-U64","v":4},3.8461538461538464E-2,{"$f":"X65/T65","v":8.54700854700855E-2},null,null,null,null,61,61,18.600000000000001,23,16,17.692074636801557,20.050233055506126,16.512995427449269,21.229312264858414,15.333916218096984,22.408391474210699,18.871153846153842,null,0,0,null,null,null,null,null,null,null,null,null,null,61,19.100000000000001,61,0.57694685263140166,0.42305314736859834,0.55770729410460218,-137.20506334040232,0.20552143738092812]
[null,null,19.600000000000001,null,null,null,null,null,null,null,null,null,null,null,null,3,17.000000020000002,{"$f":"Q66+T66","v":17.450000020000001},{"$f":"(R66+Q66)/2","v":17.225000020000003},0.4499999999999999,15,0.14423076923076922,{"$f":"U66-U65","v":8},7.6923076923076927E-2,{"$f":"X66/T66","v":0.170940170940171},null,null,null,null,62,62,19.600000000000001,23,16,17.692074636801557,20.050233055506126,16.512995427449269,21.229312264858414,15.333916218096984,22.408391474210699,18.871153846153842,null,0,0,null,null,null,null,null,null,null,null,null,null,62,19.2,62,0.60983952892348392,0.39016047107651608,0.55770729410460218,-132.65309418519672,0.23010823904727501]
[null,null,18.5,null,null,null,null,null,null,null,null,null,null,null,null,4,17.450000030000002,17.900000030000001,17.67500003,0.4499999999999999,22,0.21153846153846154,7,6.7307692307692304E-2,0.1495726495726496,null,null,null,null,63,63,18.5,23,16,17.692074636801557,20.050233055506126,16.512995427449269,21.229312264858414,15.333916218096984,22.408391474210699,18.871153846153842,null,0,0,null,null,null,null,null,null,null,null,null,null,63,19.2,63,0.60983952892348392,0.39016047107651608,0.59094278889004315,-127.57443674150112,0.25483495686606233]
[null,null,20,null,null,null,null,null,null,null,null,null,null,null,null,5,17.900000040000002,18.350000040000001,18.125000040000003,0.4499999999999999,31,0.29807692307692307,9,8.6538461538461536E-2,0.19230769230769235,null,null,null,null,64,64,20,23,16,17.692074636801557,20.050233055506126,16.512995427449269,21.229312264858414,15.333916218096984,22.408391474210699,18.871153846153842,null,0,0,null,null,null,null,null,null,null,null,null,null,64,19.3,64,0.64196374313975879,0.35803625686024121,0.59094278889004315,-123.09595928352576,0.27971849628504092]
[null,null,17.8,null,null,null,null,null,null,null,null,null,null,null,null,6,18.350000050000002,18.800000050000001,18.57500005,0.4499999999999999,50,0.48076923076923078,19,0.18269230769230768,0.40598290598290604,null,null,null,null,65,{"$f":"IF((Anzahl>AD69),AD69,Anzahl)","v":65},17.8,{"$f":"IF(C69<>\"\",OGW,AG68)","v":23},{"$f":"IF(C69<>\"\",UGW,AH68)","v":16},17.692074636801557,20.050233055506126,16.512995427449269,21.229312264858414,15.333916218096984,22.408391474210699,18.871153846153842,null,{"$f":"IF(AND(C69<>\"\",C69<UGW),1,0)","v":0},{"$f":"IF(AND(C69<>\"\",C69>OGW),1,0)","v":0},null,null,null,null,null,null,null,null,null,null,65,{"$f":"IF(C69=\"\",NA(),SMALL(xi,BE69))","v":19.3},65,{"$f":"IF(C69=\"\",\"\",NORMSDIST((BD69-fxds)/Standardabweichung))","v":0.64196374313975879},{"$f":"IF(C69=\"\",\"\",1-BF69)","v":0.35803625686024121},{"$f":"IF(C69=\"\",\"\",SMALL(BG,BE69))","v":0.59094278889004315},{"$f":"IF(C69=\"\",\"\",(2*BE69-1)*(LN(BH69)+LN(BF69)))","v":-125.0344783273608},{"$f":"IF(C69=\"\",NA(),NORMSINV((BE69-0.3)/(Anzahl+0.4)))","v":0.30477647682692849}]
[null,null,19.8,null,null,null,null,null,null,null,null,null,null,null,null,7,18.800000060000002,19.250000060000001,19.025000060000004,0.4499999999999999,63,0.60576923076923073,13,0.125,0.27777777777777785,null,null,null,null,66,66,19.8,23,16,{"$f":"AI69","v":17.692074636801557},20.050233055506126,16.512995427449269,21.229312264858414,15.333916218096984,22.408391474210699,18.871153846153842,null,0,0,null,null,null,null,null,null,null,null,null,null,66,19.399999999999999,{"$f":"IF(C70=\"\",\"\",1+BE69)","v":66},0.6731127194725276,0.3268872805274724,0.62353671119194409,-113.73290462850683,0.33002733169669207]
[null,null,16.600000000000001,null,null,null,null,null,null,null,null,null,null,null,null,8,19.250000070000002,19.700000070000002,19.47500007,0.4499999999999999,78,0.75,15,0.14423076923076922,0.32051282051282054,null,null,null,null,67,67,16.600000000000001,23,16,17.692074636801557,20.050233055506126,16.512995427449269,21.229312264858414,15.333916218096984,22.408391474210699,18.871153846153842,null,0,0,null,null,null,null,null,null,null,null,null,null,67,19.399999999999999,67,0.6731127194725276,0.3268872805274724,0.62353671119194409,-115.46928485184281,0.35549041783953067]
[null,null,19.399999999999999,null,null,null,null,null,null,null,null,null,null,null,null,9,19.700000080000002,20.150000080000002,19.925000080000004,0.4499999999999999,89,0.85576923076923073,11,0.10576923076923077,0.2350427350427351,null,null,null,null,68,68,{"$f":"IF(C72<>\"\",C72,AF71)","v":19.399999999999999},23,16,17.692074636801557,20.050233055506126,16.512995427449269,21.229312264858414,15.333916218096984,22.408391474210699,18.871153846153842,null,0,0,null,null,null,null,null,null,null,null,null,null,68,19.399999999999999,68,0.6731127194725276,0.3268872805274724,0.62353671119194409,-117.2056650751788,0.38118613829468911]
[null,null,19.3,null,null,null,null,null,null,null,null,null,null,null,null,10,20.150000090000002,20.600000090000002,20.37500009,0.4499999999999999,100,0.96153846153846156,11,0.10576923076923077,0.2350427350427351,null,null,null,null,69,69,19.3,23,16,17.692074636801557,20.050233055506126,16.512995427449269,21.229312264858414,15.333916218096984,22.408391474210699,18.871153846153842,null,0,0,null,null,null,null,null,null,null,null,null,null,69,19.399999999999999,69,0.6731127194725276,0.3268872805274724,0.62353671119194409,-118.94204529851478,0.40713607901947585]
[null,null,20.100000000000001,null,null,null,null,null,null,null,null,null,null,null,null,11,20.600000100000003,21.050000100000002,20.825000100000004,0.4499999999999999,103,0.99038461538461542,3,2.8846153846153848E-2,6.4102564102564125E-2,null,null,null,null,70,70,20.100000000000001,23,16,17.692074636801557,20.050233055506126,16.512995427449269,21.229312264858414,15.333916218096984,22.408391474210699,18.871153846153842,null,0,0,null,null,null,null,null,null,null,null,null,null,70,19.5,70,0.70309971862562803,0.29690028137437197,0.62353671119194409,-114.61998190214157,0.43336316276311609]
[null,null,20.5,null,null,null,null,null,null,null,null,null,null,null,null,12,21.050000110000003,21.500000110000002,21.275000110000001,0.4499999999999999,104,1,1,9.6153846153846159E-3,2.1367521367521375E-2,null,null,null,null,71,71,20.5,23,16,17.692074636801557,20.050233055506126,16.512995427449269,21.229312264858414,15.333916218096984,22.408391474210699,18.871153846153842,null,0,0,null,null,null,null,null,null,null,null,null,null,71,19.5,71,0.70309971862562803,0.29690028137437197,0.65527248312718145,-109.26945518159499,0.45989182307066245]
[null,null,20,null,null,null,null,null,null,null,null,null,null,null,null,13,21.050000110000003,21.500000110000002,21.275000110000001,0.4499999999999999,104,1,0,0,0,null,null,null,null,72,72,20,23,16,17.692074636801557,20.050233055506126,16.512995427449269,21.229312264858414,15.333916218096984,22.408391474210699,18.871153846153842,null,0,0,null,null,null,null,null,null,null,null,null,null,72,19.5,72,0.70309971862562803,0.29690028137437197,0.65527248312718145,-110.81937653168855,0.48674820211837083]
[null,null,20.8,null,null,null,null,null,null,null,null,null,null,null,null,14,21.050000110000003,21.500000110000002,21.275000110000001,0.4499999999999999,104,1,0,0,0,null,null,null,null,73,73,20.8,23,16,17.692074636801557,20.050233055506126,16.512995427449269,21.229312264858414,15.333916218096984,22.408391474210699,18.871153846153842,null,0,0,null,null,null,null,null,null,null,null,null,null,73,19.600000000000001,73,0.73176130334303202,0.26823869665696798,0.65527248312718145,-106.57572958300554,0.51396037685665374]
[null,null,17.7,null,null,null,null,null,null,null,null,null,null,null,null,15,21.050000110000003,21.500000110000002,21.275000110000001,0.4499999999999999,104,1,0,0,0,null,null,null,null,74,74,17.7,23,16,17.692074636801557,20.050233055506126,16.512995427449269,21.229312264858414,15.333916218096984,22.408391474210699,18.871153846153842,null,0,0,null,null,null,null,null,null,null,null,null,null,74,19.600000000000001,74,0.73176130334303202,0.26823869665696798,0.68595136097464993,-101.31967101214241,0.54155861890836687]
[null,null,18.899999999999999,null,null,null,null,null,null,null,null,null,null,null,null,16,21.050000110000003,21.500000110000002,21.275000110000001,0.4499999999999999,104,1,0,0,0,null,null,null,null,75,75,18.899999999999999,23,16,17.692074636801557,20.050233055506126,16.512995427449269,21.229312264858414,15.333916218096984,22.408391474210699,18.871153846153842,null,0,0,null,null,null,null,null,null,null,null,null,null,75,19.600000000000001,75,0.73176130334303202,0.26823869665696798,0.68595136097464993,-102.69816993747767,0.56957569489642701]
[null,null,18.8,null,null,null,null,null,null,null,null,null,null,null,null,17,21.050000110000003,21.500000110000002,21.275000110000001,0.4499999999999999,104,1,0,0,0,null,null,null,null,76,76,18.8,23,16,17.692074636801557,20.050233055506126,16.512995427449269,21.229312264858414,15.333916218096984,22.408391474210699,18.871153846153842,null,0,0,null,null,null,null,null,null,null,null,null,null,76,19.7,76,0.75895982843414567,0.24104017156585433,0.68595136097464993,-98.566002899692961,0.59804721543276562]
[null,null,16.399999999999999,null,null,null,null,null,null,null,null,null,null,null,null,18,21.050000110000003,21.500000110000002,21.275000110000001,0.4499999999999999,104,1,0,0,0,null,null,null,null,77,77,16.399999999999999,23,16,17.692074636801557,20.050233055506126,16.512995427449269,21.229312264858414,15.333916218096984,22.408391474210699,18.871153846153842,null,0,0,null,null,null,null,null,null,null,null,null,null,77,19.7,77,0.75895982843414567,0.24104017156585433,0.74345394431180678,-87.554998076367525,0.62701204299456659]
[null,null,18.5,null,null,null,null,null,null,null,null,null,null,null,null,19,21.050000110000003,21.500000110000002,21.275000110000001,0.4499999999999999,104,1,0,0,0,null,null,null,null,78,78,18.5,23,16,17.692074636801557,20.050233055506126,16.512995427449269,21.229312264858414,15.333916218096984,22.408391474210699,18.871153846153842,null,0,0,null,null,null,null,null,null,null,null,null,null,78,19.7,78,0.75895982843414567,0.24104017156585433,0.74345394431180678,-88.699507855143565,0.6565127714856821]
[null,null,19,null,null,null,null,null,null,null,null,null,null,null,null,20,21.050000110000003,21.500000110000002,21.275000110000001,0.4499999999999999,104,1,0,0,0,null,null,null,null,79,79,19,23,16,17.692074636801557,20.050233055506126,16.512995427449269,21.229312264858414,15.333916218096984,22.408391474210699,18.871153846153842,null,0,0,null,null,null,null,null,null,null,null,null,null,79,19.8,79,0.7845850997161935,0.2154149002838065,0.74345394431180678,-84.630645233343202,0.68659629362666075]
[null,null,20.6,null,null,null,null,null,null,null,null,null,null,null,null,null,null,null,null,null,null,null,null,null,null,null,null,null,null,80,80,20.6,23,16,17.692074636801557,20.050233055506126,16.512995427449269,21.229312264858414,15.333916218096984,22.408391474210699,18.871153846153842,null,0,0,null,null,null,null,null,null,null,null,null,null,80,19.8,80,0.7845850997161935,0.2154149002838065,0.7699986833467225,-80.130706952386745,0.71731447670819293]
[null,null,19.2,null,null,null,null,null,null,null,null,null,null,null,null,null,null,null,null,null,null,null,null,null,null,null,null,null,null,81,81,19.2,23,16,17.692074636801557,20.050233055506126,16.512995427449269,21.229312264858414,15.333916218096984,22.408391474210699,18.871153846153842,null,0,0,null,null,null,null,null,null,null,null,null,null,81,19.899999999999999,81,0.80855518352205247,0.19144481647794753,0.7699986833467225,-76.293524369000608,0.74872497306338026]
[null,null,17.100000000000001,null,null,null,null,null,null,null,null,null,null,null,null,null,null,null,null,null,null,null,null,null,null,null,null,null,null,82,82,17.100000000000001,23,16,{"$f":"AI85","v":17.692074636801557},20.050233055506126,16.512995427449269,21.229312264858414,15.333916218096984,22.408391474210699,18.871153846153842,null,0,0,null,null,null,null,null,null,null,null,null,null,82,19.899999999999999,82,0.80855518352205247,0.19144481647794753,0.7699986833467225,-77.241270013336006,0.78089219941060228]
[null,null,16.3,null,null,null,null,null,null,null,null,null,null,null,null,null,1.1000000000000001,{"$f":"R88-(Q87*Standardabweichung)","v":11.089231064428756},{"$f":"NORMDIST(R87,fxds,Standardabweichung,0)","v":1.1760702615790038E-10},null,null,{"$f":"OGW","v":23},{"$f":"MAX(Häufigkeitsdichte)*1.05","v":0.42628205128205138},null,null,null,null,null,null,83,83,16.3,23,16,17.692074636801557,20.050233055506126,16.512995427449269,21.229312264858414,15.333916218096984,22.408391474210699,18.871153846153842,null,0,0,null,null,null,null,null,null,null,null,null,null,83,19.899999999999999,83,0.80855518352205247,0.19144481647794753,0.79493203808860202,-72.930825454660507,0.81388852978076354]
[null,null,17.2,null,null,null,null,null,null,null,null,null,null,null,null,null,1,12.386218194716269,9.1340428676199531E-8,null,null,{"$f":"UGW","v":16},0.42628205128205138,null,null,null,null,null,null,84,84,17.2,23,16,17.692074636801557,20.050233055506126,16.512995427449269,21.229312264858414,15.333916218096984,22.408391474210699,18.871153846153842,null,0,0,null,null,null,null,null,null,null,null,null,null,84,20,84,0.83081638477736452,0.16918361522263548,0.81818407131443405,-64.464405989887481,0.84779576122809619]
[null,null,17.899999999999999,null,null,null,null,null,null,null,null,null,null,null,null,null,0.9,13.565297404068556,1.3556121573618425E-5,null,null,{"$f":"fxds+3*Standardabweichung","v":22.408391474210699},0.42628205128205138,null,null,null,null,null,null,85,85,17.899999999999999,23,16,17.692074636801557,20.050233055506126,16.512995427449269,21.229312264858414,15.333916218096984,22.408391474210699,18.871153846153842,null,0,0,null,null,null,null,null,null,null,null,null,null,85,20,85,0.83081638477736452,0.16918361522263548,0.83971283627858995,-60.847059578485137,0.88270693165662395]
[null,null,19.100000000000001,null,null,null,null,null,null,null,null,null,null,null,null,null,0.8,14.626468692485613,5.1896592295093858E-4,null,null,{"$f":"fxds-3*Standardabweichung","v":15.333916218096984},0.42628205128205138,null,null,null,null,null,null,86,86,19.100000000000001,23,16,17.692074636801557,20.050233055506126,16.512995427449269,21.229312264858414,15.333916218096984,22.408391474210699,18.871153846153842,null,0,0,null,null,null,null,null,null,null,null,null,null,86,20,86,0.83081638477736452,0.16918361522263548,0.83971283627858995,-61.567143123792654,0.91872859748633218]
[null,null,17.3,null,null,null,null,null,null,null,null,null,null,null,null,null,0.7,15.569732059967441,6.7132483722855338E-3,null,null,{"$f":"fxds","v":18.871153846153842},0.42628205128205138,null,null,null,null,null,null,87,87,17.3,23,16,17.692074636801557,20.050233055506126,16.512995427449269,21.229312264858414,15.333916218096984,22.408391474210699,18.871153846153842,null,0,0,null,null,null,null,null,null,null,null,null,null,87,20,87,0.83081638477736452,0.16918361522263548,0.85950326765535445,-58.257251387140144,0.95598371956347172]
[null,null,19.399999999999999,null,null,null,null,null,null,null,null,null,null,null,null,null,0.6,16.395087506514042,3.7303342838679261E-2,null,null,{"$f":"Sollwert","v":19},0.42628205128205138,null,null,null,null,null,null,88,88,19.399999999999999,23,16,17.692074636801557,20.050233055506126,16.512995427449269,21.229312264858414,15.333916218096984,22.408391474210699,18.871153846153842,null,0,0,null,null,null,null,null,null,null,null,null,null,88,20.100000000000001,88,0.85134244516131508,0.14865755483868492,0.87756541444999936,-51.020306425417076,0.99461536503340842]
[null,null,18.3,null,null,null,null,null,null,null,null,null,null,null,null,null,0.5,17.102535032125413,0.10984639084344539,null,null,null,null,null,null,null,null,null,null,89,89,18.3,23,16,17.692074636801557,20.050233055506126,16.512995427449269,21.229312264858414,15.333916218096984,22.408391474210699,18.871153846153842,null,0,0,null,null,null,null,null,null,null,null,null,null,89,20.100000000000001,89,0.85134244516131508,0.14865755483868492,0.87756541444999936,-51.60339564170755,1.0347915210595815]
[null,null,19.3,null,null,null,null,null,null,null,null,null,null,null,null,null,0.4,17.692074636801557,0.2052200756317869,null,null,null,null,null,null,null,null,null,null,90,90,19.3,23,16,17.692074636801557,20.050233055506126,16.512995427449269,21.229312264858414,15.333916218096984,22.408391474210699,18.871153846153842,null,0,0,null,null,null,null,null,null,null,null,null,null,90,20.2,90,0.87013304184279405,0.12986695815720595,0.90865631819703241,-42.046652760688559,1.0767114501536124]
[null,null,17.2,null,null,null,null,null,null,null,null,null,null,null,null,null,0.3,18.16370632054247,0.28261426395165845,null,null,null,null,null,null,null,null,null,null,91,91,17.2,23,16,17.692074636801557,20.050233055506126,16.512995427449269,21.229312264858414,15.333916218096984,22.408391474210699,18.871153846153842,null,0,0,null,null,null,null,null,null,null,null,null,null,91,20.3,91,0.88721169042303161,0.11278830957696839,0.90865631819703241,-38.998261875331352,1.120614225092825]
[null,null,17.5,null,null,null,null,null,null,null,null,null,null,null,null,null,0.2,18.517430083348156,0.32346242087504479,null,null,null,null,null,null,null,null,null,null,92,92,17.5,23,16,17.692074636801557,20.050233055506126,16.512995427449269,21.229312264858414,15.333916218096984,22.408391474210699,18.871153846153842,null,0,0,null,null,null,null,null,null,null,null,null,null,92,20.399999999999999,92,0.90262317216162558,9.7376827838374425E-2,0.90865631819703241,-36.277638789016201,1.1667904140077117]
[null,null,19.600000000000001,null,null,null,null,null,null,null,null,null,null,null,null,null,0.1,18.753245925218614,0.33666317269309953,null,null,null,null,null,null,null,null,null,null,93,93,19.600000000000001,23,16,17.692074636801557,20.050233055506126,16.512995427449269,21.229312264858414,15.333916218096984,22.408391474210699,18.871153846153842,null,0,0,null,null,null,null,null,null,null,null,null,null,93,20.399999999999999,93,0.90262317216162558,9.7376827838374425E-2,0.92180794455986981,-34.015672396786641,1.2155984339134929]
[null,null,17.600000000000001,null,null,null,null,null,null,null,null,null,null,null,null,null,0,{"$f":"fxds","v":18.871153846153842},0.33835070386881577,null,null,null,null,null,null,null,null,null,null,94,94,17.600000000000001,23,16,17.692074636801557,20.050233055506126,16.512995427449269,21.229312264858414,15.333916218096984,22.408391474210699,18.871153846153842,null,0,0,null,null,null,null,null,null,null,null,null,null,94,20.399999999999999,94,0.90262317216162558,9.7376827838374425E-2,0.92180794455986981,-34.383409395670817,1.2674880246380946]
[null,null,20,null,null,null,null,null,null,null,null,null,null,null,null,null,0.1,{"$f":"R98+(Q99*Standardabweichung)","v":18.989061767089069},0.33666317269309953,null,null,null,null,null,null,null,null,null,null,95,95,20,23,16,17.692074636801557,20.050233055506126,16.512995427449269,21.229312264858414,15.333916218096984,22.408391474210699,18.871153846153842,null,0,0,null,null,null,null,null,null,null,null,null,null,95,20.399999999999999,95,0.90262317216162558,9.7376827838374425E-2,0.93347081410358568,-32.374887441263837,1.3230349517479669]
[null,null,19.899999999999999,null,null,null,null,null,null,null,null,null,null,null,null,null,0.2,19.224877608959527,0.32346242087504479,null,null,null,null,null,null,null,null,null,null,96,96,19.899999999999999,23,16,17.692074636801557,20.050233055506126,16.512995427449269,21.229312264858414,15.333916218096984,22.408391474210699,18.871153846153842,null,0,0,null,null,null,null,null,null,null,null,null,null,96,20.5,96,0.91643061493501832,8.3569385064981683E-2,0.93347081410358568,-29.817870004361801,1.3829941271006372]
[null,null,16.899999999999999,null,null,null,null,null,null,null,null,null,null,null,null,null,0.3,19.578601371765213,0.28261426395165845,null,null,null,null,null,null,null,null,null,null,97,{"$f":"IF((Anzahl>AD101),AD101,Anzahl)","v":97},16.899999999999999,{"$f":"IF(C101<>\"\",OGW,AG100)","v":23},{"$f":"IF(C101<>\"\",UGW,AH100)","v":16},17.692074636801557,20.050233055506126,16.512995427449269,21.229312264858414,15.333916218096984,22.408391474210699,18.871153846153842,null,{"$f":"IF(AND(C101<>\"\",C101<UGW),1,0)","v":0},{"$f":"IF(AND(C101<>\"\",C101>OGW),1,0)","v":0},null,null,null,null,null,null,null,null,null,null,97,{"$f":"IF(C101=\"\",NA(),SMALL(xi,BE101))","v":20.5},97,{"$f":"IF(C101=\"\",\"\",NORMSDIST((BD101-fxds)/Standardabweichung))","v":0.91643061493501832},{"$f":"IF(C101=\"\",\"\",1-BF101)","v":8.3569385064981683E-2},{"$f":"IF(C101=\"\",\"\",SMALL(BG,BE101))","v":0.93347081410358568},{"$f":"IF(C101=\"\",\"\",(2*BE101-1)*(LN(BH101)+LN(BF101)))","v":-30.130099009643075},{"$f":"IF(C101=\"\",NA(),NORMSINV((BE101-0.3)/(Anzahl+0.4)))","v":1.4483843879989089}]
[null,null,19.5,null,null,null,null,null,null,null,null,null,null,null,null,null,0.4,20.050233055506126,0.2052200756317869,null,null,null,null,null,null,null,null,null,null,98,98,19.5,23,16,{"$f":"AI101","v":17.692074636801557},20.050233055506126,16.512995427449269,21.229312264858414,15.333916218096984,22.408391474210699,18.871153846153842,null,0,0,null,null,null,null,null,null,null,null,null,null,98,20.5,{"$f":"IF(C102=\"\",\"\",1+BE101)","v":98},0.91643061493501832,8.3569385064981683E-2,0.9527155421528718,-26.463026408974979,1.5206308904123669]
[null,null,20.399999999999999,null,null,null,null,null,null,null,null,null,null,null,null,null,0.5,20.63977266018227,0.10984639084344539,null,null,null,null,null,null,null,null,null,null,99,99,20.399999999999999,23,16,17.692074636801557,20.050233055506126,16.512995427449269,21.229312264858414,15.333916218096984,22.408391474210699,18.871153846153842,null,0,0,null,null,null,null,null,null,null,null,null,null,99,20.6,99,0.92871235975946398,7.1287640240536021E-2,0.9527155421528718,-24.111838290986618,1.6018200758463057]
[null,null,{"$f":"IF(F54=\"\",\"\",F54)","v":19.100000000000001},null,null,null,null,null,null,null,null,null,null,null,null,null,0.6,21.347220185793642,3.7303342838679261E-2,null,null,null,null,null,null,null,null,null,null,100,100,19.100000000000001,23,16,17.692074636801557,20.050233055506126,16.512995427449269,21.229312264858414,15.333916218096984,22.408391474210699,18.871153846153842,null,0,0,null,null,null,null,null,null,null,null,null,null,100,20.6,100,0.92871235975946398,7.1287640240536021E-2,0.96050578606005688,-22.736045396507894,1.6951956377364383]
[null,null,{"$f":"IF(I5=\"\",\"\",I5)","v":16.899999999999999},null,null,null,null,null,null,null,null,null,null,null,null,null,0.7,22.172575632340241,6.7132483722855598E-3,null,null,null,null,null,null,null,null,null,null,101,101,16.899999999999999,23,16,17.692074636801557,20.050233055506126,16.512995427449269,21.229312264858414,15.333916218096984,22.408391474210699,18.871153846153842,null,0,0,null,null,null,null,null,null,null,null,null,null,101,20.8,101,0.94906889552375573,5.0931104476244271E-2,0.97296090434153881,-16.016737887247139,1.8062376514496057]
[null,null,{"$f":"IF(I6=\"\",\"\",I6)","v":19.5},null,null,null,null,null,null,null,null,null,null,null,null,null,0.8,23.115838999822071,5.1896592295093858E-4,null,null,null,null,null,null,null,null,null,null,102,102,19.5,23,16,17.692074636801557,20.050233055506126,16.512995427449269,21.229312264858414,15.333916218096984,22.408391474210699,18.871153846153842,null,0,0,null,null,null,null,null,null,null,null,null,null,102,20.9,102,0.95734771274889485,4.2652287251105148E-2,0.9819515235245122,-12.54579670392822,1.9454225913844103]
[null,null,20.399999999999999,null,null,null,null,null,null,null,null,null,null,null,null,null,0.9,24.177010288239128,1.3556121573618425E-5,null,null,null,null,null,null,null,null,null,null,103,103,20.399999999999999,23,16,17.692074636801557,20.050233055506126,16.512995427449269,21.229312264858414,15.333916218096984,22.408391474210699,18.871153846153842,null,0,0,null,null,null,null,null,null,null,null,null,null,103,21,103,0.96450299811948792,3.549700188051208E-2,0.98539517883302941,-10.425246229103452,2.1373805779024266]
[null,null,19.100000000000001,null,null,null,null,null,null,null,null,null,null,null,null,null,1,25.356089497591412,9.1340428676200524E-8,null,null,null,null,null,null,null,null,null,null,104,104,19.100000000000001,23,16,17.692074636801557,20.050233055506126,16.512995427449269,21.229312264858414,15.333916218096984,22.408391474210699,18.871153846153842,null,0,0,null,null,null,null,null,null,null,null,null,null,104,21.5,104,0.98711218208866025,1.288781791133975E-2,0.99062008739097496,-4.6359238461097183,2.4726921125330135]
[null,null,"",null,null,null,null,null,null,null,null,null,null,null,null,null,1.1000000000000001,26.653076627878928,1.1760702615790038E-10,null,null,null,null,null,null,null,null,null,null,105,104,19.100000000000001,23,16,17.692074636801557,20.050233055506126,16.512995427449269,21.229312264858414,15.333916218096984,22.408391474210699,18.871153846153842,null,0,0,null,null,null,null,null,null,null,null,null,null,105,{"$error":"#N/A"},"","","","","",{"$error":"#N/A"}]
[null,null,"",null,null,null,null,null,null,null,null,null,null,null,null,null,null,null,null,null,null,null,null,null,null,null,null,null,null,106,104,19.100000000000001,23,16,17.692074636801557,20.050233055506126,16.512995427449269,21.229312264858414,15.333916218096984,22.408391474210699,18.871153846153842,null,0,0,null,null,null,null,null,null,null,null,null,null,106,{"$error":"#N/A"},"","","","","",{"$error":"#N/A"}]
[null,null,"",null,null,null,null,null,null,null,null,null,null,null,null,null,null,null,null,null,null,null,null,null,null,null,null,null,null,107,104,19.100000000000001,23,16,17.692074636801557,20.050233055506126,16.512995427449269,21.229312264858414,15.333916218096984,22.408391474210699,18.871153846153842,null,0,0,null,null,null,null,null,null,null,null,null,null,107,{"$error":"#N/A"},"","","","","",{"$error":"#N/A"}]
[null,null,"",null,null,null,null,null,null,null,null,null,null,null,null,null,null,null,null,null,null,null,null,null,null,null,null,null,null,108,104,19.100000000000001,23,16,17.692074636801557,20.050233055506126,16.512995427449269,21.229312264858414,15.333916218096984,22.408391474210699,18.871153846153842,null,0,0,null,null,null,null,null,null,null,null,null,null,108,{"$error":"#N/A"},"","","","","",{"$error":"#N/A"}]
[null,null,"",null,null,null,null,null,null,null,null,null,null,null,null,null,null,null,null,null,null,null,null,null,null,null,null,null,null,109,104,19.100000000000001,23,16,17.692074636801557,20.050233055506126,16.512995427449269,21.229312264858414,15.333916218096984,22.408391474210699,18.871153846153842,null,0,0,null,null,null,null,null,null,null,null,null,null,109,{"$error":"#N/A"},"","","","","",{"$error":"#N/A"}]
[null,null,"",null,null,null,null,null,null,null,null,null,null,null,null,null,null,null,null,null,null,null,null,null,null,null,null,null,null,110,104,19.100000000000001,23,16,17.692074636801557,20.050233055506126,16.512995427449269,21.229312264858414,15.333916218096984,22.408391474210699,18.871153846153842,null,0,0,null,null,null,null,null,null,null,null,null,null,110,{"$error":"#N/A"},"","","","","",{"$error":"#N/A"}]
[null,null,"",null,null,null,null,null,null,null,null,null,null,null,null,null,null,null,null,null,null,null,null,null,null,null,null,null,null,111,104,19.100000000000001,23,16,17.692074636801557,20.050233055506126,16.512995427449269,21.229312264858414,15.333916218096984,22.408391474210699,18.871153846153842,null,0,0,null,null,null,null,null,null,null,null,null,null,111,{"$error":"#N/A"},"","","","","",{"$error":"#N/A"}]
[null,null,"",null,null,null,null,null,null,null,null,null,null,null,null,null,null,null,null,null,null,null,null,null,null,null,null,null,null,112,104,19.100000000000001,23,16,17.692074636801557,20.050233055506126,16.512995427449269,21.229312264858414,15.333916218096984,22.408391474210699,18.871153846153842,null,0,0,null,null,null,null,null,null,null,null,null,null,112,{"$error":"#N/A"},"","","","","",{"$error":"#N/A"}]
[null,null,"",null,null,null,null,null,null,null,null,null,null,null,null,null,null,null,null,null,null,null,null,null,null,null,null,null,null,113,104,19.100000000000001,23,16,17.692074636801557,20.050233055506126,16.512995427449269,21.229312264858414,15.333916218096984,22.408391474210699,18.871153846153842,null,0,0,null,null,null,null,null,null,null,null,null,null,113,{"$error":"#N/A"},"","","","","",{"$error":"#N/A"}]
[null,null,"",null,null,null,null,null,null,null,null,null,null,null,null,null,null,null,null,null,null,null,null,null,null,null,null,null,null,114,104,19.100000000000001,23,16,{"$f":"AI117","v":17.692074636801557},20.050233055506126,16.512995427449269,21.229312264858414,15.333916218096984,22.408391474210699,18.871153846153842,null,0,0,null,null,null,null,null,null,null,null,null,null,114,{"$error":"#N/A"},"","","","","",{"$error":"#N/A"}]
[null,null,"",null,null,null,null,null,null,null,null,null,null,null,null,null,null,null,null,null,null,null,null,null,null,null,null,null,null,115,104,19.100000000000001,23,16,17.692074636801557,20.050233055506126,16.512995427449269,21.229312264858414,15.333916218096984,22.408391474210699,18.871153846153842,null,0,0,null,null,null,null,null,null,null,null,null,null,115,{"$error":"#N/A"},"","","","","",{"$error":"#N/A"}]
[null,null,"",null,null,null,null,null,null,null,null,null,null,null,null,null,null,null,null,null,null,null,null,null,null,null,null,null,null,116,104,19.100000000000001,23,16,17.692074636801557,20.050233055506126,16.512995427449269,21.229312264858414,15.333916218096984,22.408391474210699,18.871153846153842,null,0,0,null,null,null,null,null,null,null,null,null,null,116,{"$error":"#N/A"},"","","","","",{"$error":"#N/A"}]
[null,null,"",null,null,null,null,null,null,null,null,null,null,null,null,null,null,null,null,null,null,null,null,null,null,null,null,null,null,117,104,19.100000000000001,23,16,17.692074636801557,20.050233055506126,16.512995427449269,21.229312264858414,15.333916218096984,22.408391474210699,18.871153846153842,null,0,0,null,null,null,null,null,null,null,null,null,null,117,{"$error":"#N/A"},"","","","","",{"$error":"#N/A"}]
[null,null,"",null,null,null,null,null,null,null,null,null,null,null,null,null,null,null,null,null,null,null,null,null,null,null,null,null,null,118,104,19.100000000000001,23,16,17.692074636801557,20.050233055506126,16.512995427449269,21.229312264858414,15.333916218096984,22.408391474210699,18.871153846153842,null,0,0,null,null,null,null,null,null,null,null,null,null,118,{"$error":"#N/A"},"","","","","",{"$error":"#N/A"}]
[null,null,"",null,null,null,null,null,null,null,null,null,null,null,null,null,null,null,null,null,null,null,null,null,null,null,null,null,null,119,104,19.100000000000001,23,16,17.692074636801557,20.050233055506126,16.512995427449269,21.229312264858414,15.333916218096984,22.408391474210699,18.871153846153842,null,0,0,null,null,null,null,null,null,null,null,null,null,119,{"$error":"#N/A"},"","","","","",{"$error":"#N/A"}]
[null,null,"",null,null,null,null,null,null,null,null,null,null,null,null,null,null,null,null,null,null,null,null,null,null,null,null,null,null,120,104,19.100000000000001,23,16,17.692074636801557,20.050233055506126,16.512995427449269,21.229312264858414,15.333916218096984,22.408391474210699,18.871153846153842,null,0,0,null,null,null,null,null,null,null,null,null,null,120,{"$error":"#N/A"},"","","","","",{"$error":"#N/A"}]
[null,null,"",null,null,null,null,null,null,null,null,null,null,null,null,null,null,null,null,null,null,null,null,null,null,null,null,null,null,121,104,19.100000000000001,23,16,17.692074636801557,20.050233055506126,16.512995427449269,21.229312264858414,15.333916218096984,22.408391474210699,18.871153846153842,null,0,0,null,null,null,null,null,null,null,null,null,null,121,{"$error":"#N/A"},"","","","","",{"$error":"#N/A"}]
[null,null,"",null,null,null,null,null,null,null,null,null,null,null,null,null,null,null,null,null,null,null,null,null,null,null,null,null,null,122,104,19.100000000000001,23,16,17.692074636801557,20.050233055506126,16.512995427449269,21.229312264858414,15.333916218096984,22.408391474210699,18.871153846153842,null,0,0,null,null,null,null,null,null,null,null,null,null,122,{"$error":"#N/A"},"","","","","",{"$error":"#N/A"}]
[null,null,"",null,null,null,null,null,null,null,null,null,null,null,null,null,null,null,null,null,null,null,null,null,null,null,null,null,null,123,104,19.100000000000001,23,16,17.692074636801557,20.050233055506126,16.512995427449269,21.229312264858414,15.333916218096984,22.408391474210699,18.871153846153842,null,0,0,null,null,null,null,null,null,null,null,null,null,123,{"$error":"#N/A"},"","","","","",{"$error":"#N/A"}]
[null,null,"",null,null,null,null,null,null,null,null,null,null,null,null,null,null,null,null,null,null,null,null,null,null,null,null,null,null,124,104,19.100000000000001,23,16,17.692074636801557,20.050233055506126,16.512995427449269,21.229312264858414,15.333916218096984,22.408391474210699,18.871153846153842,null,0,0,null,null,null,null,null,null,null,null,null,null,124,{"$error":"#N/A"},"","","","","",{"$error":"#N/A"}]
[null,null,"",null,null,null,null,null,null,null,null,null,null,null,null,null,null,null,null,null,null,null,null,null,null,null,null,null,null,125,104,19.100000000000001,23,16,17.692074636801557,20.050233055506126,16.512995427449269,21.229312264858414,15.333916218096984,22.408391474210699,18.871153846153842,null,0,0,null,null,null,null,null,null,null,null,null,null,125,{"$error":"#N/A"},"","","","","",{"$error":"#N/A"}]
[null,null,"",null,null,null,null,null,null,null,null,null,null,null,null,null,null,null,null,null,null,null,null,null,null,null,null,null,null,126,104,19.100000000000001,23,16,17.692074636801557,20.050233055506126,16.512995427449269,21.229312264858414,15.333916218096984,22.408391474210699,18.871153846153842,null,0,0,null,null,null,null,null,null,null,null,null,null,126,{"$error":"#N/A"},"","","","","",{"$error":"#N/A"}]
[null,null,"",null,null,null,null,null,null,null,null,null,null,null,null,null,null,null,null,null,null,null,null,null,null,null,null,null,null,127,104,19.100000000000001,23,16,17.692074636801557,20.050233055506126,16.512995427449269,21.229312264858414,15.333916218096984,22.408391474210699,18.871153846153842,null,0,0,null,null,null,null,null,null,null,null,null,null,127,{"$error":"#N/A"},"","","","","",{"$error":"#N/A"}]
[null,null,"",null,null,null,null,null,null,null,null,null,null,null,null,null,null,null,null,null,null,null,null,null,null,null,null,null,null,128,104,19.100000000000001,23,16,17.692074636801557,20.050233055506126,16.512995427449269,21.229312264858414,15.333916218096984,22.408391474210699,18.871153846153842,null,0,0,null,null,null,null,null,null,null,null,null,null,128,{"$error":"#N/A"},"","","","","",{"$error":"#N/A"}]
[null,null,"",null,null,null,null,null,null,null,null,null,null,null,null,null,null,null,null,null,null,null,null,null,null,null,null,null,null,129,{"$f":"IF((Anzahl>AD133),AD133,Anzahl)","v":104},19.100000000000001,{"$f":"IF(C133<>\"\",OGW,AG132)","v":23},{"$f":"IF(C133<>\"\",UGW,AH132)","v":16},17.692074636801557,20.050233055506126,16.512995427449269,21.229312264858414,15.333916218096984,22.408391474210699,18.871153846153842,null,{"$f":"IF(AND(C133<>\"\",C133<UGW),1,0)","v":0},{"$f":"IF(AND(C133<>\"\",C133>OGW),1,0)","v":0},null,null,null,null,null,null,null,null,null,null,129,{"$f":"IF(C133=\"\",NA(),SMALL(xi,BE133))","v":{"$error":"#N/A"}},"",{"$f":"IF(C133=\"\",\"\",NORMSDIST((BD133-fxds)/Standardabweichung))","v":""},{"$f":"IF(C133=\"\",\"\",1-BF133)","v":""},{"$f":"IF(C133=\"\",\"\",SMALL(BG,BE133))","v":""},{"$f":"IF(C133=\"\",\"\",(2*BE133-1)*(LN(BH133)+LN(BF133)))","v":""},{"$f":"IF(C133=\"\",NA(),NORMSINV((BE133-0.3)/(Anzahl+0.4)))","v":{"$error":"#N/A"}}]
[null,null,"",null,null,null,null,null,null,null,null,null,null,null,null,null,null,null,null,null,null,null,null,null,null,null,null,null,null,130,104,19.100000000000001,23,16,{"$f":"AI133","v":17.692074636801557},20.050233055506126,16.512995427449269,21.229312264858414,15.333916218096984,22.408391474210699,18.871153846153842,null,0,0,null,null,null,null,null,null,null,null,null,null,130,{"$error":"#N/A"},{"$f":"IF(C134=\"\",\"\",1+BE133)","v":""},"","","","",{"$error":"#N/A"}]
[null,null,"",null,null,null,null,null,null,null,null,null,null,null,null,null,null,null,null,null,null,null,null,null,null,null,null,null,null,131,104,19.100000000000001,23,16,17.692074636801557,20.050233055506126,16.512995427449269,21.229312264858414,15.333916218096984,22.408391474210699,18.871153846153842,null,0,0,null,null,null,null,null,null,null,null,null,null,131,{"$error":"#N/A"},"","","","","",{"$error":"#N/A"}]
[null,null,"",null,null,null,null,null,null,null,null,null,null,null,null,null,null,null,null,null,null,null,null,null,null,null,null,null,null,132,104,{"$f":"IF(C136<>\"\",C136,AF135)","v":19.100000000000001},23,16,17.692074636801557,20.050233055506126,16.512995427449269,21.229312264858414,15.333916218096984,22.408391474210699,18.871153846153842,null,0,0,null,null,null,null,null,null,null,null,null,null,132,{"$error":"#N/A"},"","","","","",{"$error":"#N/A"}]
[null,null,"",null,null,null,null,null,null,null,null,null,null,null,null,null,null,null,null,null,null,null,null,null,null,null,null,null,null,133,104,19.100000000000001,23,16,17.692074636801557,20.050233055506126,16.512995427449269,21.229312264858414,15.333916218096984,22.408391474210699,18.871153846153842,null,0,0,null,null,null,null,null,null,null,null,null,null,133,{"$error":"#N/A"},"","","","","",{"$error":"#N/A"}]
[null,null,"",null,null,null,null,null,null,null,null,null,null,null,null,null,null,null,null,null,null,null,null,null,null,null,null,null,null,134,104,19.100000000000001,23,16,17.692074636801557,20.050233055506126,16.512995427449269,21.229312264858414,15.333916218096984,22.408391474210699,18.871153846153842,null,0,0,null,null,null,null,null,null,null,null,null,null,134,{"$error":"#N/A"},"","","","","",{"$error":"#N/A"}]
[null,null,"",null,null,null,null,null,null,null,null,null,null,null,null,null,null,null,null,null,null,null,null,null,null,null,null,null,null,135,104,19.100000000000001,23,16,17.692074636801557,20.050233055506126,16.512995427449269,21.229312264858414,15.333916218096984,22.408391474210699,18.871153846153842,null,0,0,null,null,null,null,null,null,null,null,null,null,135,{"$error":"#N/A"},"","","","","",{"$error":"#N/A"}]
[null,null,"",null,null,null,null,null,null,null,null,null,null,null,null,null,null,null,null,null,null,null,null,null,null,null,null,null,null,136,104,19.100000000000001,23,16,17.692074636801557,20.050233055506126,16.512995427449269,21.229312264858414,15.333916218096984,22.408391474210699,18.871153846153842,null,0,0,null,null,null,null,null,null,null,null,null,null,136,{"$error":"#N/A"},"","","","","",{"$error":"#N/A"}]
[null,null,"",null,null,null,null,null,null,null,null,null,null,null,null,null,null,null,null,null,null,null,null,null,null,null,null,null,null,137,104,19.100000000000001,23,16,17.692074636801557,20.050233055506126,16.512995427449269,21.229312264858414,15.333916218096984,22.408391474210699,18.871153846153842,null,0,0,null,null,null,null,null,null,null,null,null,null,137,{"$error":"#N/A"},"","","","","",{"$error":"#N/A"}]
[null,null,"",null,null,null,null,null,null,null,null,null,null,null,null,null,null,null,null,null,null,null,null,null,null,null,null,null,null,138,104,19.100000000000001,23,16,17.692074636801557,20.050233055506126,16.512995427449269,21.229312264858414,15.333916218096984,22.408391474210699,18.871153846153842,null,0,0,null,null,null,null,null,null,null,null,null,null,138,{"$error":"#N/A"},"","","","","",{"$error":"#N/A"}]
[null,null,"",null,null,null,null,null,null,null,null,null,null,null,null,null,null,null,null,null,null,null,null,null,null,null,null,null,null,139,104,19.100000000000001,23,16,17.692074636801557,20.050233055506126,16.512995427449269,21.229312264858414,15.333916218096984,22.408391474210699,18.871153846153842,null,0,0,null,null,null,null,null,null,null,null,null,null,139,{"$error":"#N/A"},"","","","","",{"$error":"#N/A"}]
[null,null,"",null,null,null,null,null,null,null,null,null,null,null,null,null,null,null,null,null,null,null,null,null,null,null,null,null,null,140,104,19.100000000000001,23,16,17.692074636801557,20.050233055506126,16.512995427449269,21.229312264858414,15.333916218096984,22.408391474210699,18.871153846153842,null,0,0,null,null,null,null,null,null,null,null,null,null,140,{"$error":"#N/A"},"","","","","",{"$error":"#N/A"}]
[null,null,"",null,null,null,null,null,null,null,null,null,null,null,null,null,null,null,null,null,null,null,null,null,null,null,null,null,null,141,104,19.100000000000001,23,16,17.692074636801557,20.050233055506126,16.512995427449269,21.229312264858414,15.333916218096984,22.408391474210699,18.871153846153842,null,0,0,null,null,null,null,null,null,null,null,null,null,141,{"$error":"#N/A"},"","","","","",{"$error":"#N/A"}]
[null,null,"",null,null,null,null,null,null,null,null,null,null,null,null,null,null,null,null,null,null,null,null,null,null,null,null,null,null,142,104,19.100000000000001,23,16,17.692074636801557,20.050233055506126,16.512995427449269,21.229312264858414,15.333916218096984,22.408391474210699,18.871153846153842,null,0,0,null,null,null,null,null,null,null,null,null,null,142,{"$error":"#N/A"},"","","","","",{"$error":"#N/A"}]
[null,null,"",null,null,null,null,null,null,null,null,null,null,null,null,null,null,null,null,null,null,null,null,null,null,null,null,null,null,143,104,19.100000000000001,23,16,17.692074636801557,20.050233055506126,16.512995427449269,21.229312264858414,15.333916218096984,22.408391474210699,18.871153846153842,null,0,0,null,null,null,null,null,null,null,null,null,null,143,{"$error":"#N/A"},"","","","","",{"$error":"#N/A"}]
[null,null,"",null,null,null,null,null,null,null,null,null,null,null,null,null,null,null,null,null,null,null,null,null,null,null,null,null,null,144,104,19.100000000000001,23,16,17.692074636801557,20.050233055506126,16.512995427449269,21.229312264858414,15.333916218096984,22.408391474210699,18.871153846153842,null,0,0,null,null,null,null,null,null,null,null,null,null,144,{"$error":"#N/A"},"","","","","",{"$error":"#N/A"}]
[null,null,"",null,null,null,null,null,null,null,null,null,null,null,null,null,null,null,null,null,null,null,null,null,null,null,null,null,null,145,104,19.100000000000001,23,16,17.692074636801557,20.050233055506126,16.512995427449269,21.229312264858414,15.333916218096984,22.408391474210699,18.871153846153842,null,0,0,null,null,null,null,null,null,null,null,null,null,145,{"$error":"#N/A"},"","","","","",{"$error":"#N/A"}]
[null,null,"",null,null,null,null,null,null,null,null,null,null,null,null,null,null,null,null,null,null,null,null,null,null,null,null,null,null,146,104,19.100000000000001,23,16,{"$f":"AI149","v":17.692074636801557},20.050233055506126,16.512995427449269,21.229312264858414,15.333916218096984,22.408391474210699,18.871153846153842,null,0,0,null,null,null,null,null,null,null,null,null,null,146,{"$error":"#N/A"},"","","","","",{"$error":"#N/A"}]
[null,null,"",null,null,null,null,null,null,null,null,null,null,null,null,null,null,null,null,null,null,null,null,null,null,null,null,null,null,147,104,19.100000000000001,23,16,17.692074636801557,20.050233055506126,16.512995427449269,21.229312264858414,15.333916218096984,22.408391474210699,18.871153846153842,null,0,0,null,null,null,null,null,null,null,null,null,null,147,{"$error":"#N/A"},"","","","","",{"$error":"#N/A"}]
[null,null,"",null,null,null,null,null,null,null,null,null,null,null,null,null,null,null,null,null,null,null,null,null,null,null,null,null,null,148,104,19.100000000000001,23,16,17.692074636801557,20.050233055506126,16.512995427449269,21.229312264858414,15.333916218096984,22.408391474210699,18.871153846153842,null,0,0,null,null,null,null,null,null,null,null,null,null,148,{"$error":"#N/A"},"","","","","",{"$error":"#N/A"}]
[null,null,"",null,null,null,null,null,null,null,null,null,null,null,null,null,null,null,null,null,null,null,null,null,null,null,null,null,null,149,104,19.100000000000001,23,16,17.692074636801557,20.050233055506126,16.512995427449269,21.229312264858414,15.333916218096984,22.408391474210699,18.871153846153842,null,0,0,null,null,null,null,null,null,null,null,null,null,149,{"$error":"#N/A"},"","","","","",{"$error":"#N/A"}]
[null,null,"",null,null,null,null,null,null,null,null,null,null,null,null,null,null,null,null,null,null,null,null,null,null,null,null,null,null,150,104,19.100000000000001,23,16,17.692074636801557,20.050233055506126,16.512995427449269,21.229312264858414,15.333916218096984,22.408391474210699,18.871153846153842,null,0,0,null,null,null,null,null,null,null,null,null,null,150,{"$error":"#N/A"},"","","","","",{"$error":"#N/A"}]
[null,null,{"$f":"IF(L5=\"\",\"\",L5)","v":""},null,null,null,null,null,null,null,null,null,null,null,null,null,null,null,null,null,null,null,null,null,null,null,null,null,null,151,104,19.100000000000001,23,16,17.692074636801557,20.050233055506126,16.512995427449269,21.229312264858414,15.333916218096984,22.408391474210699,18.871153846153842,null,0,0,null,null,null,null,null,null,null,null,null,null,151,{"$error":"#N/A"},"","","","","",{"$error":"#N/A"}]
[null,null,{"$f":"IF(L6=\"\",\"\",L6)","v":""},null,null,null,null,null,null,null,null,null,null,null,null,null,null,null,null,null,null,null,null,null,null,null,null,null,null,152,104,19.100000000000001,23,16,17.692074636801557,20.050233055506126,16.512995427449269,21.229312264858414,15.333916218096984,22.408391474210699,18.871153846153842,null,0,0,null,null,null,null,null,null,null,null,null,null,152,{"$error":"#N/A"},"","","","","",{"$error":"#N/A"}]
[null,null,"",null,null,null,null,null,null,null,null,null,null,null,null,null,null,null,null,null,null,null,null,null,null,null,null,null,null,153,104,19.100000000000001,23,16,17.692074636801557,20.050233055506126,16.512995427449269,21.229312264858414,15.333916218096984,22.408391474210699,18.871153846153842,null,0,0,null,null,null,null,null,null,null,null,null,null,153,{"$error":"#N/A"},"","","","","",{"$error":"#N/A"}]
[null,null,"",null,null,null,null,null,null,null,null,null,null,null,null,null,null,null,null,null,null,null,null,null,null,null,null,null,null,154,104,19.100000000000001,23,16,17.692074636801557,20.050233055506126,16.512995427449269,21.229312264858414,15.333916218096984,22.408391474210699,18.871153846153842,null,0,0,null,null,null,null,null,null,null,null,null,null,154,{"$error":"#N/A"},"","","","","",{"$error":"#N/A"}]
[null,null,"",null,null,null,null,null,null,null,null,null,null,null,null,null,null,null,null,null,null,null,null,null,null,null,null,null,null,155,104,19.100000000000001,23,16,17.692074636801557,20.050233055506126,16.512995427449269,21.229312264858414,15.333916218096984,22.408391474210699,18.871153846153842,null,0,0,null,null,null,null,null,null,null,null,null,null,155,{"$error":"#N/A"},"","","","","",{"$error":"#N/A"}]
[null,null,"",null,null,null,null,null,null,null,null,null,null,null,null,null,null,null,null,null,null,null,null,null,null,null,null,null,null,156,104,19.100000000000001,23,16,17.692074636801557,20.050233055506126,16.512995427449269,21.229312264858414,15.333916218096984,22.408391474210699,18.871153846153842,null,0,0,null,null,null,null,null,null,null,null,null,null,156,{"$error":"#N/A"},"","","","","",{"$error":"#N/A"}]
[null,null,"",null,null,null,null,null,null,null,null,null,null,null,null,null,null,null,null,null,null,null,null,null,null,null,null,null,null,157,104,19.100000000000001,23,16,17.692074636801557,20.050233055506126,16.512995427449269,21.229312264858414,15.333916218096984,22.408391474210699,18.871153846153842,null,0,0,null,null,null,null,null,null,null,null,null,null,157,{"$error":"#N/A"},"","","","","",{"$error":"#N/A"}]
[null,null,"",null,null,null,null,null,null,null,null,null,null,null,null,null,null,null,null,null,null,null,null,null,null,null,null,null,null,158,104,19.100000000000001,23,16,17.692074636801557,20.050233055506126,16.512995427449269,21.229312264858414,15.333916218096984,22.408391474210699,18.871153846153842,null,0,0,null,null,null,null,null,null,null,null,null,null,158,{"$error":"#N/A"},"","","","","",{"$error":"#N/A"}]
[null,null,"",null,null,null,null,null,null,null,null,null,null,null,null,null,null,null,null,null,null,null,null,null,null,null,null,null,null,159,104,19.100000000000001,23,16,17.692074636801557,20.050233055506126,16.512995427449269,21.229312264858414,15.333916218096984,22.408391474210699,18.871153846153842,null,0,0,null,null,null,null,null,null,null,null,null,null,159,{"$error":"#N/A"},"","","","","",{"$error":"#N/A"}]
[null,null,"",null,null,null,null,null,null,null,null,null,null,null,null,null,null,null,null,null,null,null,null,null,null,null,null,null,null,160,104,19.100000000000001,23,16,17.692074636801557,20.050233055506126,16.512995427449269,21.229312264858414,15.333916218096984,22.408391474210699,18.871153846153842,null,0,0,null,null,null,null,null,null,null,null,null,null,160,{"$error":"#N/A"},"","","","","",{"$error":"#N/A"}]
[null,null,"",null,null,null,null,null,null,null,null,null,null,null,null,null,null,null,null,null,null,null,null,null,null,null,null,null,null,161,{"$f":"IF((Anzahl>AD165),AD165,Anzahl)","v":104},19.100000000000001,{"$f":"IF(C165<>\"\",OGW,AG164)","v":23},{"$f":"IF(C165<>\"\",UGW,AH164)","v":16},17.692074636801557,20.050233055506126,16.512995427449269,21.229312264858414,15.333916218096984,22.408391474210699,18.871153846153842,null,{"$f":"IF(AND(C165<>\"\",C165<UGW),1,0)","v":0},{"$f":"IF(AND(C165<>\"\",C165>OGW),1,0)","v":0},null,null,null,null,null,null,null,null,null,null,161,{"$f":"IF(C165=\"\",NA(),SMALL(xi,BE165))","v":{"$error":"#N/A"}},"",{"$f":"IF(C165=\"\",\"\",NORMSDIST((BD165-fxds)/Standardabweichung))","v":""},{"$f":"IF(C165=\"\",\"\",1-BF165)","v":""},{"$f":"IF(C165=\"\",\"\",SMALL(BG,BE165))","v":""},{"$f":"IF(C165=\"\",\"\",(2*BE165-1)*(LN(BH165)+LN(BF165)))","v":""},{"$f":"IF(C165=\"\",NA(),NORMSINV((BE165-0.3)/(Anzahl+0.4)))","v":{"$error":"#N/A"}}]
[null,null,"",null,null,null,null,null,null,null,null,null,null,null,null,null,null,null,null,null,null,null,null,null,null,null,null,null,null,162,104,19.100000000000001,23,16,{"$f":"AI165","v":17.692074636801557},20.050233055506126,16.512995427449269,21.229312264858414,15.333916218096984,22.408391474210699,18.871153846153842,null,0,0,null,null,null,null,null,null,null,null,null,null,162,{"$error":"#N/A"},{"$f":"IF(C166=\"\",\"\",1+BE165)","v":""},"","","","",{"$error":"#N/A"}]
[null,null,"",null,null,null,null,null,null,null,null,null,null,null,null,null,null,null,null,null,null,null,null,null,null,null,null,null,null,163,104,19.100000000000001,23,16,17.692074636801557,20.050233055506126,16.512995427449269,21.229312264858414,15.333916218096984,22.408391474210699,18.871153846153842,null,0,0,null,null,null,null,null,null,null,null,null,null,163,{"$error":"#N/A"},"","","","","",{"$error":"#N/A"}]
[null,null,"",null,null,null,null,null,null,null,null,null,null,null,null,null,null,null,null,null,null,null,null,null,null,null,null,null,null,164,104,19.100000000000001,23,16,17.692074636801557,20.050233055506126,16.512995427449269,21.229312264858414,15.333916218096984,22.408391474210699,18.871153846153842,null,0,0,null,null,null,null,null,null,null,null,null,null,164,{"$error":"#N/A"},"","","","","",{"$error":"#N/A"}]
[null,null,"",null,null,null,null,null,null,null,null,null,null,null,null,null,null,null,null,null,null,null,null,null,null,null,null,null,null,165,104,19.100000000000001,23,16,17.692074636801557,20.050233055506126,16.512995427449269,21.229312264858414,15.333916218096984,22.408391474210699,18.871153846153842,null,0,0,null,null,null,null,null,null,null,null,null,null,165,{"$error":"#N/A"},"","","","","",{"$error":"#N/A"}]
[null,null,"",null,null,null,null,null,null,null,null,null,null,null,null,null,null,null,null,null,null,null,null,null,null,null,null,null,null,166,104,19.100000000000001,23,16,17.692074636801557,20.050233055506126,16.512995427449269,21.229312264858414,15.333916218096984,22.408391474210699,18.871153846153842,null,0,0,null,null,null,null,null,null,null,null,null,null,166,{"$error":"#N/A"},"","","","","",{"$error":"#N/A"}]
[null,null,"",null,null,null,null,null,null,null,null,null,null,null,null,null,null,null,null,null,null,null,null,null,null,null,null,null,null,167,104,19.100000000000001,23,16,17.692074636801557,20.050233055506126,16.512995427449269,21.229312264858414,15.333916218096984,22.408391474210699,18.871153846153842,null,0,0,null,null,null,null,null,null,null,null,null,null,167,{"$error":"#N/A"},"","","","","",{"$error":"#N/A"}]
[null,null,"",null,null,null,null,null,null,null,null,null,null,null,null,null,null,null,null,null,null,null,null,null,null,null,null,null,null,168,104,19.100000000000001,23,16,17.692074636801557,20.050233055506126,16.512995427449269,21.229312264858414,15.333916218096984,22.408391474210699,18.871153846153842,null,0,0,null,null,null,null,null,null,null,null,null,null,168,{"$error":"#N/A"},"","","","","",{"$error":"#N/A"}]
[null,null,"",null,null,null,null,null,null,null,null,null,null,null,null,null,null,null,null,null,null,null,null,null,null,null,null,null,null,169,104,19.100000000000001,23,16,17.692074636801557,20.050233055506126,16.512995427449269,21.229312264858414,15.333916218096984,22.408391474210699,18.871153846153842,null,0,0,null,null,null,null,null,null,null,null,null,null,169,{"$error":"#N/A"},"","","","","",{"$error":"#N/A"}]
[null,null,"",null,null,null,null,null,null,null,null,null,null,null,null,null,null,null,null,null,null,null,null,null,null,null,null,null,null,170,104,19.100000000000001,23,16,17.692074636801557,20.050233055506126,16.512995427449269,21.229312264858414,15.333916218096984,22.408391474210699,18.871153846153842,null,0,0,null,null,null,null,null,null,null,null,null,null,170,{"$error":"#N/A"},"","","","","",{"$error":"#N/A"}]
[null,null,"",null,null,null,null,null,null,null,null,null,null,null,null,null,null,null,null,null,null,null,null,null,null,null,null,null,null,171,104,19.100000000000001,23,16,17.692074636801557,20.050233055506126,16.512995427449269,21.229312264858414,15.333916218096984,22.408391474210699,18.871153846153842,null,0,0,null,null,null,null,null,null,null,null,null,null,171,{"$error":"#N/A"},"","","","","",{"$error":"#N/A"}]
[null,null,"",null,null,null,null,null,null,null,null,null,null,null,null,null,null,null,null,null,null,null,null,null,null,null,null,null,null,172,104,19.100000000000001,23,16,17.692074636801557,20.050233055506126,16.512995427449269,21.229312264858414,15.333916218096984,22.408391474210699,18.871153846153842,null,0,0,null,null,null,null,null,null,null,null,null,null,172,{"$error":"#N/A"},"","","","","",{"$error":"#N/A"}]
[null,null,"",null,null,null,null,null,null,null,null,null,null,null,null,null,null,null,null,null,null,null,null,null,null,null,null,null,null,173,104,19.100000000000001,23,16,17.692074636801557,20.050233055506126,16.512995427449269,21.229312264858414,15.333916218096984,22.408391474210699,18.871153846153842,null,0,0,null,null,null,null,null,null,null,null,null,null,173,{"$error":"#N/A"},"","","","","",{"$error":"#N/A"}]
[null,null,"",null,null,null,null,null,null,null,null,null,null,null,null,null,null,null,null,null,null,null,null,null,null,null,null,null,null,174,104,19.100000000000001,23,16,17.692074636801557,20.050233055506126,16.512995427449269,21.229312264858414,15.333916218096984,22.408391474210699,18.871153846153842,null,0,0,null,null,null,null,null,null,null,null,null,null,174,{"$error":"#N/A"},"","","","","",{"$error":"#N/A"}]
[null,null,"",null,null,null,null,null,null,null,null,null,null,null,null,null,null,null,null,null,null,null,null,null,null,null,null,null,null,175,104,19.100000000000001,23,16,17.692074636801557,20.050233055506126,16.512995427449269,21.229312264858414,15.333916218096984,22.408391474210699,18.871153846153842,null,0,0,null,null,null,null,null,null,null,null,null,null,175,{"$error":"#N/A"},"","","","","",{"$error":"#N/A"}]
[null,null,"",null,null,null,null,null,null,null,null,null,null,null,null,null,null,null,null,null,null,null,null,null,null,null,null,null,null,176,104,19.100000000000001,23,16,17.692074636801557,20.050233055506126,16.512995427449269,21.229312264858414,15.333916218096984,22.408391474210699,18.871153846153842,null,0,0,null,null,null,null,null,null,null,null,null,null,176,{"$error":"#N/A"},"","","","","",{"$error":"#N/A"}]
[null,null,"",null,null,null,null,null,null,null,null,null,null,null,null,null,null,null,null,null,null,null,null,null,null,null,null,null,null,177,104,19.100000000000001,23,16,17.692074636801557,20.050233055506126,16.512995427449269,21.229312264858414,15.333916218096984,22.408391474210699,18.871153846153842,null,0,0,null,null,null,null,null,null,null,null,null,null,177,{"$error":"#N/A"},"","","","","",{"$error":"#N/A"}]
[null,null,"",null,null,null,null,null,null,null,null,null,null,null,null,null,null,null,null,null,null,null,null,null,null,null,null,null,null,178,104,19.100000000000001,23,16,{"$f":"AI181","v":17.692074636801557},20.050233055506126,16.512995427449269,21.229312264858414,15.333916218096984,22.408391474210699,18.871153846153842,null,0,0,null,null,null,null,null,null,null,null,null,null,178,{"$error":"#N/A"},"","","","","",{"$error":"#N/A"}]
[null,null,"",null,null,null,null,null,null,null,null,null,null,null,null,null,null,null,null,null,null,null,null,null,null,null,null,null,null,179,104,19.100000000000001,23,16,17.692074636801557,20.050233055506126,16.512995427449269,21.229312264858414,15.333916218096984,22.408391474210699,18.871153846153842,null,0,0,null,null,null,null,null,null,null,null,null,null,179,{"$error":"#N/A"},"","","","","",{"$error":"#N/A"}]
[null,null,"",null,null,null,null,null,null,null,null,null,null,null,null,null,null,null,null,null,null,null,null,null,null,null,null,null,null,180,104,19.100000000000001,23,16,17.692074636801557,20.050233055506126,16.512995427449269,21.229312264858414,15.333916218096984,22.408391474210699,18.871153846153842,null,0,0,null,null,null,null,null,null,null,null,null,null,180,{"$error":"#N/A"},"","","","","",{"$error":"#N/A"}]
[null,null,"",null,null,null,null,null,null,null,null,null,null,null,null,null,null,null,null,null,null,null,null,null,null,null,null,null,null,181,104,19.100000000000001,23,16,17.692074636801557,20.050233055506126,16.512995427449269,21.229312264858414,15.333916218096984,22.408391474210699,18.871153846153842,null,0,0,null,null,null,null,null,null,null,null,null,null,181,{"$error":"#N/A"},"","","","","",{"$error":"#N/A"}]
[null,null,"",null,null,null,null,null,null,null,null,null,null,null,null,null,null,null,null,null,null,null,null,null,null,null,null,null,null,182,104,19.100000000000001,23,16,17.692074636801557,20.050233055506126,16.512995427449269,21.229312264858414,15.333916218096984,22.408391474210699,18.871153846153842,null,0,0,null,null,null,null,null,null,null,null,null,null,182,{"$error":"#N/A"},"","","","","",{"$error":"#N/A"}]
[null,null,"",null,null,null,null,null,null,null,null,null,null,null,null,null,null,null,null,null,null,null,null,null,null,null,null,null,null,183,104,19.100000000000001,23,16,17.692074636801557,20.050233055506126,16.512995427449269,21.229312264858414,15.333916218096984,22.408391474210699,18.871153846153842,null,0,0,null,null,null,null,null,null,null,null,null,null,183,{"$error":"#N/A"},"","","","","",{"$error":"#N/A"}]
[null,null,"",null,null,null,null,null,null,null,null,null,null,null,null,null,null,null,null,null,null,null,null,null,null,null,null,null,null,184,104,19.100000000000001,23,16,17.692074636801557,20.050233055506126,16.512995427449269,21.229312264858414,15.333916218096984,22.408391474210699,18.871153846153842,null,0,0,null,null,null,null,null,null,null,null,null,null,184,{"$error":"#N/A"},"","","","","",{"$error":"#N/A"}]
[null,null,"",null,null,null,null,null,null,null,null,null,null,null,null,null,null,null,null,null,null,null,null,null,null,null,null,null,null,185,104,19.100000000000001,23,16,17.692074636801557,20.050233055506126,16.512995427449269,21.229312264858414,15.333916218096984,22.408391474210699,18.871153846153842,null,0,0,null,null,null,null,null,null,null,null,null,null,185,{"$error":"#N/A"},"","","","","",{"$error":"#N/A"}]
[null,null,"",null,null,null,null,null,null,null,null,null,null,null,null,null,null,null,null,null,null,null,null,null,null,null,null,null,null,186,104,19.100000000000001,23,16,17.692074636801557,20.050233055506126,16.512995427449269,21.229312264858414,15.333916218096984,22.408391474210699,18.871153846153842,null,0,0,null,null,null,null,null,null,null,null,null,null,186,{"$error":"#N/A"},"","","","","",{"$error":"#N/A"}]
[null,null,"",null,null,null,null,null,null,null,null,null,null,null,null,null,null,null,null,null,null,null,null,null,null,null,null,null,null,187,104,19.100000000000001,23,16,17.692074636801557,20.050233055506126,16.512995427449269,21.229312264858414,15.333916218096984,22.408391474210699,18.871153846153842,null,0,0,null,null,null,null,null,null,null,null,null,null,187,{"$error":"#N/A"},"","","","","",{"$error":"#N/A"}]
[null,null,"",null,null,null,null,null,null,null,null,null,null,null,null,null,null,null,null,null,null,null,null,null,null,null,null,null,null,188,104,19.100000000000001,23,16,17.692074636801557,20.050233055506126,16.512995427449269,21.229312264858414,15.333916218096984,22.408391474210699,18.871153846153842,null,0,0,null,null,null,null,null,null,null,null,null,null,188,{"$error":"#N/A"},"","","","","",{"$error":"#N/A"}]
[null,null,"",null,null,null,null,null,null,null,null,null,null,null,null,null,null,null,null,null,null,null,null,null,null,null,null,null,null,189,104,19.100000000000001,23,16,17.692074636801557,20.050233055506126,16.512995427449269,21.229312264858414,15.333916218096984,22.408391474210699,18.871153846153842,null,0,0,null,null,null,null,null,null,null,null,null,null,189,{"$error":"#N/A"},"","","","","",{"$error":"#N/A"}]
[null,null,"",null,null,null,null,null,null,null,null,null,null,null,null,null,null,null,null,null,null,null,null,null,null,null,null,null,null,190,104,19.100000000000001,23,16,17.692074636801557,20.050233055506126,16.512995427449269,21.229312264858414,15.333916218096984,22.408391474210699,18.871153846153842,null,0,0,null,null,null,null,null,null,null,null,null,null,190,{"$error":"#N/A"},"","","","","",{"$error":"#N/A"}]
[null,null,"",null,null,null,null,null,null,null,null,null,null,null,null,null,null,null,null,null,null,null,null,null,null,null,null,null,null,191,104,19.100000000000001,23,16,17.692074636801557,20.050233055506126,16.512995427449269,21.229312264858414,15.333916218096984,22.408391474210699,18.871153846153842,null,0,0,null,null,null,null,null,null,null,null,null,null,191,{"$error":"#N/A"},"","","","","",{"$error":"#N/A"}]
[null,null,"",null,null,null,null,null,null,null,null,null,null,null,null,null,null,null,null,null,null,null,null,null,null,null,null,null,null,192,104,19.100000000000001,23,16,17.692074636801557,20.050233055506126,16.512995427449269,21.229312264858414,15.333916218096984,22.408391474210699,18.871153846153842,null,0,0,null,null,null,null,null,null,null,null,null,null,192,{"$error":"#N/A"},"","","","","",{"$error":"#N/A"}]
[null,null,"",null,null,null,null,null,null,null,null,null,null,null,null,null,null,null,null,null,null,null,null,null,null,null,null,null,null,193,{"$f":"IF((Anzahl>AD197),AD197,Anzahl)","v":104},19.100000000000001,{"$f":"IF(C197<>\"\",OGW,AG196)","v":23},{"$f":"IF(C197<>\"\",UGW,AH196)","v":16},17.692074636801557,20.050233055506126,16.512995427449269,21.229312264858414,15.333916218096984,22.408391474210699,18.871153846153842,null,{"$f":"IF(AND(C197<>\"\",C197<UGW),1,0)","v":0},{"$f":"IF(AND(C197<>\"\",C197>OGW),1,0)","v":0},null,null,null,null,null,null,null,null,null,null,193,{"$f":"IF(C197=\"\",NA(),SMALL(xi,BE197))","v":{"$error":"#N/A"}},"",{"$f":"IF(C197=\"\",\"\",NORMSDIST((BD197-fxds)/Standardabweichung))","v":""},{"$f":"IF(C197=\"\",\"\",1-BF197)","v":""},{"$f":"IF(C197=\"\",\"\",SMALL(BG,BE197))","v":""},{"$f":"IF(C197=\"\",\"\",(2*BE197-1)*(LN(BH197)+LN(BF197)))","v":""},{"$f":"IF(C197=\"\",NA(),NORMSINV((BE197-0.3)/(Anzahl+0.4)))","v":{"$error":"#N/A"}}]
[null,null,"",null,null,null,null,null,null,null,null,null,null,null,null,null,null,null,null,null,null,null,null,null,null,null,null,null,null,194,104,19.100000000000001,23,16,{"$f":"AI197","v":17.692074636801557},20.050233055506126,16.512995427449269,21.229312264858414,15.333916218096984,22.408391474210699,18.871153846153842,null,0,0,null,null,null,null,null,null,null,null,null,null,194,{"$error":"#N/A"},{"$f":"IF(C198=\"\",\"\",1+BE197)","v":""},"","","","",{"$error":"#N/A"}]
[null,null,"",null,null,null,null,null,null,null,null,null,null,null,null,null,null,null,null,null,null,null,null,null,null,null,null,null,null,195,104,19.100000000000001,23,16,17.692074636801557,20.050233055506126,16.512995427449269,21.229312264858414,15.333916218096984,22.408391474210699,18.871153846153842,null,0,0,null,null,null,null,null,null,null,null,null,null,195,{"$error":"#N/A"},"","","","","",{"$error":"#N/A"}]
[null,null,"",null,null,null,null,null,null,null,null,null,null,null,null,null,null,null,null,null,null,null,null,null,null,null,null,null,null,196,104,{"$f":"IF(C200<>\"\",C200,AF199)","v":19.100000000000001},23,16,17.692074636801557,20.050233055506126,16.512995427449269,21.229312264858414,15.333916218096984,22.408391474210699,18.871153846153842,null,0,0,null,null,null,null,null,null,null,null,null,null,196,{"$error":"#N/A"},"","","","","",{"$error":"#N/A"}]
[null,null,"",null,null,null,null,null,null,null,null,null,null,null,null,null,null,null,null,null,null,null,null,null,null,null,null,null,null,197,104,{"$f":"IF(C201<>\"\",C201,AF200)","v":19.100000000000001},23,16,17.692074636801557,20.050233055506126,16.512995427449269,21.229312264858414,15.333916218096984,22.408391474210699,18.871153846153842,null,0,0,null,null,null,null,null,null,null,null,null,null,197,{"$error":"#N/A"},"","","","","",{"$error":"#N/A"}]
[null,null,"",null,null,null,null,null,null,null,null,null,null,null,null,null,null,null,null,null,null,null,null,null,null,null,null,null,null,198,104,{"$f":"IF(C202<>\"\",C202,AF201)","v":19.100000000000001},23,16,17.692074636801557,20.050233055506126,16.512995427449269,21.229312264858414,15.333916218096984,22.408391474210699,18.871153846153842,null,0,0,null,null,null,null,null,null,null,null,null,null,198,{"$error":"#N/A"},"","","","","",{"$error":"#N/A"}]
[null,null,"",null,null,null,null,null,null,null,null,null,null,null,null,null,null,null,null,null,null,null,null,null,null,null,null,null,null,199,104,{"$f":"IF(C203<>\"\",C203,AF202)","v":19.100000000000001},23,16,17.692074636801557,20.050233055506126,16.512995427449269,21.229312264858414,15.333916218096984,22.408391474210699,18.871153846153842,null,0,0,null,null,null,null,null,null,null,null,null,null,199,{"$error":"#N/A"},"","","","","",{"$error":"#N/A"}]
[null,null,"",null,null,null,null,null,null,null,null,null,null,null,null,null,null,null,null,null,null,null,null,null,null,null,null,null,null,200,104,{"$f":"IF(C204<>\"\",C204,AF203)","v":19.100000000000001},23,16,17.692074636801557,20.050233055506126,16.512995427449269,21.229312264858414,15.333916218096984,22.408391474210699,18.871153846153842,null,0,0,null,null,null,null,null,null,null,null,null,null,200,{"$error":"#N/A"},"","","","","",{"$error":"#N/A"}]
[null,null,null,null,null,null,null,null,null,null,null,null,null,null,null,null,null,null,null,null,null,null,null,null,null,null,null,null,null,null,null,null,null,null,null,null,null,null,null,null,null,"Summe",{"$f":"SUM(AQ5:AQ204)","v":0},{"$f":"SUM(AR5:AR204)","v":0}]

{"sheet":"Info","index":3,"n_rows":18,"n_cols":3,"rows_kept":18,"cut":false,"hidden":false,"merged":[[16,1,16,2],[17,1,17,2]]}
[]
[null,"Sie benutzen eine Vorlage von www.sixsigmblackbelt.de","You are using a template from www.sixsigmblackbelt.de"]
[]
[null,"Diese Version hat einige Einschränkungen","This version has some limitations"]
[null,{"$f":"\"- einige Zellen können nicht verändert werden\"","v":"- einige Zellen können nicht verändert werden"},{"$f":"\"- some cells cannot be changed\"","v":"- some cells cannot be changed"}]
[null,{"$f":"\"- Sie können die Berechnungen nicht einsehen oder verändern\"","v":"- Sie können die Berechnungen nicht einsehen oder verändern"},{"$f":"\"- You can't see or change the calculations\"","v":"- You can't see or change the calculations"}]
[null,{"$f":"\"- Wasserzeichen auf dem Tabellenblatt\"","v":"- Wasserzeichen auf dem Tabellenblatt"},{"$f":"\"- watermark on the spreadsheet\"","v":"- watermark on the spreadsheet"}]
[null,{"$f":"\"- Sie müssen die Datei mit der Endung .xlsm speichern, ansonsten gehen Funktionalitäten verloren\"","v":"- Sie müssen die Datei mit der Endung .xlsm speichern, ansonsten gehen Funktionalitäten verloren"},{"$f":"\"- You have to save the file with the extension .xlsm, otherwise all functions will be lost\"","v":"- You have to save the file with the extension .xlsm, otherwise all functions will be lost"}]
[]
[null,"Benötigen Sie die Vorlage ","Do you need the template? "]
[null,{"$f":"\"- ohne die Einschränkungen\"","v":"- ohne die Einschränkungen"},{"$f":"\"- without the limitations\"","v":"- without the limitations"}]
[null,{"$f":"\"- mit zusätzlichen Funktionen\"","v":"- mit zusätzlichen Funktionen"},{"$f":"\"- with additional functions\"","v":"- with additional functions"}]
[null,{"$f":"\"- mit Ihrem Firmenlogo\"","v":"- mit Ihrem Firmenlogo"},{"$f":"\"- with your company logo\"","v":"- with your company logo"}]
[null,{"$f":"\"- etc\"","v":"- etc"},{"$f":"\"- etc\"","v":"- etc"}]
[]
[null,"wenden Sie sich bitte per Mail an ","please contact via e - mail"]
[null,"https://www.sixsigmablackbelt.de"]
[null,"roland.schnurr@sixsigmablackbelt.de"]

{"sheet":"translation","index":4,"n_rows":6,"n_cols":54,"rows_kept":6,"cut":false,"hidden":true,"merged":[]}
[null,1,{"$f":"VLOOKUP($B$1,$B$3:$AB$6,2,FALSE)","v":"Prozess- und Maschinenfähigkeit"},{"$f":"VLOOKUP($B$1,$B$3:$AB$6,3,FALSE)","v":"Werte können geändert werden"},{"$f":"VLOOKUP($B$1,$B$3:$AB$6,4,FALSE)","v":"Werte werden berechnet (Blatt Berechnung)"},{"$f":"VLOOKUP($B$1,$B$3:$AB$6,5,FALSE)","v":"Artikel:"},{"$f":"VLOOKUP($B$1,$B$3:$AB$6,6,FALSE)","v":"Nummer:"},{"$f":"VLOOKUP($B$1,$B$3:$AB$6,7,FALSE)","v":"Zeichnung:"},{"$f":"VLOOKUP($B$1,$B$3:$AB$6,8,FALSE)","v":"Prüfer:"},{"$f":"VLOOKUP($B$1,$B$3:$AB$6,9,FALSE)","v":"Messmittel:"},{"$f":"VLOOKUP($B$1,$B$3:$AB$6,10,FALSE)","v":"Datum:"},{"$f":"VLOOKUP($B$1,$B$3:$AB$6,11,FALSE)","v":"Merkmal:"},{"$f":"VLOOKUP($B$1,$B$3:$AB$6,12,FALSE)","v":"Maßeinheit:"},{"$f":"VLOOKUP($B$1,$B$3:$AB$6,13,FALSE)","v":"Sollwert msoll ="},{"$f":"VLOOKUP($B$1,$B$3:$AB$6,14,FALSE)","v":"Unterer Grenzwert UGW ="},{"$f":"VLOOKUP($B$1,$B$3:$AB$6,15,FALSE)","v":"Oberer Grenzwert OGW ="},{"$f":"VLOOKUP($B$1,$B$3:$AB$6,16,FALSE)","v":"Anzahl Klassen Histogramm ="},{"$f":"VLOOKUP($B$1,$B$3:$AB$6,17,FALSE)","v":"Cpk<"},{"$f":"VLOOKUP($B$1,$B$3:$AB$6,18,FALSE)","v":"Cpk"},{"$f":"VLOOKUP($B$1,$B$3:$AB$6,19,FALSE)","v":"Cpk>"},{"$f":"VLOOKUP($B$1,$B$3:$AB$6,20,FALSE)","v":"dazwischen"},{"$f":"VLOOKUP($B$1,$B$3:$AB$16,21,FALSE)","v":"Prozess nicht fähig"},{"$f":"VLOOKUP($B$1,$B$3:$AB$6,22,FALSE)","v":"Prozess bedingt fähig"},{"$f":"VLOOKUP($B$1,$B$3:$AB$6,23,FALSE)","v":"Prozess fähig"},{"$f":"VLOOKUP($B$1,$B$3:$AB$6,24,FALSE)","v":"Stichprobenumfang"},{"$f":"VLOOKUP($B$1,$B$3:$AB$6,25,FALSE)","v":"Mittelwert"},{"$f":"VLOOKUP($B$1,$B$3:$AB$6,26,FALSE)","v":"Standardabweichung"},{"$f":"VLOOKUP($B$1,$B$3:$AH$6,27,FALSE)","v":"Die Werte sind nach Andersson Darling Test"},{"$f":"VLOOKUP($B$1,$B$3:$AH$6,28,FALSE)","v":"normalverteilt"},{"$f":"VLOOKUP($B$1,$B$3:$AH$6,29,FALSE)","v":"nicht normalverteilt"},{"$f":"VLOOKUP($B$1,$B$3:$AH$6,30,FALSE)","v":0},{"$f":"VLOOKUP($B$1,$B$3:$AQ$6,31,FALSE)","v":"OGW"},{"$f":"VLOOKUP($B$1,$B$3:$AH$6,32,FALSE)","v":"UGW"},{"$f":"VLOOKUP($B$1,$B$3:$AH$6,33,FALSE)","v":"Stichprobe chronologisch"},{"$f":"VLOOKUP($B$1,$B$3:$AJ$6,34,FALSE)","v":"Histogramm"},{"$f":"VLOOKUP($B$1,$B$3:$AK$6,35,FALSE)","v":"Wahrscheinlichkeitsnetz"},{"$f":"VLOOKUP($B$1,$B$3:$AK$6,35,FALSE)","v":"Wahrscheinlichkeitsnetz"},{"$f":"VLOOKUP($B$1,$B$3:$AO$6,37,FALSE)","v":"Cmu"},{"$f":"VLOOKUP($B$1,$B$3:$AP$6,38,FALSE)","v":"Cmo"},{"$f":"VLOOKUP($B$1,$B$3:$BB$6,39,FALSE)","v":"Cm"},{"$f":"VLOOKUP($B$1,$B$3:$BB$6,40,FALSE)","v":"Cmk"},{"$f":"VLOOKUP($B$1,$B$3:$BB$6,41,FALSE)","v":"Fähigkeits- kennwerte"},{"$f":"VLOOKUP($B$1,$B$3:$BB$6,42,FALSE)","v":"Bewertung cmk =>"},{"$f":"VLOOKUP($B$1,$B$3:$BB$6,43,FALSE)","v":"Median z"},{"$f":"VLOOKUP($B$1,$B$3:$BB$6,44,FALSE)","v":"Spannweite R"},{"$f":"VLOOKUP($B$1,$B$3:$BB$6,45,FALSE)","v":"Minimum"},{"$f":"VLOOKUP($B$1,$B$3:$BB$6,46,FALSE)","v":"Maximum"},{"$f":"VLOOKUP($B$1,$B$3:$BB$6,47,FALSE)","v":"Berechnete Leistung in ppm"},{"$f":"VLOOKUP($B$1,$B$3:$BB$6,48,FALSE)","v":"Über- schreitungs- anteil"},{"$f":"VLOOKUP($B$1,$B$3:$BB$6,49,FALSE)","v":"pUGW"},{"$f":"VLOOKUP($B$1,$B$3:$BB$6,50,FALSE)","v":"pOGW"},{"$f":"VLOOKUP($B$1,$B$3:$BB$6,51,FALSE)","v":"p"},{"$f":"VLOOKUP($B$1,$B$3:$BB$6,52,FALSE)","v":"Beobachtete Leistung in ppm"},{"$f":"VLOOKUP($B$1,$B$3:$BB$6,53,FALSE)","v":0}]
["Sprache","Beschreibung"]
[null,"Zelle","O2","O4","O5","N7","N8","N9","N10","N11","N12","N13","N14","N15","N16","N17","N18","N19","N20","N21","O20","P19","P20","P21","N23","N24","N25","N26","P26","P26",null,"Diagramm","Diagramm","Diagramm","Diagramm","Diagramm",null,"O30","O31","O32","O33","N30","N34","N36","N37","N38","N39","N41","N42","O42","O43","O44","N46"]
["deutsch",1,"Prozess- und Maschinenfähigkeit","Werte können geändert werden","Werte werden berechnet (Blatt Berechnung)","Artikel:","Nummer:","Zeichnung:","Prüfer:","Messmittel:","Datum:","Merkmal:","Maßeinheit:","Sollwert msoll =","Unterer Grenzwert UGW =","Oberer Grenzwert OGW =","Anzahl Klassen Histogramm =","Cpk<","Cpk","Cpk>","dazwischen","Prozess nicht fähig","Prozess bedingt fähig","Prozess fähig","Stichprobenumfang","Mittelwert","Standardabweichung","Die Werte sind nach Andersson Darling Test","normalverteilt","nicht normalverteilt",null,"OGW","UGW","Stichprobe chronologisch","Histogramm","Wahrscheinlichkeitsnetz",null,"Cmu","Cmo","Cm","Cmk","Fähigkeits- kennwerte",{"$f":"\"Bewertung cmk =>\"","v":"Bewertung cmk =>"},"Median z","Spannweite R","Minimum","Maximum","Berechnete Leistung in ppm","Über- schreitungs- anteil","pUGW","pOGW","p","Beobachtete Leistung in ppm"]
["english",2,"process and machine capability","value could be changed","value is calculated","part:","part number:","drawing:","inspector:","measuring device:","date:","attribute:","measuring unit:","nominal value =","lower spec. limit LSL =","upper specifications limit LSL =","number of classes histogram =","Cpk<","Cpk","Cpk>","between","process not capable","process limited capable","process capable","sample size","mid","standard deviation s","values are according Andersson Darling test","normal distributed","not normal distributed",null,"USL","LSL","random sample chronological","histogram","probability plot",null,"Cpkl","Cpku","Cp","Cpk","probability values","evaluation Cmk =>","median","range","minimum","maximum","calculated performance","exceedance","pLSL","pUSL","p","observed performance in ppm"]
["Italiano",3,"Capacità di processo e macchina","Valore modificabile","Valore calcolato","Articolo:","Codice:","Disegno","Ispettore","Strumento","Data","Attributo:","Unità di misura","Valore nominale =","Limite inferiore di specifica LSM","Limite superiore di specifica LSS","Numero di classi dell'istogramma","Cpk<","Cpk","Cpk>","tra","Processo non capace","Processo capace in modo limitatato","Processo capace","Dimensione del campione","media","Deviazione standard s","Valori in accorso al test Andersson Darling ","Distribuzione normale","Distribuzione non normale",null,"USL","LSL","Campione casuale cronologico","Istogramma","Grafico delle probabilità",null,"Cpkl","Cpku","Cp","Cpk","Valori di probabilità","Vautazione Cmk =>","Media","Range","Minimo","Massimo","Performance calcolata","Eccedenza","pLSL","pUSL","p","Prestazione osservata in ppm"]